module github.com/crowdsecurity/cs-custom-bouncer

go 1.19

require (
	github.com/coreos/go-systemd v0.0.0-20191104093116-d3cd4ed1dbcf
	github.com/crowdsecurity/crowdsec v1.4.1
	github.com/crowdsecurity/go-cs-bouncer v0.0.2
	github.com/go-openapi/swag v0.22.3 // indirect
	github.com/prometheus/client_golang v1.14.0
	github.com/sirupsen/logrus v1.9.0
	golang.org/x/net v0.4.0 // indirect
	golang.org/x/sys v0.3.0 // indirect
	gopkg.in/natefinch/lumberjack.v2 v2.0.0
	gopkg.in/tomb.v2 v2.0.0-20161208151619-d5d1b5820637
	gopkg.in/yaml.v2 v2.4.0
)

require (
	github.com/antonmedv/expr v1.9.0 // indirect
	github.com/asaskevich/govalidator v0.0.0-20210307081110-f21760c49a8d // indirect
	github.com/beorn7/perks v1.0.1 // indirect
	github.com/cespare/xxhash/v2 v2.2.0 // indirect
	github.com/crowdsecurity/grokky v0.1.0 // indirect
	github.com/go-openapi/analysis v0.21.4 // indirect
	github.com/go-openapi/errors v0.20.3 // indirect
	github.com/go-openapi/jsonpointer v0.19.5 // indirect
	github.com/go-openapi/jsonreference v0.20.0 // indirect
	github.com/go-openapi/loads v0.21.2 // indirect
	github.com/go-openapi/spec v0.20.7 // indirect
	github.com/go-openapi/strfmt v0.21.3 // indirect
	github.com/go-openapi/validate v0.22.0 // indirect
	github.com/golang/protobuf v1.5.2 // indirect
	github.com/google/go-querystring v1.1.0 // indirect
	github.com/hashicorp/go-version v1.6.0 // indirect
	github.com/josharian/intern v1.0.0 // indirect
	github.com/mailru/easyjson v0.7.7 // indirect
	github.com/matttproud/golang_protobuf_extensions v1.0.4 // indirect
	github.com/mitchellh/mapstructure v1.5.0 // indirect
	github.com/oklog/ulid v1.3.1 // indirect
	github.com/pkg/errors v0.9.1 // indirect
	github.com/prometheus/client_model v0.3.0 // indirect
	github.com/prometheus/common v0.38.0 // indirect
	github.com/prometheus/procfs v0.8.0 // indirect
	go.mongodb.org/mongo-driver v1.11.1 // indirect
	google.golang.org/protobuf v1.28.1 // indirect
	gopkg.in/yaml.v3 v3.0.1 // indirect
)
