module github.com/crowdsecurity/cs-firewall-bouncer

go 1.19

require (
	github.com/coreos/go-systemd v0.0.0-20191104093116-d3cd4ed1dbcf
	github.com/crowdsecurity/crowdsec v1.4.1
	github.com/crowdsecurity/go-cs-bouncer v0.0.2-0.20221213104739-135edd169942
	github.com/google/nftables v0.0.0-20220808154552-2eca00135732
	github.com/prometheus/client_golang v1.13.0
	github.com/sirupsen/logrus v1.9.0
	golang.org/x/sys v0.0.0-20220913175220-63ea55921009
	gopkg.in/natefinch/lumberjack.v2 v2.0.0
	gopkg.in/tomb.v2 v2.0.0-20161208151619-d5d1b5820637
	gopkg.in/yaml.v2 v2.4.0
)

require (
	github.com/antonmedv/expr v1.9.0 // indirect
	github.com/asaskevich/govalidator v0.0.0-20210307081110-f21760c49a8d // indirect
	github.com/beorn7/perks v1.0.1 // indirect
	github.com/cespare/xxhash/v2 v2.1.2 // indirect
	github.com/crowdsecurity/grokky v0.1.0 // indirect
	github.com/go-openapi/analysis v0.21.4 // indirect
	github.com/go-openapi/errors v0.20.3 // indirect
	github.com/go-openapi/jsonpointer v0.19.5 // indirect
	github.com/go-openapi/jsonreference v0.20.0 // indirect
	github.com/go-openapi/loads v0.21.2 // indirect
	github.com/go-openapi/spec v0.20.7 // indirect
	github.com/go-openapi/strfmt v0.21.3 // indirect
	github.com/go-openapi/swag v0.22.3 // indirect
	github.com/go-openapi/validate v0.22.0 // indirect
	github.com/golang/protobuf v1.5.2 // indirect
	github.com/google/go-cmp v0.5.9 // indirect
	github.com/google/go-querystring v1.1.0 // indirect
	github.com/hashicorp/go-version v1.6.0 // indirect
	github.com/josharian/intern v1.0.0 // indirect
	github.com/josharian/native v1.0.0 // indirect
	github.com/mailru/easyjson v0.7.7 // indirect
	github.com/matttproud/golang_protobuf_extensions v1.0.2-0.20181231171920-c182affec369 // indirect
	github.com/mdlayher/netlink v1.6.0 // indirect
	github.com/mdlayher/socket v0.2.3 // indirect
	github.com/mitchellh/mapstructure v1.5.0 // indirect
	github.com/oklog/ulid v1.3.1 // indirect
	github.com/pkg/errors v0.9.1 // indirect
	github.com/prometheus/client_model v0.2.0 // indirect
	github.com/prometheus/common v0.37.0 // indirect
	github.com/prometheus/procfs v0.8.0 // indirect
	go.mongodb.org/mongo-driver v1.10.2 // indirect
	golang.org/x/net v0.0.0-20220909164309-bea034e7d591 // indirect
	golang.org/x/sync v0.0.0-20220907140024-f12130a52804 // indirect
	google.golang.org/protobuf v1.28.1 // indirect
	gopkg.in/yaml.v3 v3.0.1 // indirect
)

exclude github.com/mattn/go-sqlite3 v2.0.3+incompatible

exclude github.com/mattn/go-sqlite3 v2.0.1+incompatible

replace github.com/koneu/natend => ./koneu/natend
