module github.com/skanehira/docui

require (
	github.com/Azure/go-ansiterm v0.0.0-20170929234023-d6e3b3328b78 // indirect
	github.com/DATA-DOG/go-sqlmock v1.3.3 // indirect
	github.com/Microsoft/go-winio v0.4.11 // indirect
	github.com/Nvveen/Gotty v0.0.0-20120604004816-cd527374f1e5 // indirect
	github.com/docker/distribution v2.7.1+incompatible // indirect
	github.com/docker/docker v0.7.3-0.20190111153827-295413c9d0e1
	github.com/docker/go-connections v0.4.0
	github.com/docker/go-units v0.3.3 // indirect
	github.com/gdamore/tcell v1.1.1
	github.com/gogo/protobuf v1.2.0 // indirect
	github.com/google/go-cmp v0.2.0 // indirect
	github.com/gorilla/mux v1.7.0 // indirect
	github.com/jroimartin/gocui v0.4.0
	github.com/konsorten/go-windows-terminal-sequences v1.0.2 // indirect
	github.com/lucasb-eyer/go-colorful v1.0.1 // indirect
	github.com/micmonay/keybd_event v0.0.0-20190804163414-202c5b2c8150
	github.com/mitchellh/go-homedir v1.1.0
	github.com/nsf/termbox-go v0.0.0-20190121233118-02980233997d // indirect
	github.com/opencontainers/go-digest v1.0.0-rc1 // indirect
	github.com/opencontainers/image-spec v1.0.1 // indirect
	github.com/pkg/errors v0.8.1 // indirect
	github.com/rivo/tview v0.0.0-20190324182152-8a9e26fab0ff
	github.com/rivo/uniseg v0.0.0-20190313204849-f699dde9c340 // indirect
	github.com/sirupsen/logrus v1.4.1
	github.com/stretchr/testify v1.3.0 // indirect
	golang.org/x/net v0.0.0-20190424112056-4829fb13d2c6 // indirect
	golang.org/x/sync v0.0.0-20190423024810-112230192c58 // indirect
	golang.org/x/sys v0.0.0-20190428183149-804c0c7841b5 // indirect
	golang.org/x/text v0.3.2 // indirect
	golang.org/x/time v0.0.0-20181108054448-85acf8d2951c // indirect
	google.golang.org/grpc v1.18.0 // indirect
	gotest.tools v2.2.0+incompatible // indirect
)
