module github.com/dundee/gdu/v5

go 1.18

require (
	github.com/fatih/color v1.15.0
	github.com/gdamore/tcell/v2 v2.6.0
	github.com/maruel/natural v1.1.0
	github.com/mattn/go-isatty v0.0.19
	github.com/pbnjay/memory v0.0.0-20210728143218-7b4eea64cf58
	github.com/rivo/tview v0.0.0-20230530133550-8bd761dda819
	github.com/sirupsen/logrus v1.9.2
	github.com/spf13/cobra v1.7.0
	github.com/stretchr/testify v1.8.4
	golang.org/x/sys v0.8.0
	gopkg.in/yaml.v3 v3.0.1
)

require (
	github.com/davecgh/go-spew v1.1.1 // indirect
	github.com/gdamore/encoding v1.0.0 // indirect
	github.com/inconshreveable/mousetrap v1.1.0 // indirect
	github.com/kr/pretty v0.3.0 // indirect
	github.com/lucasb-eyer/go-colorful v1.2.0 // indirect
	github.com/mattn/go-colorable v0.1.13 // indirect
	github.com/mattn/go-runewidth v0.0.14 // indirect
	github.com/pmezard/go-difflib v1.0.0 // indirect
	github.com/rivo/uniseg v0.4.4 // indirect
	github.com/spf13/pflag v1.0.5 // indirect
	golang.org/x/term v0.8.0 // indirect
	golang.org/x/text v0.9.0 // indirect
	gopkg.in/check.v1 v1.0.0-20190902080502-41f04d3bba15 // indirect
)
