module connectrpc.com/connect/internal/conformance

go 1.19

require connectrpc.com/conformance v1.0.0-rc1

require (
	buf.build/gen/go/bufbuild/protovalidate/protocolbuffers/go v1.31.0-20230914171853-63dfe56cc2c4.1 // indirect
	connectrpc.com/connect v1.11.1 // indirect
	github.com/andybalholm/brotli v1.0.6 // indirect
	github.com/antlr/antlr4/runtime/Go/antlr/v4 v4.0.0-20230512164433-5d1fd1a340c9 // indirect
	github.com/bufbuild/protovalidate-go v0.3.2 // indirect
	github.com/bufbuild/protoyaml-go v0.1.4 // indirect
	github.com/go-task/slim-sprig v0.0.0-20230315185526-52ccab3ef572 // indirect
	github.com/golang/protobuf v1.5.3 // indirect
	github.com/golang/snappy v0.0.4 // indirect
	github.com/google/cel-go v0.18.1 // indirect
	github.com/google/go-cmp v0.5.9 // indirect
	github.com/google/pprof v0.0.0-20210407192527-94a9f03dee38 // indirect
	github.com/inconshreveable/mousetrap v1.1.0 // indirect
	github.com/klauspost/compress v1.17.2 // indirect
	github.com/onsi/ginkgo/v2 v2.9.5 // indirect
	github.com/quic-go/qpack v0.4.0 // indirect
	github.com/quic-go/qtls-go1-20 v0.4.1 // indirect
	github.com/quic-go/quic-go v0.40.0 // indirect
	github.com/rs/cors v1.10.1 // indirect
	github.com/spf13/cobra v1.7.0 // indirect
	github.com/spf13/pflag v1.0.5 // indirect
	github.com/stoewer/go-strcase v1.3.0 // indirect
	go.uber.org/mock v0.3.0 // indirect
	golang.org/x/crypto v0.17.0 // indirect
	golang.org/x/exp v0.0.0-20230905200255-921286631fa9 // indirect
	golang.org/x/mod v0.12.0 // indirect
	golang.org/x/net v0.17.0 // indirect
	golang.org/x/sys v0.15.0 // indirect
	golang.org/x/text v0.14.0 // indirect
	golang.org/x/tools v0.13.0 // indirect
	google.golang.org/genproto/googleapis/api v0.0.0-20230920204549-e6e6cdab5c13 // indirect
	google.golang.org/genproto/googleapis/rpc v0.0.0-20230920204549-e6e6cdab5c13 // indirect
	google.golang.org/grpc v1.59.0 // indirect
	google.golang.org/protobuf v1.31.0 // indirect
	gopkg.in/yaml.v3 v3.0.1 // indirect
)

replace connectrpc.com/connect => ../../
