Update changelog

3 jobs for debian/1.32.0+dfsg-1_bpo10+1 in 2 minutes (queued for 2 seconds)
latest
Status Job ID Name Coverage
  Test
failed #317505
build

00:02:00

failed #317506
check-grpc-proto-clients

00:01:55

failed #317504
test

00:01:54

 
Name Stage Failure
failed
build Test
go: finding github.com/BurntSushi/toml v0.3.1
go: finding golang.org/x/oauth2 v0.0.0-20180821212333-d2e6202438be
go: finding honnef.co/go/tools v0.0.0-20190102054323-c2f93a96b099
go: finding golang.org/x/lint v0.0.0-20181026193005-c67002cb31c3
go: gitlab.com/gitlab-org/gitaly-proto/go/gitalypb@v0.0.0-20190502201637-e6bad277e401: unknown revision e6bad277e401
go: finding golang.org/x/tools v0.0.0-20190114222345-bf090417da8b
go: error loading module requirements
make: *** [Makefile:69: /builds/go-team/packages/golang-gitaly-proto/_build/bin/protoc-gen-gitaly] Error 1
ERROR: Job failed: exit code 1
failed
check-grpc-proto-clients Test
go: gitlab.com/gitlab-org/gitaly-proto/go/gitalypb@v0.0.0-20190502201637-e6bad277e401: unknown revision e6bad277e401
go: finding github.com/BurntSushi/toml v0.3.1
go: finding golang.org/x/oauth2 v0.0.0-20180821212333-d2e6202438be
go: finding honnef.co/go/tools v0.0.0-20190102054323-c2f93a96b099
go: finding golang.org/x/lint v0.0.0-20181026193005-c67002cb31c3
go: finding golang.org/x/tools v0.0.0-20190114222345-bf090417da8b
go: error loading module requirements
make: *** [Makefile:69: /builds/go-team/packages/golang-gitaly-proto/_build/bin/protoc-gen-gitaly] Error 1
ERROR: Job failed: exit code 1
failed
test Test
go: finding github.com/BurntSushi/toml v0.3.1
go: finding golang.org/x/oauth2 v0.0.0-20180821212333-d2e6202438be
go: finding honnef.co/go/tools v0.0.0-20190102054323-c2f93a96b099
go: finding golang.org/x/lint v0.0.0-20181026193005-c67002cb31c3
go: finding golang.org/x/tools v0.0.0-20190114222345-bf090417da8b
go: gitlab.com/gitlab-org/gitaly-proto/go/gitalypb@v0.0.0-20190502201637-e6bad277e401: unknown revision e6bad277e401
go: error loading module requirements
make: *** [Makefile:82: test] Error 1
ERROR: Job failed: exit code 1