module github.com/albenik/go-serial/v2

go 1.18

require (
	github.com/creack/goselect v0.1.2
	github.com/stretchr/testify v1.7.1
	go.uber.org/multierr v1.9.0
	golang.org/x/sys v0.5.0
)

require (
	github.com/davecgh/go-spew v1.1.1 // indirect
	github.com/kr/text v0.2.0 // indirect
	github.com/pmezard/go-difflib v1.0.0 // indirect
	go.uber.org/atomic v1.10.0 // indirect
	gopkg.in/check.v1 v1.0.0-20201130134442-10cb98267c6c // indirect
	gopkg.in/yaml.v3 v3.0.1 // indirect
)
