module github.com/bsipos/thist

go 1.12

require (
	golang.org/x/crypto v0.0.0-20190605123033-f99c8df09eb5
	golang.org/x/net v0.0.0-20190603091049-60506f45cf65 // indirect
	golang.org/x/sys v0.0.0-20190602015325-4c4f7f33c9ed // indirect
	golang.org/x/text v0.3.2 // indirect
	golang.org/x/tools v0.0.0-20190606050223-4d9ae51c2468 // indirect
	gonum.org/v1/plot v0.0.0-20190515093506-e2840ee46a6b
)
