module github.com/charmbracelet/keygen

go 1.17

require (
	github.com/caarlos0/sshmarshal v0.0.0-20220308164159-9ddb9f83c6b3
	github.com/mitchellh/go-homedir v1.1.0
	golang.org/x/crypto v0.0.0-20220307211146-efcb8507fb70
)

require golang.org/x/sys v0.0.0-20210616094352-59db8d763f22 // indirect
