module github.com/cheggaaa/pb/v3

require (
	github.com/VividCortex/ewma v1.2.0
	github.com/fatih/color v1.15.0
	github.com/mattn/go-colorable v0.1.13
	github.com/mattn/go-isatty v0.0.19
	github.com/mattn/go-runewidth v0.0.15
)

require (
	github.com/rivo/uniseg v0.2.0 // indirect
	golang.org/x/sys v0.6.0 // indirect
)

go 1.17
