module github.com/farsightsec/go-nmsg

go 1.18

require (
	github.com/dnstap/golang-dnstap v0.4.0
	google.golang.org/protobuf v1.25.0
	gopkg.in/yaml.v2 v2.4.0
)

require (
	github.com/farsightsec/golang-framestream v0.3.0 // indirect
	github.com/miekg/dns v1.1.31 // indirect
	golang.org/x/crypto v0.0.0-20191011191535-87dc89f01550 // indirect
	golang.org/x/net v0.0.0-20190923162816-aa69164e4478 // indirect
	golang.org/x/sys v0.8.0 // indirect
)
