module github.com/grafana/dskit

go 1.20

require (
	github.com/alecthomas/units v0.0.0-20211218093645-b94a6e3cc137
	github.com/alicebob/miniredis v2.5.0+incompatible
	github.com/armon/go-metrics v0.3.10
	github.com/aws/aws-sdk-go v1.44.321
	github.com/cespare/xxhash v1.1.0
	github.com/cristalhq/hedgedhttp v0.9.1
	github.com/davecgh/go-spew v1.1.1
	github.com/facette/natsort v0.0.0-20181210072756-2cd4dd1e2dcb
	github.com/felixge/httpsnoop v1.0.3
	github.com/go-kit/log v0.2.1
	github.com/go-redis/redis/v8 v8.11.5
	github.com/gogo/googleapis v1.1.0
	github.com/gogo/protobuf v1.3.2
	github.com/gogo/status v1.1.0
	github.com/golang/protobuf v1.5.3
	github.com/golang/snappy v0.0.4
	github.com/gorilla/mux v1.8.0
	github.com/grafana/gomemcache v0.0.0-20231023152154-6947259a0586
	github.com/grafana/pyroscope-go/godeltaprof v0.1.6
	github.com/hashicorp/consul/api v1.15.3
	github.com/hashicorp/go-cleanhttp v0.5.2
	github.com/hashicorp/go-sockaddr v1.0.2
	github.com/hashicorp/golang-lru/v2 v2.0.5
	github.com/hashicorp/memberlist v0.3.1
	github.com/miekg/dns v1.1.50
	github.com/opentracing-contrib/go-grpc v0.0.0-20210225150812-73cb765af46e
	github.com/opentracing-contrib/go-stdlib v1.0.0
	github.com/opentracing/opentracing-go v1.2.0
	github.com/pkg/errors v0.9.1
	github.com/pmezard/go-difflib v1.0.1-0.20181226105442-5d4384ee4fb2
	github.com/prometheus/client_golang v1.15.1
	github.com/prometheus/client_model v0.4.0
	github.com/prometheus/common v0.44.0
	github.com/prometheus/exporter-toolkit v0.10.1-0.20230714054209-2f4150c63f97
	github.com/sercand/kuberesolver/v5 v5.1.1
	github.com/soheilhy/cmux v0.1.5
	github.com/stretchr/testify v1.8.1
	github.com/uber/jaeger-client-go v2.28.0+incompatible
	github.com/uber/jaeger-lib v2.2.0+incompatible
	go.etcd.io/etcd/api/v3 v3.5.0
	go.etcd.io/etcd/client/pkg/v3 v3.5.0
	go.etcd.io/etcd/client/v3 v3.5.0
	go.uber.org/atomic v1.10.0
	go.uber.org/goleak v1.2.0
	golang.org/x/exp v0.0.0-20230321023759-10a507213a29
	golang.org/x/net v0.14.0
	golang.org/x/sync v0.3.0
	golang.org/x/time v0.1.0
	google.golang.org/grpc v1.59.0
	gopkg.in/yaml.v2 v2.4.0
	gopkg.in/yaml.v3 v3.0.1
)

require (
	github.com/OneOfOne/xxhash v1.2.6 // indirect
	github.com/alicebob/gopher-json v0.0.0-20200520072559-a9ecdc9d1d3a // indirect
	github.com/beorn7/perks v1.0.1 // indirect
	github.com/cespare/xxhash/v2 v2.2.0 // indirect
	github.com/codahale/hdrhistogram v0.0.0-20161010025455-3a0bb77429bd // indirect
	github.com/coreos/go-semver v0.3.0 // indirect
	github.com/coreos/go-systemd/v22 v22.5.0 // indirect
	github.com/dgryski/go-rendezvous v0.0.0-20200823014737-9f7001d12a5f // indirect
	github.com/fatih/color v1.13.0 // indirect
	github.com/fsnotify/fsnotify v1.6.0 // indirect
	github.com/go-logfmt/logfmt v0.5.1 // indirect
	github.com/gomodule/redigo v1.8.9 // indirect
	github.com/google/btree v1.0.1 // indirect
	github.com/hashicorp/errwrap v1.0.0 // indirect
	github.com/hashicorp/go-hclog v0.14.1 // indirect
	github.com/hashicorp/go-immutable-radix v1.3.0 // indirect
	github.com/hashicorp/go-msgpack v0.5.5 // indirect
	github.com/hashicorp/go-multierror v1.1.1 // indirect
	github.com/hashicorp/go-rootcerts v1.0.2 // indirect
	github.com/hashicorp/golang-lru v0.5.4 // indirect
	github.com/hashicorp/serf v0.9.7 // indirect
	github.com/jpillora/backoff v1.0.0 // indirect
	github.com/klauspost/compress v1.17.3 // indirect
	github.com/mattn/go-colorable v0.1.12 // indirect
	github.com/mattn/go-isatty v0.0.14 // indirect
	github.com/matttproud/golang_protobuf_extensions v1.0.4 // indirect
	github.com/mitchellh/go-homedir v1.1.0 // indirect
	github.com/mitchellh/mapstructure v1.5.0 // indirect
	github.com/mwitkow/go-conntrack v0.0.0-20190716064945-2f068394615f // indirect
	github.com/onsi/gomega v1.24.0 // indirect
	github.com/prometheus/procfs v0.9.0 // indirect
	github.com/sean-/seed v0.0.0-20170313163322-e2103e2c3529 // indirect
	github.com/spaolacci/murmur3 v1.1.0 // indirect
	github.com/stretchr/objx v0.5.0 // indirect
	github.com/yuin/gopher-lua v0.0.0-20210529063254-f4c35e4016d9 // indirect
	go.uber.org/multierr v1.6.0 // indirect
	go.uber.org/zap v1.17.0 // indirect
	golang.org/x/crypto v0.12.0 // indirect
	golang.org/x/mod v0.8.0 // indirect
	golang.org/x/oauth2 v0.11.0 // indirect
	golang.org/x/sys v0.11.0 // indirect
	golang.org/x/text v0.12.0 // indirect
	golang.org/x/tools v0.6.0 // indirect
	google.golang.org/appengine v1.6.7 // indirect
	google.golang.org/genproto v0.0.0-20230822172742-b8732ec3820d // indirect
	google.golang.org/genproto/googleapis/api v0.0.0-20230822172742-b8732ec3820d // indirect
	google.golang.org/genproto/googleapis/rpc v0.0.0-20230822172742-b8732ec3820d // indirect
	google.golang.org/protobuf v1.31.0 // indirect
)

replace k8s.io/client-go v12.0.0+incompatible => k8s.io/client-go v0.21.4

// Replace memberlist with our fork which includes some fixes that haven't been
// merged upstream yet.
replace github.com/hashicorp/memberlist => github.com/grafana/memberlist v0.3.1-0.20220714140823-09ffed8adbbe
