module github.com/hashicorp/terraform-registry-address

go 1.19

require (
	github.com/google/go-cmp v0.5.9
	github.com/hashicorp/terraform-svchost v0.0.1
	golang.org/x/net v0.5.0
)

require golang.org/x/text v0.6.0 // indirect
