module github.com/k0swe/wsjtx-go/v4

go 1.15

require (
	github.com/leemcloughlin/jdn v0.0.0-20201102080031-6f88db6a6bf2
	github.com/mazznoer/csscolorparser v0.1.2
	github.com/stretchr/testify v1.7.1
)
