module github.com/lestrrat-go/strftime

go 1.21

require (
	github.com/lestrrat-go/envload v0.0.0-20180220234015-a3eb8ddeffcc
	github.com/stretchr/testify v1.8.4
)

require (
	github.com/davecgh/go-spew v1.1.1 // indirect
	github.com/pmezard/go-difflib v1.0.0 // indirect
	gopkg.in/yaml.v3 v3.0.1 // indirect
)
