module github.com/mitch000001/go-hbci

go 1.18

require (
	github.com/kr/pretty v0.2.0
	github.com/mitchellh/go-homedir v1.1.0
	github.com/pkg/errors v0.8.1
	github.com/sergi/go-diff v1.0.0
	github.com/spf13/cobra v1.3.0
	github.com/spf13/viper v1.10.1
	github.com/wildducktheories/go-csv v0.0.0-20170625071029-a843eda7bf09
	golang.org/x/crypto v0.0.0-20210817164053-32db794688a5
	golang.org/x/text v0.3.7
	gopkg.in/yaml.v3 v3.0.0-20210107192922-496545a6307b
)

require (
	github.com/fsnotify/fsnotify v1.5.1 // indirect
	github.com/hashicorp/hcl v1.0.0 // indirect
	github.com/inconshreveable/mousetrap v1.0.0 // indirect
	github.com/kr/text v0.1.0 // indirect
	github.com/magiconair/properties v1.8.5 // indirect
	github.com/mitchellh/mapstructure v1.4.3 // indirect
	github.com/pelletier/go-toml v1.9.4 // indirect
	github.com/spf13/afero v1.6.0 // indirect
	github.com/spf13/cast v1.4.1 // indirect
	github.com/spf13/jwalterweatherman v1.1.0 // indirect
	github.com/spf13/pflag v1.0.5 // indirect
	github.com/subosito/gotenv v1.2.0 // indirect
	golang.org/x/sys v0.0.0-20211210111614-af8b64212486 // indirect
	gopkg.in/ini.v1 v1.66.2 // indirect
	gopkg.in/yaml.v2 v2.4.0 // indirect
)
