module github.com/pion/dtls/v2

require (
	github.com/pion/logging v0.2.2
	github.com/pion/transport/v2 v2.0.2
	github.com/pion/udp/v2 v2.0.1
	golang.org/x/crypto v0.5.0
	golang.org/x/net v0.7.0
)

go 1.13
