module github.com/pion/srtp/v2

go 1.14

require (
	github.com/pion/logging v0.2.2
	github.com/pion/rtcp v1.2.10
	github.com/pion/rtp v1.7.13
	github.com/pion/transport/v2 v2.0.0
	github.com/stretchr/testify v1.8.1
)
