module github.com/sylabs/sif/v2

go 1.23.0

require (
	github.com/ProtonMail/go-crypto v1.1.5
	github.com/google/go-containerregistry v0.20.3
	github.com/google/uuid v1.6.0
	github.com/sebdah/goldie/v2 v2.5.5
	github.com/sigstore/sigstore v1.8.12
	github.com/spf13/cobra v1.8.1
	github.com/spf13/pflag v1.0.6
)

require (
	github.com/cloudflare/circl v1.3.7 // indirect
	github.com/go-jose/go-jose/v4 v4.0.2 // indirect
	github.com/inconshreveable/mousetrap v1.1.0 // indirect
	github.com/kr/pretty v0.2.1 // indirect
	github.com/letsencrypt/boulder v0.0.0-20240620165639-de9c06129bec // indirect
	github.com/opencontainers/go-digest v1.0.0 // indirect
	github.com/pmezard/go-difflib v1.0.0 // indirect
	github.com/secure-systems-lab/go-securesystemslib v0.9.0 // indirect
	github.com/sergi/go-diff v1.2.0 // indirect
	github.com/titanous/rocacheck v0.0.0-20171023193734-afe73141d399 // indirect
	golang.org/x/crypto v0.32.0 // indirect
	golang.org/x/sys v0.29.0 // indirect
	golang.org/x/term v0.28.0 // indirect
	google.golang.org/protobuf v1.36.3 // indirect
	gopkg.in/yaml.v3 v3.0.1 // indirect
)
