module github.com/ulule/limiter/v3

go 1.12

require (
	github.com/gin-gonic/gin v1.6.3
	github.com/go-redis/redis/v8 v8.3.3
	github.com/pkg/errors v0.9.1
	github.com/stretchr/testify v1.6.1
	github.com/valyala/fasthttp v1.16.0
)
