module github.com/onsi/gomega

go 1.22.0

toolchain go1.22.10

require (
	github.com/google/go-cmp v0.6.0
	github.com/onsi/ginkgo/v2 v2.22.1
	golang.org/x/net v0.33.0
	google.golang.org/protobuf v1.36.1
	gopkg.in/yaml.v3 v3.0.1
)

require (
	github.com/go-logr/logr v1.4.2 // indirect
	github.com/go-task/slim-sprig/v3 v3.0.0 // indirect
	github.com/google/pprof v0.0.0-20241210010833-40e02aabc2ad // indirect
	golang.org/x/sys v0.28.0 // indirect
	golang.org/x/text v0.21.0 // indirect
	golang.org/x/tools v0.28.0 // indirect
)
