module gopkg.in/macaroon-bakery.v2

require (
	github.com/frankban/quicktest v1.11.3
	github.com/go-macaroon-bakery/macaroonpb v1.0.0
	github.com/google/go-cmp v0.5.4
	github.com/juju/mgotest v1.0.1
	github.com/juju/postgrestest v1.1.0
	github.com/juju/qthttptest v0.0.1
	github.com/juju/webbrowser v0.0.0-20160309143629-54b8c57083b4
	github.com/julienschmidt/httprouter v1.2.0
	github.com/kr/text v0.2.0 // indirect
	github.com/lib/pq v1.3.0 // indirect
	github.com/rogpeppe/fastuuid v0.0.0-20150106093220-6724a57986af
	golang.org/x/crypto v0.0.0-20190404164418-38d8ce5564a5
	golang.org/x/net v0.0.0-20190404232315-eb5bcb51f2a3
	gopkg.in/errgo.v1 v1.0.1
	gopkg.in/httprequest.v1 v1.2.0
	gopkg.in/juju/environschema.v1 v1.0.0
	gopkg.in/macaroon.v2 v2.1.0
	gopkg.in/mgo.v2 v2.0.0-20180705113604-9856a29383ce
	gopkg.in/yaml.v2 v2.2.2
)

go 1.12
