// This is a generated file. Do not edit directly.

module k8s.io/client-go

go 1.22.0

require (
	github.com/gogo/protobuf v1.3.2
	github.com/golang/groupcache v0.0.0-20210331224755-41bb18bfe9da
	github.com/golang/protobuf v1.5.4
	github.com/google/gnostic-models v0.6.8
	github.com/google/go-cmp v0.6.0
	github.com/google/gofuzz v1.2.0
	github.com/google/uuid v1.6.0
	github.com/gorilla/websocket v1.5.0
	github.com/gregjones/httpcache v0.0.0-20180305231024-9cad4c3443a7
	github.com/imdario/mergo v0.3.6
	github.com/peterbourgon/diskv v2.0.1+incompatible
	github.com/spf13/pflag v1.0.5
	github.com/stretchr/testify v1.9.0
	go.uber.org/goleak v1.3.0
	golang.org/x/net v0.26.0
	golang.org/x/oauth2 v0.21.0
	golang.org/x/term v0.21.0
	golang.org/x/time v0.3.0
	google.golang.org/protobuf v1.34.2
	gopkg.in/evanphx/json-patch.v4 v4.12.0
	k8s.io/api v0.31.4
	k8s.io/apimachinery v0.31.4
	k8s.io/klog/v2 v2.130.1
	k8s.io/kube-openapi v0.0.0-20240228011516-70dd3763d340
	k8s.io/utils v0.0.0-20240711033017-18e509b52bc8
	sigs.k8s.io/json v0.0.0-20221116044647-bc3834ca7abd
	sigs.k8s.io/structured-merge-diff/v4 v4.4.1
	sigs.k8s.io/yaml v1.4.0
)

require (
	github.com/davecgh/go-spew v1.1.2-0.20180830191138-d8f796af33cc // indirect
	github.com/emicklei/go-restful/v3 v3.11.0 // indirect
	github.com/fxamacker/cbor/v2 v2.7.0 // indirect
	github.com/go-logr/logr v1.4.2 // indirect
	github.com/go-openapi/jsonpointer v0.19.6 // indirect
	github.com/go-openapi/jsonreference v0.20.2 // indirect
	github.com/go-openapi/swag v0.22.4 // indirect
	github.com/go-task/slim-sprig/v3 v3.0.0 // indirect
	github.com/google/btree v1.0.1 // indirect
	github.com/google/pprof v0.0.0-20240525223248-4bfdf5a9a2af // indirect
	github.com/josharian/intern v1.0.0 // indirect
	github.com/json-iterator/go v1.1.12 // indirect
	github.com/mailru/easyjson v0.7.7 // indirect
	github.com/moby/spdystream v0.4.0 // indirect
	github.com/modern-go/concurrent v0.0.0-20180306012644-bacd9c7ef1dd // indirect
	github.com/modern-go/reflect2 v1.0.2 // indirect
	github.com/munnerz/goautoneg v0.0.0-20191010083416-a7dc8b61c822 // indirect
	github.com/mxk/go-flowrate v0.0.0-20140419014527-cca7078d478f // indirect
	github.com/onsi/ginkgo/v2 v2.19.0 // indirect
	github.com/pkg/errors v0.9.1 // indirect
	github.com/pmezard/go-difflib v1.0.1-0.20181226105442-5d4384ee4fb2 // indirect
	github.com/x448/float16 v0.8.4 // indirect
	golang.org/x/sys v0.21.0 // indirect
	golang.org/x/text v0.16.0 // indirect
	golang.org/x/tools v0.21.1-0.20240508182429-e35e4ccd0d2d // indirect
	gopkg.in/inf.v0 v0.9.1 // indirect
	gopkg.in/yaml.v2 v2.4.0 // indirect
	gopkg.in/yaml.v3 v3.0.1 // indirect
)
