module sigs.k8s.io/release-utils

go 1.23

require (
	github.com/blang/semver/v4 v4.0.0
	github.com/common-nighthawk/go-figure v0.0.0-20210622060536-734e95fb86be
	github.com/maxbrunsfeld/counterfeiter/v6 v6.8.1
	github.com/moby/term v0.5.0
	github.com/nozzle/throttler v0.0.0-20180817012639-2ea982251481
	github.com/sirupsen/logrus v1.9.3
	github.com/spf13/cobra v1.8.1
	github.com/stretchr/testify v1.9.0
	github.com/uwu-tools/magex v0.10.0
	k8s.io/utils v0.0.0-20240502163921-fe8a2dddb1d0
)

require (
	github.com/Azure/go-ansiterm v0.0.0-20230124172434-306776ec8161 // indirect
	github.com/Masterminds/semver/v3 v3.2.1 // indirect
	github.com/andybalholm/brotli v1.1.0 // indirect
	github.com/davecgh/go-spew v1.1.1 // indirect
	github.com/dsnet/compress v0.0.2-0.20210315054119-f66993602bf5 // indirect
	github.com/golang/snappy v0.0.4 // indirect
	github.com/inconshreveable/mousetrap v1.1.0 // indirect
	github.com/klauspost/compress v1.17.8 // indirect
	github.com/klauspost/pgzip v1.2.6 // indirect
	github.com/kr/pretty v0.3.1 // indirect
	github.com/magefile/mage v1.15.0 // indirect
	github.com/mholt/archiver/v3 v3.5.1 // indirect
	github.com/nwaples/rardecode v1.1.3 // indirect
	github.com/pierrec/lz4/v4 v4.1.21 // indirect
	github.com/pmezard/go-difflib v1.0.0 // indirect
	github.com/spf13/pflag v1.0.5 // indirect
	github.com/ulikunitz/xz v0.5.12 // indirect
	github.com/xi2/xz v0.0.0-20171230120015-48954b6210f8 // indirect
	golang.org/x/mod v0.17.0 // indirect
	golang.org/x/sync v0.7.0 // indirect
	golang.org/x/sys v0.20.0 // indirect
	golang.org/x/text v0.15.0 // indirect
	golang.org/x/tools v0.21.0 // indirect
	gopkg.in/yaml.v3 v3.0.1 // indirect
)
