module go.step.sm/crypto

go 1.18

require (
	cloud.google.com/go/kms v1.8.0
	filippo.io/edwards25519 v1.0.0
	github.com/Azure/azure-sdk-for-go v68.0.0+incompatible
	github.com/Azure/go-autorest/autorest v0.11.28
	github.com/Azure/go-autorest/autorest/azure/auth v0.5.12
	github.com/Azure/go-autorest/autorest/date v0.3.0
	github.com/Masterminds/sprig/v3 v3.2.3
	github.com/ThalesIgnite/crypto11 v1.2.5
	github.com/aws/aws-sdk-go v1.44.195
	github.com/go-piv/piv-go v1.10.0
	github.com/golang/mock v1.6.0
	github.com/googleapis/gax-go/v2 v2.7.0
	github.com/pkg/errors v0.9.1
	github.com/smallstep/assert v0.0.0-20200723003110-82e2b9b3b262
	github.com/stretchr/testify v1.8.1
	golang.org/x/crypto v0.5.0
	golang.org/x/net v0.5.0
	golang.org/x/sys v0.4.0
	google.golang.org/api v0.109.0
	google.golang.org/grpc v1.52.3
	gopkg.in/square/go-jose.v2 v2.6.0
)

require (
	cloud.google.com/go/compute v1.14.0 // indirect
	cloud.google.com/go/compute/metadata v0.2.3 // indirect
	cloud.google.com/go/iam v0.8.0 // indirect
	github.com/Azure/go-autorest v14.2.0+incompatible // indirect
	github.com/Azure/go-autorest/autorest/adal v0.9.18 // indirect
	github.com/Azure/go-autorest/autorest/azure/cli v0.4.5 // indirect
	github.com/Azure/go-autorest/autorest/to v0.4.0 // indirect
	github.com/Azure/go-autorest/autorest/validation v0.3.1 // indirect
	github.com/Azure/go-autorest/logger v0.2.1 // indirect
	github.com/Azure/go-autorest/tracing v0.6.0 // indirect
	github.com/Masterminds/goutils v1.1.1 // indirect
	github.com/Masterminds/semver/v3 v3.2.0 // indirect
	github.com/davecgh/go-spew v1.1.1 // indirect
	github.com/dimchansky/utfbom v1.1.1 // indirect
	github.com/golang-jwt/jwt/v4 v4.2.0 // indirect
	github.com/golang/groupcache v0.0.0-20210331224755-41bb18bfe9da // indirect
	github.com/golang/protobuf v1.5.2 // indirect
	github.com/google/go-cmp v0.5.9 // indirect
	github.com/google/uuid v1.3.0 // indirect
	github.com/googleapis/enterprise-certificate-proxy v0.2.1 // indirect
	github.com/huandu/xstrings v1.3.3 // indirect
	github.com/imdario/mergo v0.3.12 // indirect
	github.com/jmespath/go-jmespath v0.4.0 // indirect
	github.com/miekg/pkcs11 v1.0.3 // indirect
	github.com/mitchellh/copystructure v1.2.0 // indirect
	github.com/mitchellh/go-homedir v1.1.0 // indirect
	github.com/mitchellh/reflectwalk v1.0.2 // indirect
	github.com/pmezard/go-difflib v1.0.0 // indirect
	github.com/shopspring/decimal v1.2.0 // indirect
	github.com/spf13/cast v1.4.1 // indirect
	github.com/thales-e-security/pool v0.0.2 // indirect
	go.opencensus.io v0.24.0 // indirect
	golang.org/x/oauth2 v0.0.0-20221014153046-6fdb5e3db783 // indirect
	golang.org/x/text v0.6.0 // indirect
	google.golang.org/appengine v1.6.7 // indirect
	google.golang.org/genproto v0.0.0-20221227171554-f9683d7f8bef // indirect
	google.golang.org/protobuf v1.28.1 // indirect
	gopkg.in/yaml.v2 v2.4.0 // indirect
	gopkg.in/yaml.v3 v3.0.1 // indirect
)
