module github.com/canonical/lxd

go 1.19

require (
	github.com/Rican7/retry v0.3.1
	github.com/armon/go-proxyproto v0.1.0
	github.com/canonical/candid v1.12.2
	github.com/canonical/go-dqlite v1.21.0
	github.com/checkpoint-restore/go-criu/v6 v6.3.0
	github.com/digitalocean/go-qemu v0.0.0-20230711162256-2e3d0186973e
	github.com/digitalocean/go-smbios v0.0.0-20180907143718-390a4f403a8e
	github.com/dustinkirkland/golang-petname v0.0.0-20231002161417-6a283f1aaaf2
	github.com/flosch/pongo2 v0.0.0-20200913210552-0d938eb266f3
	github.com/fvbommel/sortorder v1.1.0
	github.com/go-macaroon-bakery/macaroon-bakery/v3 v3.0.1
	github.com/google/gopacket v1.1.19
	github.com/gorilla/mux v1.8.1
	github.com/gorilla/websocket v1.5.1
	github.com/gosexy/gettext v0.0.0-20160830220431-74466a0a0c4a
	github.com/j-keck/arping v1.0.3
	github.com/jaypipes/pcidb v1.0.0
	github.com/jochenvg/go-udev v0.0.0-20171110120927-d6b62d56d37b
	github.com/juju/gomaasapi v0.0.0-20200602032615-aa561369c767
	github.com/juju/persistent-cookiejar v1.0.0
	github.com/kballard/go-shellquote v0.0.0-20180428030007-95032a82bc51
	github.com/lxc/go-lxc v0.0.0-20230926171149-ccae595aa49e
	github.com/mattn/go-colorable v0.1.13
	github.com/mattn/go-sqlite3 v1.14.18
	github.com/mdlayher/ndp v1.0.1
	github.com/mdlayher/netx v0.0.0-20230430222610-7e21880baee8
	github.com/mdlayher/vsock v1.2.1
	github.com/miekg/dns v1.1.57
	github.com/minio/minio-go/v7 v7.0.65
	github.com/mitchellh/mapstructure v1.5.0
	github.com/olekukonko/tablewriter v0.0.5
	github.com/osrg/gobgp/v3 v3.21.0
	github.com/pborman/uuid v1.2.1
	github.com/pkg/sftp v1.13.6
	github.com/pkg/xattr v0.4.9
	github.com/robfig/cron/v3 v3.0.1
	github.com/sirupsen/logrus v1.9.3
	github.com/spf13/cobra v1.8.0
	github.com/stretchr/testify v1.8.4
	github.com/syndtr/gocapability v0.0.0-20200815063812-42c35b437635
	github.com/zitadel/oidc/v2 v2.12.0
	golang.org/x/crypto v0.16.0
	golang.org/x/oauth2 v0.15.0
	golang.org/x/sync v0.5.0
	golang.org/x/sys v0.15.0
	golang.org/x/term v0.15.0
	golang.org/x/text v0.14.0
	google.golang.org/protobuf v1.31.0
	gopkg.in/juju/environschema.v1 v1.0.1
	gopkg.in/tomb.v2 v2.0.0-20161208151619-d5d1b5820637
	gopkg.in/yaml.v2 v2.4.0
	k8s.io/utils v0.0.0-20231127182322-b307cd553661
)

require (
	github.com/cpuguy83/go-md2man/v2 v2.0.3 // indirect
	github.com/davecgh/go-spew v1.1.2-0.20180830191138-d8f796af33cc // indirect
	github.com/dgryski/go-farm v0.0.0-20200201041132-a6ae2369ad13 // indirect
	github.com/digitalocean/go-libvirt v0.0.0-20221205150000-2939327a8519 // indirect
	github.com/dustin/go-humanize v1.0.1 // indirect
	github.com/eapache/channels v1.1.0 // indirect
	github.com/eapache/queue v1.1.0 // indirect
	github.com/fsnotify/fsnotify v1.7.0 // indirect
	github.com/go-macaroon-bakery/macaroonpb v1.0.0 // indirect
	github.com/golang/protobuf v1.5.3 // indirect
	github.com/google/renameio v1.0.1 // indirect
	github.com/google/uuid v1.4.0 // indirect
	github.com/gorilla/schema v1.2.1 // indirect
	github.com/gorilla/securecookie v1.1.2 // indirect
	github.com/hashicorp/hcl v1.0.0 // indirect
	github.com/inconshreveable/mousetrap v1.1.0 // indirect
	github.com/jkeiser/iter v0.0.0-20200628201005-c8aa0ae784d1 // indirect
	github.com/json-iterator/go v1.1.12 // indirect
	github.com/juju/collections v1.0.4 // indirect
	github.com/juju/errors v1.0.0 // indirect
	github.com/juju/go4 v0.0.0-20160222163258-40d72ab9641a // indirect
	github.com/juju/loggo v1.0.0 // indirect
	github.com/juju/mgo/v2 v2.0.2 // indirect
	github.com/juju/schema v1.2.0 // indirect
	github.com/juju/utils/v2 v2.0.0-20210305225158-eedbe7b6b3e2 // indirect
	github.com/juju/version v0.0.0-20210303051006-2015802527a8 // indirect
	github.com/juju/webbrowser v1.0.0 // indirect
	github.com/julienschmidt/httprouter v1.3.0 // indirect
	github.com/k-sone/critbitgo v1.4.0 // indirect
	github.com/klauspost/compress v1.17.4 // indirect
	github.com/klauspost/cpuid/v2 v2.2.6 // indirect
	github.com/kr/fs v0.1.0 // indirect
	github.com/magiconair/properties v1.8.7 // indirect
	github.com/mattn/go-isatty v0.0.20 // indirect
	github.com/mattn/go-runewidth v0.0.15 // indirect
	github.com/mdlayher/socket v0.4.1 // indirect
	github.com/minio/md5-simd v1.1.2 // indirect
	github.com/minio/sha256-simd v1.0.1 // indirect
	github.com/mitchellh/go-homedir v1.1.0 // indirect
	github.com/modern-go/concurrent v0.0.0-20180306012644-bacd9c7ef1dd // indirect
	github.com/modern-go/reflect2 v1.0.2 // indirect
	github.com/muhlemmer/gu v0.3.1 // indirect
	github.com/pelletier/go-toml/v2 v2.1.0 // indirect
	github.com/pkg/errors v0.9.1 // indirect
	github.com/pmezard/go-difflib v1.0.1-0.20181226105442-5d4384ee4fb2 // indirect
	github.com/rivo/uniseg v0.4.4 // indirect
	github.com/rogpeppe/fastuuid v1.2.0 // indirect
	github.com/rs/xid v1.5.0 // indirect
	github.com/russross/blackfriday/v2 v2.1.0 // indirect
	github.com/sagikazarmark/locafero v0.4.0 // indirect
	github.com/sagikazarmark/slog-shim v0.1.0 // indirect
	github.com/sourcegraph/conc v0.3.0 // indirect
	github.com/spf13/afero v1.11.0 // indirect
	github.com/spf13/cast v1.6.0 // indirect
	github.com/spf13/pflag v1.0.5 // indirect
	github.com/spf13/viper v1.17.0 // indirect
	github.com/subosito/gotenv v1.6.0 // indirect
	github.com/vishvananda/netlink v1.2.1-beta.2 // indirect
	github.com/vishvananda/netns v0.0.4 // indirect
	go.uber.org/atomic v1.11.0 // indirect
	go.uber.org/multierr v1.11.0 // indirect
	golang.org/x/exp v0.0.0-20231127185646-65229373498e // indirect
	golang.org/x/mod v0.14.0 // indirect
	golang.org/x/net v0.19.0 // indirect
	golang.org/x/tools v0.16.0 // indirect
	google.golang.org/appengine v1.6.8 // indirect
	google.golang.org/genproto/googleapis/rpc v0.0.0-20231127180814-3a041ad873d4 // indirect
	google.golang.org/grpc v1.59.0 // indirect
	gopkg.in/errgo.v1 v1.0.1 // indirect
	gopkg.in/httprequest.v1 v1.2.1 // indirect
	gopkg.in/ini.v1 v1.67.0 // indirect
	gopkg.in/macaroon.v2 v2.1.0 // indirect
	gopkg.in/mgo.v2 v2.0.0-20190816093944-a6b53ec6cb22 // indirect
	gopkg.in/retry.v1 v1.0.3 // indirect
	gopkg.in/square/go-jose.v2 v2.6.0 // indirect
	gopkg.in/yaml.v3 v3.0.1 // indirect
)
