module github.com/google/mtail

go 1.21.1

require (
	contrib.go.opencensus.io/exporter/jaeger v0.2.1
	github.com/golang/glog v1.2.2
	github.com/golang/groupcache v0.0.0-20210331224755-41bb18bfe9da
	github.com/google/go-cmp v0.6.0
	github.com/pkg/errors v0.9.1
	github.com/prometheus/client_golang v1.19.1
	github.com/prometheus/common v0.55.0
	go.opencensus.io v0.24.0
	golang.org/x/sys v0.24.0
)

require (
	github.com/beorn7/perks v1.0.1 // indirect
	github.com/cespare/xxhash/v2 v2.2.0 // indirect
	github.com/davecgh/go-spew v1.1.1 // indirect
	github.com/golang/protobuf v1.5.3 // indirect
	github.com/munnerz/goautoneg v0.0.0-20191010083416-a7dc8b61c822 // indirect
	github.com/prometheus/client_model v0.6.1 // indirect
	github.com/prometheus/procfs v0.15.1 // indirect
	github.com/uber/jaeger-client-go v2.25.0+incompatible // indirect
	golang.org/x/sync v0.7.0 // indirect
	google.golang.org/api v0.105.0 // indirect
	google.golang.org/genproto v0.0.0-20230410155749-daa745c078e1 // indirect
	google.golang.org/grpc v1.56.3 // indirect
	google.golang.org/protobuf v1.34.2 // indirect
)
