module github.com/maruel/panicparse/v2

go 1.13

require (
	github.com/google/go-cmp v0.5.7
	github.com/mattn/go-colorable v0.1.12
	github.com/mattn/go-isatty v0.0.14
	github.com/mgutz/ansi v0.0.0-20200706080929-d51e80ef957d
	golang.org/x/sys v0.0.0-20220408201424-a24fb2fb8a0f
)
