module github.com/nighttsarina/homeplug_exporter

go 1.21

toolchain go1.22.1

require (
	github.com/go-kit/log v0.2.1
	github.com/mdlayher/ethernet v0.0.0-20190606142754-0394541c37b7
	github.com/mdlayher/raw v0.0.0-20191009151244-50f2db8cc065
	github.com/prometheus/client_golang v1.19.0
	github.com/prometheus/common v0.51.1
	gopkg.in/alecthomas/kingpin.v2 v2.2.6
)

require (
	github.com/alecthomas/kingpin/v2 v2.4.0 // indirect
	github.com/alecthomas/template v0.0.0-20190718012654-fb15b899a751 // indirect
	github.com/alecthomas/units v0.0.0-20211218093645-b94a6e3cc137 // indirect
	github.com/beorn7/perks v1.0.1 // indirect
	github.com/cespare/xxhash/v2 v2.2.0 // indirect
	github.com/go-logfmt/logfmt v0.5.1 // indirect
	github.com/prometheus/client_model v0.6.0 // indirect
	github.com/prometheus/procfs v0.12.0 // indirect
	github.com/xhit/go-str2duration/v2 v2.1.0 // indirect
	golang.org/x/net v0.22.0 // indirect
	golang.org/x/sys v0.18.0 // indirect
	google.golang.org/protobuf v1.33.0 // indirect
)
