module github.com/prometheus/pushgateway

go 1.23

toolchain go1.23.0

require (
	github.com/alecthomas/kingpin/v2 v2.4.0
	github.com/golang/protobuf v1.5.4
	github.com/golang/snappy v0.0.4
	github.com/prometheus/client_golang v1.20.5
	github.com/prometheus/client_model v0.6.1
	github.com/prometheus/common v0.61.0
	github.com/prometheus/exporter-toolkit v0.13.2
	github.com/shurcooL/vfsgen v0.0.0-20230704071429-0000e147ea92
	google.golang.org/protobuf v1.36.2
)

require (
	github.com/klauspost/compress v1.17.11 // indirect
	github.com/mdlayher/socket v0.4.1 // indirect
	github.com/mdlayher/vsock v1.2.1 // indirect
	github.com/munnerz/goautoneg v0.0.0-20191010083416-a7dc8b61c822 // indirect
	golang.org/x/crypto v0.32.0 // indirect
	golang.org/x/net v0.34.0 // indirect
	golang.org/x/oauth2 v0.24.0 // indirect
)

require (
	github.com/alecthomas/units v0.0.0-20240927000941-0f3dac36c52b // indirect
	github.com/beorn7/perks v1.0.1 // indirect
	github.com/cespare/xxhash/v2 v2.3.0 // indirect
	github.com/coreos/go-systemd/v22 v22.5.0 // indirect
	github.com/jpillora/backoff v1.0.0 // indirect
	github.com/julienschmidt/httprouter v1.3.0 // indirect
	github.com/mwitkow/go-conntrack v0.0.0-20190716064945-2f068394615f // indirect
	github.com/prometheus/procfs v0.15.1 // indirect
	github.com/prometheus/prometheus v0.301.0
	github.com/shurcooL/httpfs v0.0.0-20230704072500-f1e31cf0ba5c // indirect
	github.com/xhit/go-str2duration/v2 v2.1.0 // indirect
	golang.org/x/sync v0.10.0 // indirect
	golang.org/x/sys v0.29.0 // indirect
	golang.org/x/text v0.21.0 // indirect
	gopkg.in/yaml.v2 v2.4.0 // indirect
)
