module github.com/prometheus/prometheus

go 1.16

require (
	github.com/Azure/azure-sdk-for-go v61.1.0+incompatible
	github.com/Azure/go-autorest/autorest v0.11.23
	github.com/Azure/go-autorest/autorest/adal v0.9.18
	github.com/Azure/go-autorest/autorest/to v0.4.0 // indirect
	github.com/Azure/go-autorest/autorest/validation v0.3.1 // indirect
	github.com/alecthomas/units v0.0.0-20211218093645-b94a6e3cc137
	github.com/aws/aws-sdk-go v1.42.31
	github.com/cespare/xxhash/v2 v2.1.2
	github.com/containerd/containerd v1.6.1 // indirect
	github.com/dennwc/varint v1.0.0
	github.com/dgryski/go-sip13 v0.0.0-20200911182023-62edffca9245
	github.com/digitalocean/godo v1.73.0
	github.com/docker/docker v20.10.12+incompatible
	github.com/edsrzf/mmap-go v1.1.0
	github.com/envoyproxy/go-control-plane v0.10.1
	github.com/envoyproxy/protoc-gen-validate v0.6.2
	github.com/fsnotify/fsnotify v1.5.1
	github.com/go-kit/log v0.2.0
	github.com/go-logfmt/logfmt v0.5.1
	github.com/go-openapi/strfmt v0.21.1
	github.com/go-zookeeper/zk v1.0.2
	github.com/gogo/protobuf v1.3.2
	github.com/golang/snappy v0.0.4
	github.com/google/pprof v0.0.0-20211214055906-6f57359322fd
	github.com/gophercloud/gophercloud v0.24.0
	github.com/grpc-ecosystem/grpc-gateway v1.16.0
	github.com/hashicorp/consul/api v1.12.0
	github.com/hetznercloud/hcloud-go v1.33.1
	github.com/influxdata/influxdb v1.9.5
	github.com/json-iterator/go v1.1.12
	github.com/kolo/xmlrpc v0.0.0-20201022064351-38db28db192b
	github.com/linode/linodego v1.2.1
	github.com/miekg/dns v1.1.45
	github.com/moby/term v0.0.0-20210619224110-3f7ff695adc6 // indirect
	github.com/mwitkow/go-conntrack v0.0.0-20190716064945-2f068394615f
	github.com/oklog/run v1.1.0
	github.com/oklog/ulid v1.3.1
	github.com/opentracing-contrib/go-stdlib v1.0.0
	github.com/opentracing/opentracing-go v1.2.0
	github.com/pkg/errors v0.9.1
	github.com/prometheus/alertmanager v0.23.0
	github.com/prometheus/client_golang v1.12.1
	github.com/prometheus/client_model v0.2.0
	github.com/prometheus/common v0.32.1
	github.com/prometheus/common/sigv4 v0.1.0
	github.com/prometheus/exporter-toolkit v0.7.1
	github.com/scaleway/scaleway-sdk-go v1.0.0-beta.7.0.20210223165440-c65ae3540d44
	github.com/shurcooL/httpfs v0.0.0-20190707220628-8d4bc4ba7749
	github.com/shurcooL/vfsgen v0.0.0-20200824052919-0d455de96546
	github.com/stretchr/testify v1.7.0
	github.com/uber/jaeger-client-go v2.30.0+incompatible
	github.com/uber/jaeger-lib v2.4.1+incompatible
	go.uber.org/atomic v1.9.0
	go.uber.org/goleak v1.1.12
	golang.org/x/net v0.0.0-20220105145211-5b0dc2dfae98
	golang.org/x/oauth2 v0.0.0-20211104180415-d3ed0bb246c8
	golang.org/x/sync v0.0.0-20210220032951-036812b2e83c
	golang.org/x/sys v0.0.0-20220114195835-da31bd327af9
	golang.org/x/time v0.0.0-20211116232009-f0f3c7e86c11
	golang.org/x/tools v0.1.9-0.20211209172050-90a85b2969be
	google.golang.org/api v0.64.0
	google.golang.org/genproto v0.0.0-20211223182754-3ac035c7e7cb
	google.golang.org/protobuf v1.27.1
	gopkg.in/alecthomas/kingpin.v2 v2.2.6
	gopkg.in/yaml.v2 v2.4.0
	gopkg.in/yaml.v3 v3.0.0-20210107192922-496545a6307b
	k8s.io/api v0.22.5
	k8s.io/apimachinery v0.22.5
	k8s.io/client-go v0.22.5
	k8s.io/klog v1.0.0
	k8s.io/klog/v2 v2.40.1
)

replace (
	k8s.io/klog => github.com/simonpasquier/klog-gokit v0.3.0
	k8s.io/klog/v2 => github.com/simonpasquier/klog-gokit/v3 v3.0.0
)

// Exclude linodego v1.0.0 as it is no longer published on github.
exclude github.com/linode/linodego v1.0.0

// Exclude grpc v1.30.0 because of breaking changes. See #7621.
exclude (
	github.com/grpc-ecosystem/grpc-gateway v1.14.7
	google.golang.org/api v0.30.0
)

// Exclude pre-go-mod kubernetes tags, as they are older
// than v0.x releases but are picked when we update the dependencies.
exclude (
	k8s.io/client-go v1.4.0
	k8s.io/client-go v1.4.0+incompatible
	k8s.io/client-go v1.5.0
	k8s.io/client-go v1.5.0+incompatible
	k8s.io/client-go v1.5.1
	k8s.io/client-go v1.5.1+incompatible
	k8s.io/client-go v10.0.0+incompatible
	k8s.io/client-go v11.0.0+incompatible
	k8s.io/client-go v2.0.0+incompatible
	k8s.io/client-go v2.0.0-alpha.1+incompatible
	k8s.io/client-go v3.0.0+incompatible
	k8s.io/client-go v3.0.0-beta.0+incompatible
	k8s.io/client-go v4.0.0+incompatible
	k8s.io/client-go v4.0.0-beta.0+incompatible
	k8s.io/client-go v5.0.0+incompatible
	k8s.io/client-go v5.0.1+incompatible
	k8s.io/client-go v6.0.0+incompatible
	k8s.io/client-go v7.0.0+incompatible
	k8s.io/client-go v8.0.0+incompatible
	k8s.io/client-go v9.0.0+incompatible
	k8s.io/client-go v9.0.0-invalid+incompatible
)
