module github.com/containers/skopeo

// Minimum required golang version
go 1.21.0

// Warning: Ensure the "go" and "toolchain" versions match exactly to prevent unwanted auto-updates

require (
	github.com/Masterminds/semver/v3 v3.2.1
	github.com/containers/common v0.60.2
	github.com/containers/image/v5 v5.32.2
	github.com/containers/ocicrypt v1.2.0
	github.com/containers/storage v1.55.0
	github.com/docker/distribution v2.8.3+incompatible
	github.com/opencontainers/go-digest v1.0.0
	github.com/opencontainers/image-spec v1.1.0
	github.com/opencontainers/image-tools v1.0.0-rc3
	github.com/sirupsen/logrus v1.9.3
	github.com/spf13/cobra v1.8.1
	github.com/spf13/pflag v1.0.5
	github.com/stretchr/testify v1.9.0
	github.com/syndtr/gocapability v0.0.0-20200815063812-42c35b437635
	golang.org/x/exp v0.0.0-20240719175910-8a7402abbf56
	golang.org/x/term v0.23.0
	gopkg.in/yaml.v3 v3.0.1
)

require (
	dario.cat/mergo v1.0.0 // indirect
	github.com/BurntSushi/toml v1.4.0 // indirect
	github.com/Microsoft/go-winio v0.6.2 // indirect
	github.com/Microsoft/hcsshim v0.12.5 // indirect
	github.com/VividCortex/ewma v1.2.0 // indirect
	github.com/acarl005/stripansi v0.0.0-20180116102854-5a71ef0e047d // indirect
	github.com/asaskevich/govalidator v0.0.0-20230301143203-a9d515a09cc2 // indirect
	github.com/containerd/cgroups/v3 v3.0.3 // indirect
	github.com/containerd/errdefs v0.1.0 // indirect
	github.com/containerd/stargz-snapshotter/estargz v0.15.1 // indirect
	github.com/containers/libtrust v0.0.0-20230121012942-c1716e8a8d01 // indirect
	github.com/coreos/go-oidc/v3 v3.10.0 // indirect
	github.com/cyberphone/json-canonicalization v0.0.0-20231217050601-ba74d44ecf5f // indirect
	github.com/cyphar/filepath-securejoin v0.3.1 // indirect
	github.com/davecgh/go-spew v1.1.2-0.20180830191138-d8f796af33cc // indirect
	github.com/distribution/reference v0.6.0 // indirect
	github.com/docker/docker v27.1.1+incompatible // indirect
	github.com/docker/docker-credential-helpers v0.8.2 // indirect
	github.com/docker/go-connections v0.5.0 // indirect
	github.com/docker/go-units v0.5.0 // indirect
	github.com/dsnet/compress v0.0.2-0.20210315054119-f66993602bf5 // indirect
	github.com/felixge/httpsnoop v1.0.4 // indirect
	github.com/go-jose/go-jose/v3 v3.0.3 // indirect
	github.com/go-jose/go-jose/v4 v4.0.2 // indirect
	github.com/go-logr/logr v1.4.2 // indirect
	github.com/go-logr/stdr v1.2.2 // indirect
	github.com/go-openapi/analysis v0.23.0 // indirect
	github.com/go-openapi/errors v0.22.0 // indirect
	github.com/go-openapi/jsonpointer v0.21.0 // indirect
	github.com/go-openapi/jsonreference v0.21.0 // indirect
	github.com/go-openapi/loads v0.22.0 // indirect
	github.com/go-openapi/runtime v0.28.0 // indirect
	github.com/go-openapi/spec v0.21.0 // indirect
	github.com/go-openapi/strfmt v0.23.0 // indirect
	github.com/go-openapi/swag v0.23.0 // indirect
	github.com/go-openapi/validate v0.24.0 // indirect
	github.com/gogo/protobuf v1.3.2 // indirect
	github.com/golang/groupcache v0.0.0-20210331224755-41bb18bfe9da // indirect
	github.com/golang/protobuf v1.5.4 // indirect
	github.com/google/go-containerregistry v0.20.0 // indirect
	github.com/google/go-intervals v0.0.2 // indirect
	github.com/google/uuid v1.6.0 // indirect
	github.com/gorilla/mux v1.8.1 // indirect
	github.com/hashicorp/errwrap v1.1.0 // indirect
	github.com/hashicorp/go-cleanhttp v0.5.2 // indirect
	github.com/hashicorp/go-multierror v1.1.1 // indirect
	github.com/hashicorp/go-retryablehttp v0.7.7 // indirect
	github.com/inconshreveable/mousetrap v1.1.0 // indirect
	github.com/josharian/intern v1.0.0 // indirect
	github.com/json-iterator/go v1.1.12 // indirect
	github.com/klauspost/compress v1.17.9 // indirect
	github.com/klauspost/pgzip v1.2.6 // indirect
	github.com/letsencrypt/boulder v0.0.0-20240418210053-89b07f4543e0 // indirect
	github.com/mailru/easyjson v0.7.7 // indirect
	github.com/mattn/go-runewidth v0.0.16 // indirect
	github.com/mattn/go-sqlite3 v1.14.22 // indirect
	github.com/miekg/pkcs11 v1.1.1 // indirect
	github.com/mistifyio/go-zfs/v3 v3.0.1 // indirect
	github.com/mitchellh/mapstructure v1.5.0 // indirect
	github.com/moby/docker-image-spec v1.3.1 // indirect
	github.com/moby/sys/mountinfo v0.7.2 // indirect
	github.com/moby/sys/user v0.2.0 // indirect
	github.com/modern-go/concurrent v0.0.0-20180306012644-bacd9c7ef1dd // indirect
	github.com/modern-go/reflect2 v1.0.2 // indirect
	github.com/oklog/ulid v1.3.1 // indirect
	github.com/opencontainers/runtime-spec v1.2.0 // indirect
	github.com/opencontainers/selinux v1.11.0 // indirect
	github.com/opentracing/opentracing-go v1.2.0 // indirect
	github.com/ostreedev/ostree-go v0.0.0-20210805093236-719684c64e4f // indirect
	github.com/pkg/errors v0.9.1 // indirect
	github.com/pmezard/go-difflib v1.0.1-0.20181226105442-5d4384ee4fb2 // indirect
	github.com/proglottis/gpgme v0.1.3 // indirect
	github.com/rivo/uniseg v0.4.7 // indirect
	github.com/russross/blackfriday v2.0.0+incompatible // indirect
	github.com/secure-systems-lab/go-securesystemslib v0.8.0 // indirect
	github.com/segmentio/ksuid v1.0.4 // indirect
	github.com/shurcooL/sanitized_anchor_name v1.0.0 // indirect
	github.com/sigstore/fulcio v1.4.5 // indirect
	github.com/sigstore/rekor v1.3.6 // indirect
	github.com/sigstore/sigstore v1.8.4 // indirect
	github.com/skratchdot/open-golang v0.0.0-20200116055534-eef842397966 // indirect
	github.com/stefanberger/go-pkcs11uri v0.0.0-20230803200340-78284954bff6 // indirect
	github.com/sylabs/sif/v2 v2.18.0 // indirect
	github.com/tchap/go-patricia/v2 v2.3.1 // indirect
	github.com/titanous/rocacheck v0.0.0-20171023193734-afe73141d399 // indirect
	github.com/ulikunitz/xz v0.5.12 // indirect
	github.com/vbatts/tar-split v0.11.5 // indirect
	github.com/vbauerster/mpb/v8 v8.7.5 // indirect
	github.com/xeipuuv/gojsonpointer v0.0.0-20190905194746-02993c407bfb // indirect
	github.com/xeipuuv/gojsonreference v0.0.0-20180127040603-bd5ef7bd5415 // indirect
	github.com/xeipuuv/gojsonschema v1.2.0 // indirect
	go.mongodb.org/mongo-driver v1.14.0 // indirect
	go.mozilla.org/pkcs7 v0.0.0-20210826202110-33d05740a352 // indirect
	go.opencensus.io v0.24.0 // indirect
	go.opentelemetry.io/contrib/instrumentation/net/http/otelhttp v0.49.0 // indirect
	go.opentelemetry.io/otel v1.24.0 // indirect
	go.opentelemetry.io/otel/metric v1.24.0 // indirect
	go.opentelemetry.io/otel/trace v1.24.0 // indirect
	golang.org/x/crypto v0.26.0 // indirect
	golang.org/x/mod v0.19.0 // indirect
	golang.org/x/net v0.28.0 // indirect
	golang.org/x/oauth2 v0.22.0 // indirect
	golang.org/x/sync v0.8.0 // indirect
	golang.org/x/sys v0.24.0 // indirect
	golang.org/x/text v0.17.0 // indirect
	google.golang.org/genproto/googleapis/rpc v0.0.0-20240318140521-94a12d6c2237 // indirect
	google.golang.org/grpc v1.64.1 // indirect
	google.golang.org/protobuf v1.34.1 // indirect
)
