module codeberg.org/emersion/soju

go 1.19

require (
	git.sr.ht/~emersion/go-scfg v0.0.0-20240128091534-2ae16e782082
	git.sr.ht/~emersion/go-sqlite3-fts5 v0.0.0-20240124102820-f3a72e8b79b1
	git.sr.ht/~sircmpwn/go-bare v0.0.0-20210406120253-ab86bc2846d9
	github.com/SherClockHolmes/webpush-go v1.3.0
	github.com/coder/websocket v1.8.12
	github.com/emersion/go-sasl v0.0.0-20231106173351-e73c9f7bad43
	github.com/lib/pq v1.10.9
	github.com/mattn/go-sqlite3 v1.14.22
	github.com/msteinert/pam/v2 v2.0.0
	github.com/pires/go-proxyproto v0.7.0
	github.com/prometheus/client_golang v1.19.1
	golang.org/x/crypto v0.23.0
	golang.org/x/time v0.5.0
	gopkg.in/irc.v4 v4.0.0
	modernc.org/sqlite v1.29.10
)

require (
	github.com/beorn7/perks v1.0.1 // indirect
	github.com/cespare/xxhash/v2 v2.3.0 // indirect
	github.com/dustin/go-humanize v1.0.1 // indirect
	github.com/golang-jwt/jwt v3.2.2+incompatible // indirect
	github.com/google/uuid v1.6.0 // indirect
	github.com/hashicorp/golang-lru/v2 v2.0.7 // indirect
	github.com/mattn/go-isatty v0.0.20 // indirect
	github.com/ncruces/go-strftime v0.1.9 // indirect
	github.com/prometheus/client_model v0.6.1 // indirect
	github.com/prometheus/common v0.53.0 // indirect
	github.com/prometheus/procfs v0.13.0 // indirect
	github.com/remyoudompheng/bigfft v0.0.0-20230129092748-24d4a6f8daec // indirect
	golang.org/x/sys v0.20.0 // indirect
	golang.org/x/term v0.20.0 // indirect
	google.golang.org/protobuf v1.34.1 // indirect
	modernc.org/gc/v3 v3.0.0-20240304020402-f0dba7c97c2b // indirect
	modernc.org/libc v1.50.8 // indirect
	modernc.org/mathutil v1.6.0 // indirect
	modernc.org/memory v1.8.0 // indirect
	modernc.org/strutil v1.2.0 // indirect
	modernc.org/token v1.1.0 // indirect
)
