module github.com/inexio/thola

go 1.16

require (
	github.com/dgraph-io/badger/v2 v2.2007.2
	github.com/go-redis/redis/v8 v8.4.4
	github.com/go-resty/resty/v2 v2.3.0
	github.com/go-sql-driver/mysql v1.5.0
	github.com/google/go-cmp v0.5.4
	github.com/gosnmp/gosnmp v1.30.0
	github.com/huandu/go-sqlbuilder v1.8.0
	github.com/inexio/go-monitoringplugin v1.0.0
	github.com/jmoiron/sqlx v1.2.0
	github.com/labstack/echo/v4 v4.2.0
	github.com/mitchellh/colorstring v0.0.0-20190213212951-d06e56a500db
	github.com/mitchellh/mapstructure v1.3.3
	github.com/pkg/errors v0.9.1
	github.com/rs/xid v1.2.1
	github.com/rs/zerolog v1.20.0
	github.com/schollz/progressbar/v3 v3.5.1
	github.com/shopspring/decimal v1.2.0
	github.com/spf13/cobra v1.0.0
	github.com/spf13/pflag v1.0.5
	github.com/spf13/viper v1.7.1
	github.com/stretchr/testify v1.7.0
	github.com/ulule/limiter/v3 v3.5.0
	golang.org/x/text v0.3.3
	gopkg.in/yaml.v2 v2.3.0
)
