module github.com/psanford/wormhole-william

go 1.12

require (
	github.com/cheggaaa/pb/v3 v3.0.8
	github.com/gorilla/websocket v1.4.2
	github.com/klauspost/compress v1.11.13
	github.com/mdp/qrterminal/v3 v3.0.0
	github.com/spf13/cobra v1.1.3
	golang.org/x/crypto v0.0.0-20190605123033-f99c8df09eb5
	golang.org/x/sys v0.0.0-20210415045647-66c3f260301c // indirect
	nhooyr.io/websocket v1.8.6
	salsa.debian.org/vasudev/gospake2 v0.0.0-20180813171123-adcc69dd31d5
)
