\BOOKMARK [2][-]{subsection.0.0.1}{\376\377\000P\000r\000e\000f\000a\000c\000e\000\040\000t\000o\000\040\000t\000h\000e\000\040\000F\000i\000r\000s\000t\000\040\000E\000d\000i\000t\000i\000o\000n}{}% 1
\BOOKMARK [2][-]{subsection.0.0.2}{\376\377\000P\000r\000e\000f\000a\000c\000e\000\040\000t\000o\000\040\000t\000h\000e\000\040\000S\000e\000c\000o\000n\000d\000\040\000E\000d\000i\000t\000i\000o\000n}{}% 2
\BOOKMARK [2][-]{subsection.0.0.3}{\376\377\000P\000r\000e\000f\000a\000c\000e\000\040\000t\000o\000\040\000t\000h\000e\000\040\000T\000h\000i\000r\000d\000\040\000E\000d\000i\000t\000i\000o\000n}{}% 3
\BOOKMARK [2][-]{subsection.0.0.4}{\376\377\000P\000r\000e\000f\000a\000c\000e\000\040\000t\000o\000\040\000t\000h\000e\000\040\000F\000o\000u\000r\000t\000h\000\040\000E\000d\000i\000t\000i\000o\000n}{}% 4
\BOOKMARK [2][-]{subsection.0.0.5}{\376\377\000P\000r\000e\000f\000a\000c\000e\000\040\000t\000o\000\040\000t\000h\000e\000\040\000F\000i\000f\000t\000h\000\040\000E\000d\000i\000t\000i\000o\000n}{}% 5
\BOOKMARK [2][-]{subsection.0.0.6}{\376\377\000P\000r\000e\000f\000a\000c\000e\000\040\000t\000o\000\040\000t\000h\000e\000\040\000S\000i\000x\000t\000h\000\040\000E\000d\000i\000t\000i\000o\000n}{}% 6
\BOOKMARK [2][-]{subsection.0.0.7}{\376\377\000P\000r\000e\000f\000a\000c\000e\000\040\000t\000o\000\040\000t\000h\000e\000\040\000S\000e\000v\000e\000n\000t\000h\000\040\000E\000d\000i\000t\000i\000o\000n}{}% 7
\BOOKMARK [2][-]{subsection.0.0.8}{\376\377\000P\000r\000e\000f\000a\000c\000e\000\040\000t\000o\000\040\000t\000h\000e\000\040\000E\000i\000g\000h\000t\000h\000\040\000E\000d\000i\000t\000i\000o\000n}{}% 8
\BOOKMARK [2][-]{subsection.0.0.9}{\376\377\000P\000r\000e\000f\000a\000c\000e\000\040\000t\000o\000\040\000t\000h\000e\000\040\000N\000i\000n\000t\000h\000\040\000E\000d\000i\000t\000i\000o\000n}{}% 9
\BOOKMARK [2][-]{subsection.0.0.10}{\376\377\000P\000r\000e\000f\000a\000c\000e\000\040\000t\000o\000\040\000t\000h\000e\000\040\000T\000e\000n\000t\000h\000\040\000E\000d\000i\000t\000i\000o\000n}{}% 10
\BOOKMARK [0][-]{chapter.1}{\376\377\000I\000n\000t\000r\000o\000d\000u\000c\000t\000i\000o\000n}{}% 11
\BOOKMARK [1][-]{section.1.1}{\376\377\000C\000o\000n\000f\000o\000r\000m\000a\000n\000c\000e}{chapter.1}% 12
\BOOKMARK [2][-]{subsection.1.1.1}{\376\377\000A\000N\000S\000I\000\040\000C\000o\000m\000m\000o\000n\000\040\000L\000i\000s\000p}{section.1.1}% 13
\BOOKMARK [2][-]{subsection.1.1.2}{\376\377\000C\000o\000n\000t\000e\000m\000p\000o\000r\000a\000r\000y\000\040\000C\000o\000m\000m\000o\000n\000\040\000L\000i\000s\000p}{section.1.1}% 14
\BOOKMARK [1][-]{section.1.2}{\376\377\000L\000i\000c\000e\000n\000s\000e}{chapter.1}% 15
\BOOKMARK [1][-]{section.1.3}{\376\377\000C\000o\000n\000t\000r\000i\000b\000u\000t\000o\000r\000s}{chapter.1}% 16
\BOOKMARK [0][-]{chapter.2}{\376\377\000R\000u\000n\000n\000i\000n\000g\000\040\000A\000B\000C\000L}{}% 17
\BOOKMARK [1][-]{section.2.1}{\376\377\000O\000p\000t\000i\000o\000n\000s}{chapter.2}% 18
\BOOKMARK [1][-]{section.2.2}{\376\377\000I\000n\000i\000t\000i\000a\000l\000i\000z\000a\000t\000i\000o\000n}{chapter.2}% 19
\BOOKMARK [0][-]{chapter.3}{\376\377\000I\000n\000t\000e\000r\000a\000c\000t\000i\000o\000n\000\040\000w\000i\000t\000h\000\040\000t\000h\000e\000\040\000H\000o\000s\000t\000i\000n\000g\000\040\000J\000V\000M}{}% 20
\BOOKMARK [1][-]{section.3.1}{\376\377\000L\000i\000s\000p\000\040\000t\000o\000\040\000J\000a\000v\000a}{chapter.3}% 21
\BOOKMARK [2][-]{subsection.3.1.1}{\376\377\000L\000o\000w\000-\000l\000e\000v\000e\000l\000\040\000J\000a\000v\000a\000\040\000A\000P\000I}{section.3.1}% 22
\BOOKMARK [1][-]{section.3.2}{\376\377\000J\000a\000v\000a\000\040\000t\000o\000\040\000L\000i\000s\000p}{chapter.3}% 23
\BOOKMARK [2][-]{subsection.3.2.1}{\376\377\000C\000a\000l\000l\000i\000n\000g\000\040\000L\000i\000s\000p\000\040\000f\000r\000o\000m\000\040\000J\000a\000v\000a}{section.3.2}% 24
\BOOKMARK [1][-]{section.3.3}{\376\377\000J\000a\000v\000a\000\040\000S\000c\000r\000i\000p\000t\000i\000n\000g\000\040\000A\000P\000I\000\040\000\050\000J\000S\000R\000-\0002\0002\0003\000\051}{chapter.3}% 25
\BOOKMARK [2][-]{subsection.3.3.1}{\376\377\000C\000o\000n\000v\000e\000r\000s\000i\000o\000n\000s}{section.3.3}% 26
\BOOKMARK [2][-]{subsection.3.3.2}{\376\377\000I\000m\000p\000l\000e\000m\000e\000n\000t\000e\000d\000\040\000J\000S\000R\000-\0002\0002\0003\000\040\000i\000n\000t\000e\000r\000f\000a\000c\000e\000s}{section.3.3}% 27
\BOOKMARK [2][-]{subsection.3.3.3}{\376\377\000S\000t\000a\000r\000t\000-\000u\000p\000\040\000a\000n\000d\000\040\000c\000o\000n\000f\000i\000g\000u\000r\000a\000t\000i\000o\000n\000\040\000f\000i\000l\000e}{section.3.3}% 28
\BOOKMARK [2][-]{subsection.3.3.4}{\376\377\000E\000v\000a\000l\000u\000a\000t\000i\000o\000n}{section.3.3}% 29
\BOOKMARK [2][-]{subsection.3.3.5}{\376\377\000C\000o\000m\000p\000i\000l\000a\000t\000i\000o\000n}{section.3.3}% 30
\BOOKMARK [2][-]{subsection.3.3.6}{\376\377\000I\000n\000v\000o\000c\000a\000t\000i\000o\000n\000\040\000o\000f\000\040\000f\000u\000n\000c\000t\000i\000o\000n\000s\000\040\000a\000n\000d\000\040\000m\000e\000t\000h\000o\000d\000s}{section.3.3}% 31
\BOOKMARK [2][-]{subsection.3.3.7}{\376\377\000I\000m\000p\000l\000e\000m\000e\000n\000t\000a\000t\000i\000o\000n\000\040\000o\000f\000\040\000J\000a\000v\000a\000\040\000i\000n\000t\000e\000r\000f\000a\000c\000e\000s\000\040\000i\000n\000\040\000L\000i\000s\000p}{section.3.3}% 32
\BOOKMARK [1][-]{section.3.4}{\376\377\000I\000m\000p\000l\000e\000m\000e\000n\000t\000a\000t\000i\000o\000n\000\040\000E\000x\000t\000e\000n\000s\000i\000o\000n\000\040\000D\000i\000c\000t\000i\000o\000n\000a\000r\000i\000e\000s}{chapter.3}% 33
\BOOKMARK [2][-]{subsection.3.4.1}{\376\377\000T\000h\000e\000\040\000J\000A\000V\000A\000\040\000D\000i\000c\000t\000i\000o\000n\000a\000r\000y}{section.3.4}% 34
\BOOKMARK [2][-]{subsection.3.4.2}{\376\377\000T\000h\000e\000\040\000T\000H\000R\000E\000A\000D\000S\000\040\000D\000i\000c\000t\000i\000o\000n\000a\000r\000y}{section.3.4}% 35
\BOOKMARK [2][-]{subsection.3.4.3}{\376\377\000T\000h\000e\000\040\000E\000X\000T\000E\000N\000S\000I\000O\000N\000S\000\040\000D\000i\000c\000t\000i\000o\000n\000a\000r\000y}{section.3.4}% 36
\BOOKMARK [0][-]{chapter.4}{\376\377\000B\000e\000y\000o\000n\000d\000\040\000A\000N\000S\000I}{}% 37
\BOOKMARK [1][-]{section.4.1}{\376\377\000C\000o\000m\000p\000i\000l\000e\000r\000\040\000t\000o\000\040\000J\000a\000v\000a\000\040\000V\000i\000r\000t\000u\000a\000l\000\040\000M\000a\000c\000h\000i\000n\000e\000\040\000B\000y\000t\000e\000c\000o\000d\000e}{chapter.4}% 38
\BOOKMARK [2][-]{subsection.4.1.1}{\376\377\000C\000o\000m\000p\000i\000l\000e\000r\000\040\000D\000i\000a\000g\000n\000o\000s\000t\000i\000c\000s}{section.4.1}% 39
\BOOKMARK [2][-]{subsection.4.1.2}{\376\377\000D\000e\000c\000o\000m\000p\000i\000l\000a\000t\000i\000o\000n}{section.4.1}% 40
\BOOKMARK [1][-]{section.4.2}{\376\377\000P\000a\000t\000h\000n\000a\000m\000e}{chapter.4}% 41
\BOOKMARK [1][-]{section.4.3}{\376\377\000P\000a\000c\000k\000a\000g\000e\000-\000L\000o\000c\000a\000l\000\040\000N\000i\000c\000k\000n\000a\000m\000e\000s}{chapter.4}% 42
\BOOKMARK [1][-]{section.4.4}{\376\377\000E\000x\000t\000e\000n\000s\000i\000b\000l\000e\000\040\000S\000e\000q\000u\000e\000n\000c\000e\000s}{chapter.4}% 43
\BOOKMARK [1][-]{section.4.5}{\376\377\000E\000x\000t\000e\000n\000s\000i\000o\000n\000s\000\040\000t\000o\000\040\000C\000L\000O\000S}{chapter.4}% 44
\BOOKMARK [2][-]{subsection.4.5.1}{\376\377\000M\000e\000t\000a\000o\000b\000j\000e\000c\000t\000\040\000P\000r\000o\000t\000o\000c\000o\000l}{section.4.5}% 45
\BOOKMARK [2][-]{subsection.4.5.2}{\376\377\000S\000p\000e\000c\000i\000a\000l\000i\000z\000i\000n\000g\000\040\000o\000n\000\040\000J\000a\000v\000a\000\040\000c\000l\000a\000s\000s\000e\000s}{section.4.5}% 46
\BOOKMARK [1][-]{section.4.6}{\376\377\000E\000x\000t\000e\000n\000s\000i\000o\000n\000s\000\040\000t\000o\000\040\000t\000h\000e\000\040\000R\000e\000a\000d\000e\000r}{chapter.4}% 47
\BOOKMARK [1][-]{section.4.7}{\376\377\000O\000v\000e\000r\000l\000o\000a\000d\000i\000n\000g\000\040\000o\000f\000\040\000t\000h\000e\000\040\000C\000L\000:\000R\000E\000Q\000U\000I\000R\000E\000\040\000M\000e\000c\000h\000a\000n\000i\000s\000m}{chapter.4}% 48
\BOOKMARK [1][-]{section.4.8}{\376\377\000J\000S\000S\000\040\000e\000x\000t\000e\000n\000s\000i\000o\000n\000\040\000o\000f\000\040\000t\000h\000e\000\040\000R\000e\000a\000d\000e\000r\000\040\000b\000y\000\040\000S\000H\000A\000R\000P\000S\000I\000G\000N\000-\000D\000O\000U\000B\000L\000E\000-\000Q\000U\000O\000T\000E}{chapter.4}% 49
\BOOKMARK [1][-]{section.4.9}{\376\377\000A\000S\000D\000F}{chapter.4}% 50
\BOOKMARK [1][-]{section.4.10}{\376\377\000E\000x\000t\000e\000n\000s\000i\000o\000n\000\040\000t\000o\000\040\000C\000L\000:\000M\000A\000K\000E\000-\000A\000R\000R\000A\000Y}{chapter.4}% 51
\BOOKMARK [0][-]{chapter.5}{\376\377\000C\000o\000n\000t\000r\000i\000b}{}% 52
\BOOKMARK [1][-]{section.5.1}{\376\377\000a\000b\000c\000l\000-\000a\000s\000d\000f}{chapter.5}% 53
\BOOKMARK [2][-]{subsection.5.1.1}{\376\377\000R\000e\000f\000e\000r\000e\000n\000c\000i\000n\000g\000\040\000M\000a\000v\000e\000n\000\040\000A\000r\000t\000i\000f\000a\000c\000t\000s\000\040\000v\000i\000a\000\040\000A\000S\000D\000F}{section.5.1}% 54
\BOOKMARK [2][-]{subsection.5.1.2}{\376\377\000A\000P\000I}{section.5.1}% 55
\BOOKMARK [2][-]{subsection.5.1.3}{\376\377\000D\000i\000r\000e\000c\000t\000l\000y\000\040\000I\000n\000s\000t\000r\000u\000c\000t\000i\000n\000g\000\040\000M\000a\000v\000e\000n\000\040\000t\000o\000\040\000D\000o\000w\000n\000l\000o\000a\000d\000\040\000J\000V\000M\000\040\000A\000r\000t\000i\000f\000a\000c\000t\000s}{section.5.1}% 56
\BOOKMARK [1][-]{section.5.2}{\376\377\000a\000s\000d\000f\000-\000j\000a\000r}{chapter.5}% 57
\BOOKMARK [1][-]{section.5.3}{\376\377\000j\000s\000s}{chapter.5}% 58
\BOOKMARK [2][-]{subsection.5.3.1}{\376\377\000J\000S\000S\000\040\000u\000s\000a\000g\000e}{section.5.3}% 59
\BOOKMARK [1][-]{section.5.4}{\376\377\000j\000f\000l\000i}{chapter.5}% 60
\BOOKMARK [1][-]{section.5.5}{\376\377\000a\000b\000c\000l\000-\000i\000n\000t\000r\000o\000s\000p\000e\000c\000t}{chapter.5}% 61
\BOOKMARK [2][-]{subsection.5.5.1}{\376\377\000I\000m\000p\000l\000e\000m\000e\000n\000t\000a\000t\000i\000o\000n\000s\000\040\000f\000o\000r\000\040\000C\000L\000:\000D\000I\000S\000A\000S\000S\000E\000M\000B\000L\000E}{section.5.5}% 62
\BOOKMARK [1][-]{section.5.6}{\376\377\000a\000b\000c\000l\000-\000b\000u\000i\000l\000d}{chapter.5}% 63
\BOOKMARK [2][-]{subsection.5.6.1}{\376\377\000A\000B\000C\000L\000-\000B\000U\000I\000L\000D\000\040\000U\000t\000i\000l\000i\000t\000i\000e\000s}{section.5.6}% 64
\BOOKMARK [1][-]{section.5.7}{\376\377\000n\000a\000m\000e\000d\000-\000r\000e\000a\000d\000t\000a\000b\000l\000e\000s}{chapter.5}% 65
\BOOKMARK [0][-]{chapter.6}{\376\377\000H\000i\000s\000t\000o\000r\000y}{}% 66
\BOOKMARK [0][-]{appendix.A}{\376\377\000T\000h\000e\000\040\000M\000O\000P\000\040\000D\000i\000c\000t\000i\000o\000n\000a\000r\000y}{}% 67
\BOOKMARK [0][-]{appendix.B}{\376\377\000T\000h\000e\000\040\000S\000Y\000S\000T\000E\000M\000\040\000D\000i\000c\000t\000i\000o\000n\000a\000r\000y}{}% 68
\BOOKMARK [0][-]{appendix.C}{\376\377\000T\000h\000e\000\040\000J\000S\000S\000\040\000D\000i\000c\000t\000i\000o\000n\000a\000r\000y}{}% 69
