\relax 
\providecommand\hyper@newdestlabel[2]{}
\newlabel{JAVA:*JAVA-OBJECT-TO-STRING-LENGTH*}{{3.4.1}{21}{}{section*.16}{}}
\@writefile{toc}{\contentsline {paragraph}{}{21}{section*.16}\protected@file@percent }
\newlabel{JAVA:+FALSE+}{{3.4.1}{21}{}{section*.17}{}}
\@writefile{toc}{\contentsline {paragraph}{}{21}{section*.17}\protected@file@percent }
\newlabel{JAVA:+NULL+}{{3.4.1}{21}{}{section*.18}{}}
\@writefile{toc}{\contentsline {paragraph}{}{21}{section*.18}\protected@file@percent }
\newlabel{JAVA:+TRUE+}{{3.4.1}{21}{}{section*.19}{}}
\@writefile{toc}{\contentsline {paragraph}{}{21}{section*.19}\protected@file@percent }
\newlabel{JAVA:ADD-TO-CLASSPATH}{{3.4.1}{21}{}{section*.20}{}}
\@writefile{toc}{\contentsline {paragraph}{}{21}{section*.20}\protected@file@percent }
\newlabel{JAVA:CHAIN}{{3.4.1}{21}{}{section*.21}{}}
\@writefile{toc}{\contentsline {paragraph}{}{21}{section*.21}\protected@file@percent }
\newlabel{JAVA:DEFINE-JAVA-CLASS}{{3.4.1}{21}{}{section*.22}{}}
\@writefile{toc}{\contentsline {paragraph}{}{21}{section*.22}\protected@file@percent }
\newlabel{JAVA:DESCRIBE-JAVA-OBJECT}{{3.4.1}{21}{}{section*.23}{}}
\@writefile{toc}{\contentsline {paragraph}{}{21}{section*.23}\protected@file@percent }
\newlabel{JAVA:DUMP-CLASSPATH}{{3.4.1}{21}{}{section*.24}{}}
\@writefile{toc}{\contentsline {paragraph}{}{21}{section*.24}\protected@file@percent }
\newlabel{JAVA:ENSURE-JAVA-CLASS}{{3.4.1}{21}{}{section*.25}{}}
\@writefile{toc}{\contentsline {paragraph}{}{21}{section*.25}\protected@file@percent }
\newlabel{JAVA:ENSURE-JAVA-OBJECT}{{3.4.1}{21}{}{section*.26}{}}
\@writefile{toc}{\contentsline {paragraph}{}{21}{section*.26}\protected@file@percent }
\newlabel{JAVA:GET-CURRENT-CLASSLOADER}{{3.4.1}{22}{}{section*.27}{}}
\@writefile{toc}{\contentsline {paragraph}{}{22}{section*.27}\protected@file@percent }
\newlabel{JAVA:GET-DEFAULT-CLASSLOADER}{{3.4.1}{22}{}{section*.28}{}}
\@writefile{toc}{\contentsline {paragraph}{}{22}{section*.28}\protected@file@percent }
\newlabel{JAVA:JARRAY-COMPONENT-TYPE}{{3.4.1}{22}{}{section*.29}{}}
\@writefile{toc}{\contentsline {paragraph}{}{22}{section*.29}\protected@file@percent }
\newlabel{JAVA:JARRAY-FROM-LIST}{{3.4.1}{22}{}{section*.30}{}}
\@writefile{toc}{\contentsline {paragraph}{}{22}{section*.30}\protected@file@percent }
\newlabel{JAVA:JARRAY-LENGTH}{{3.4.1}{22}{}{section*.31}{}}
\@writefile{toc}{\contentsline {paragraph}{}{22}{section*.31}\protected@file@percent }
\newlabel{JAVA:JARRAY-REF}{{3.4.1}{22}{}{section*.32}{}}
\@writefile{toc}{\contentsline {paragraph}{}{22}{section*.32}\protected@file@percent }
\newlabel{JAVA:JARRAY-REF-RAW}{{3.4.1}{22}{}{section*.33}{}}
\@writefile{toc}{\contentsline {paragraph}{}{22}{section*.33}\protected@file@percent }
\newlabel{JAVA:JARRAY-SET}{{3.4.1}{22}{}{section*.34}{}}
\@writefile{toc}{\contentsline {paragraph}{}{22}{section*.34}\protected@file@percent }
\newlabel{JAVA:JAVA-CLASS}{{3.4.1}{22}{}{section*.35}{}}
\@writefile{toc}{\contentsline {paragraph}{}{22}{section*.35}\protected@file@percent }
\newlabel{JAVA:JAVA-EXCEPTION}{{3.4.1}{22}{}{section*.36}{}}
\@writefile{toc}{\contentsline {paragraph}{}{22}{section*.36}\protected@file@percent }
\newlabel{JAVA:JAVA-EXCEPTION-CAUSE}{{3.4.1}{22}{}{section*.37}{}}
\@writefile{toc}{\contentsline {paragraph}{}{22}{section*.37}\protected@file@percent }
\newlabel{JAVA:JAVA-OBJECT}{{3.4.1}{22}{}{section*.38}{}}
\@writefile{toc}{\contentsline {paragraph}{}{22}{section*.38}\protected@file@percent }
\newlabel{JAVA:JAVA-OBJECT-P}{{3.4.1}{22}{}{section*.39}{}}
\@writefile{toc}{\contentsline {paragraph}{}{22}{section*.39}\protected@file@percent }
\newlabel{JAVA:JCALL}{{3.4.1}{22}{}{section*.40}{}}
\@writefile{toc}{\contentsline {paragraph}{}{22}{section*.40}\protected@file@percent }
\newlabel{JAVA:JCALL-RAW}{{3.4.1}{23}{}{section*.41}{}}
\@writefile{toc}{\contentsline {paragraph}{}{23}{section*.41}\protected@file@percent }
\newlabel{JAVA:JCLASS}{{3.4.1}{23}{}{section*.42}{}}
\@writefile{toc}{\contentsline {paragraph}{}{23}{section*.42}\protected@file@percent }
\newlabel{JAVA:JCLASS-ARRAY-P}{{3.4.1}{23}{}{section*.43}{}}
\@writefile{toc}{\contentsline {paragraph}{}{23}{section*.43}\protected@file@percent }
\newlabel{JAVA:JCLASS-CONSTRUCTORS}{{3.4.1}{23}{}{section*.44}{}}
\@writefile{toc}{\contentsline {paragraph}{}{23}{section*.44}\protected@file@percent }
\newlabel{JAVA:JCLASS-FIELD}{{3.4.1}{23}{}{section*.45}{}}
\@writefile{toc}{\contentsline {paragraph}{}{23}{section*.45}\protected@file@percent }
\newlabel{JAVA:JCLASS-FIELDS}{{3.4.1}{23}{}{section*.46}{}}
\@writefile{toc}{\contentsline {paragraph}{}{23}{section*.46}\protected@file@percent }
\newlabel{JAVA:JCLASS-INTERFACE-P}{{3.4.1}{23}{}{section*.47}{}}
\@writefile{toc}{\contentsline {paragraph}{}{23}{section*.47}\protected@file@percent }
\newlabel{JAVA:JCLASS-INTERFACES}{{3.4.1}{23}{}{section*.48}{}}
\@writefile{toc}{\contentsline {paragraph}{}{23}{section*.48}\protected@file@percent }
\newlabel{JAVA:JCLASS-METHODS}{{3.4.1}{23}{}{section*.49}{}}
\@writefile{toc}{\contentsline {paragraph}{}{23}{section*.49}\protected@file@percent }
\newlabel{JAVA:JCLASS-NAME}{{3.4.1}{23}{}{section*.50}{}}
\@writefile{toc}{\contentsline {paragraph}{}{23}{section*.50}\protected@file@percent }
\newlabel{JAVA:JCLASS-OF}{{3.4.1}{23}{}{section*.51}{}}
\@writefile{toc}{\contentsline {paragraph}{}{23}{section*.51}\protected@file@percent }
\newlabel{JAVA:JCLASS-SUPERCLASS}{{3.4.1}{23}{}{section*.52}{}}
\@writefile{toc}{\contentsline {paragraph}{}{23}{section*.52}\protected@file@percent }
\newlabel{JAVA:JCLASS-SUPERCLASS-P}{{3.4.1}{23}{}{section*.53}{}}
\@writefile{toc}{\contentsline {paragraph}{}{23}{section*.53}\protected@file@percent }
\newlabel{JAVA:JCOERCE}{{3.4.1}{23}{}{section*.54}{}}
\@writefile{toc}{\contentsline {paragraph}{}{23}{section*.54}\protected@file@percent }
\newlabel{JAVA:JCONSTRUCTOR}{{3.4.1}{24}{}{section*.55}{}}
\@writefile{toc}{\contentsline {paragraph}{}{24}{section*.55}\protected@file@percent }
\newlabel{JAVA:JCONSTRUCTOR-PARAMS}{{3.4.1}{24}{}{section*.56}{}}
\@writefile{toc}{\contentsline {paragraph}{}{24}{section*.56}\protected@file@percent }
\newlabel{JAVA:JEQUAL}{{3.4.1}{24}{}{section*.57}{}}
\@writefile{toc}{\contentsline {paragraph}{}{24}{section*.57}\protected@file@percent }
\newlabel{JAVA:JFIELD}{{3.4.1}{24}{}{section*.58}{}}
\@writefile{toc}{\contentsline {paragraph}{}{24}{section*.58}\protected@file@percent }
\newlabel{JAVA:JFIELD-NAME}{{3.4.1}{24}{}{section*.59}{}}
\@writefile{toc}{\contentsline {paragraph}{}{24}{section*.59}\protected@file@percent }
\newlabel{JAVA:JFIELD-RAW}{{3.4.1}{24}{}{section*.60}{}}
\@writefile{toc}{\contentsline {paragraph}{}{24}{section*.60}\protected@file@percent }
\newlabel{JAVA:JFIELD-TYPE}{{3.4.1}{24}{}{section*.61}{}}
\@writefile{toc}{\contentsline {paragraph}{}{24}{section*.61}\protected@file@percent }
\newlabel{JAVA:JINPUT-STREAM}{{3.4.1}{25}{}{section*.62}{}}
\@writefile{toc}{\contentsline {paragraph}{}{25}{section*.62}\protected@file@percent }
\newlabel{JAVA:JINSTANCE-OF-P}{{3.4.1}{25}{}{section*.63}{}}
\@writefile{toc}{\contentsline {paragraph}{}{25}{section*.63}\protected@file@percent }
\newlabel{JAVA:JINTERFACE-IMPLEMENTATION}{{3.4.1}{25}{}{section*.64}{}}
\@writefile{toc}{\contentsline {paragraph}{}{25}{section*.64}\protected@file@percent }
\newlabel{JAVA:JMAKE-INVOCATION-HANDLER}{{3.4.1}{25}{}{section*.65}{}}
\@writefile{toc}{\contentsline {paragraph}{}{25}{section*.65}\protected@file@percent }
\newlabel{JAVA:JMAKE-PROXY}{{3.4.1}{25}{}{section*.66}{}}
\@writefile{toc}{\contentsline {paragraph}{}{25}{section*.66}\protected@file@percent }
\newlabel{JAVA:JMEMBER-PROTECTED-P}{{3.4.1}{25}{}{section*.67}{}}
\@writefile{toc}{\contentsline {paragraph}{}{25}{section*.67}\protected@file@percent }
\newlabel{JAVA:JMEMBER-PUBLIC-P}{{3.4.1}{25}{}{section*.68}{}}
\@writefile{toc}{\contentsline {paragraph}{}{25}{section*.68}\protected@file@percent }
\newlabel{JAVA:JMEMBER-STATIC-P}{{3.4.1}{25}{}{section*.69}{}}
\@writefile{toc}{\contentsline {paragraph}{}{25}{section*.69}\protected@file@percent }
\newlabel{JAVA:JMETHOD}{{3.4.1}{25}{}{section*.70}{}}
\@writefile{toc}{\contentsline {paragraph}{}{25}{section*.70}\protected@file@percent }
\newlabel{JAVA:JMETHOD-LET}{{3.4.1}{25}{}{section*.71}{}}
\@writefile{toc}{\contentsline {paragraph}{}{25}{section*.71}\protected@file@percent }
\newlabel{JAVA:JMETHOD-NAME}{{3.4.1}{25}{}{section*.72}{}}
\@writefile{toc}{\contentsline {paragraph}{}{25}{section*.72}\protected@file@percent }
\newlabel{JAVA:JMETHOD-PARAMS}{{3.4.1}{26}{}{section*.73}{}}
\@writefile{toc}{\contentsline {paragraph}{}{26}{section*.73}\protected@file@percent }
\newlabel{JAVA:JMETHOD-RETURN-TYPE}{{3.4.1}{26}{}{section*.74}{}}
\@writefile{toc}{\contentsline {paragraph}{}{26}{section*.74}\protected@file@percent }
\newlabel{JAVA:JNEW}{{3.4.1}{26}{}{section*.75}{}}
\@writefile{toc}{\contentsline {paragraph}{}{26}{section*.75}\protected@file@percent }
\newlabel{JAVA:JNEW-ARRAY}{{3.4.1}{26}{}{section*.76}{}}
\@writefile{toc}{\contentsline {paragraph}{}{26}{section*.76}\protected@file@percent }
\newlabel{JAVA:JNEW-ARRAY-FROM-ARRAY}{{3.4.1}{26}{}{section*.77}{}}
\@writefile{toc}{\contentsline {paragraph}{}{26}{section*.77}\protected@file@percent }
\newlabel{JAVA:JNEW-ARRAY-FROM-LIST}{{3.4.1}{26}{}{section*.78}{}}
\@writefile{toc}{\contentsline {paragraph}{}{26}{section*.78}\protected@file@percent }
\newlabel{JAVA:JNEW-RUNTIME-CLASS}{{3.4.1}{26}{}{section*.79}{}}
\@writefile{toc}{\contentsline {paragraph}{}{26}{section*.79}\protected@file@percent }
\newlabel{JAVA:JNULL-REF-P}{{3.4.1}{27}{}{section*.80}{}}
\@writefile{toc}{\contentsline {paragraph}{}{27}{section*.80}\protected@file@percent }
\newlabel{JAVA:JOBJECT-CLASS}{{3.4.1}{27}{}{section*.81}{}}
\@writefile{toc}{\contentsline {paragraph}{}{27}{section*.81}\protected@file@percent }
\newlabel{JAVA:JOBJECT-LISP-VALUE}{{3.4.1}{27}{}{section*.82}{}}
\@writefile{toc}{\contentsline {paragraph}{}{27}{section*.82}\protected@file@percent }
\newlabel{JAVA:JPROPERTY-VALUE}{{3.4.1}{27}{}{section*.83}{}}
\@writefile{toc}{\contentsline {paragraph}{}{27}{section*.83}\protected@file@percent }
\newlabel{JAVA:JREGISTER-HANDLER}{{3.4.1}{27}{}{section*.84}{}}
\@writefile{toc}{\contentsline {paragraph}{}{27}{section*.84}\protected@file@percent }
\newlabel{JAVA:JRESOLVE-METHOD}{{3.4.1}{27}{}{section*.85}{}}
\@writefile{toc}{\contentsline {paragraph}{}{27}{section*.85}\protected@file@percent }
\newlabel{JAVA:JRUN-EXCEPTION-PROTECTED}{{3.4.1}{27}{}{section*.86}{}}
\@writefile{toc}{\contentsline {paragraph}{}{27}{section*.86}\protected@file@percent }
\newlabel{JAVA:JSTATIC}{{3.4.1}{27}{}{section*.87}{}}
\@writefile{toc}{\contentsline {paragraph}{}{27}{section*.87}\protected@file@percent }
\newlabel{JAVA:JSTATIC-RAW}{{3.4.1}{27}{}{section*.88}{}}
\@writefile{toc}{\contentsline {paragraph}{}{27}{section*.88}\protected@file@percent }
\newlabel{JAVA:MAKE-CLASSLOADER}{{3.4.1}{27}{}{section*.89}{}}
\@writefile{toc}{\contentsline {paragraph}{}{27}{section*.89}\protected@file@percent }
\newlabel{JAVA:MAKE-IMMEDIATE-OBJECT}{{3.4.1}{27}{}{section*.90}{}}
\@writefile{toc}{\contentsline {paragraph}{}{27}{section*.90}\protected@file@percent }
\newlabel{JAVA:REGISTER-JAVA-EXCEPTION}{{3.4.1}{27}{}{section*.91}{}}
\@writefile{toc}{\contentsline {paragraph}{}{27}{section*.91}\protected@file@percent }
\newlabel{JAVA:UNREGISTER-JAVA-EXCEPTION}{{3.4.1}{28}{}{section*.92}{}}
\@writefile{toc}{\contentsline {paragraph}{}{28}{section*.92}\protected@file@percent }
\@setckpt{java}{
\setcounter{page}{29}
\setcounter{equation}{0}
\setcounter{enumi}{0}
\setcounter{enumii}{0}
\setcounter{enumiii}{0}
\setcounter{enumiv}{0}
\setcounter{footnote}{2}
\setcounter{mpfootnote}{0}
\setcounter{part}{0}
\setcounter{chapter}{3}
\setcounter{section}{4}
\setcounter{subsection}{1}
\setcounter{subsubsection}{0}
\setcounter{paragraph}{0}
\setcounter{subparagraph}{0}
\setcounter{figure}{0}
\setcounter{table}{0}
\setcounter{Item}{0}
\setcounter{Hfootnote}{13}
\setcounter{bookmark@seq@number}{34}
\setcounter{lstnumber}{2}
\setcounter{cp@cntr}{0}
\setcounter{section@level}{4}
\setcounter{lstlisting}{0}
}
