\relax 
\providecommand\hyper@newdestlabel[2]{}
\newlabel{SYSTEM:ALLOCATE-FUNCALLABLE-INSTANCE}{{B}{68}{}{section*.337}{}}
\@writefile{toc}{\contentsline {paragraph}{}{68}{section*.337}\protected@file@percent }
\newlabel{SYSTEM:CLASS-DEFAULT-INITARGS}{{B}{68}{}{section*.338}{}}
\@writefile{toc}{\contentsline {paragraph}{}{68}{section*.338}\protected@file@percent }
\newlabel{SYSTEM:CLASS-DIRECT-DEFAULT-INITARGS}{{B}{68}{}{section*.339}{}}
\@writefile{toc}{\contentsline {paragraph}{}{68}{section*.339}\protected@file@percent }
\newlabel{SYSTEM:CLASS-DIRECT-METHODS}{{B}{68}{}{section*.340}{}}
\@writefile{toc}{\contentsline {paragraph}{}{68}{section*.340}\protected@file@percent }
\newlabel{SYSTEM:CLASS-DIRECT-SLOTS}{{B}{68}{}{section*.341}{}}
\@writefile{toc}{\contentsline {paragraph}{}{68}{section*.341}\protected@file@percent }
\newlabel{SYSTEM:CLASS-DIRECT-SUBCLASSES}{{B}{68}{}{section*.342}{}}
\@writefile{toc}{\contentsline {paragraph}{}{68}{section*.342}\protected@file@percent }
\newlabel{SYSTEM:CLASS-DIRECT-SUPERCLASSES}{{B}{68}{}{section*.343}{}}
\@writefile{toc}{\contentsline {paragraph}{}{68}{section*.343}\protected@file@percent }
\newlabel{SYSTEM:CLASS-FINALIZED-P}{{B}{68}{}{section*.344}{}}
\@writefile{toc}{\contentsline {paragraph}{}{68}{section*.344}\protected@file@percent }
\newlabel{SYSTEM:CLASS-LAYOUT}{{B}{68}{}{section*.345}{}}
\@writefile{toc}{\contentsline {paragraph}{}{68}{section*.345}\protected@file@percent }
\newlabel{SYSTEM:CLASS-NAME}{{B}{68}{}{section*.346}{}}
\@writefile{toc}{\contentsline {paragraph}{}{68}{section*.346}\protected@file@percent }
\newlabel{SYSTEM:CLASS-PRECEDENCE-LIST}{{B}{68}{}{section*.347}{}}
\@writefile{toc}{\contentsline {paragraph}{}{68}{section*.347}\protected@file@percent }
\newlabel{SYSTEM:CLASS-SLOTS}{{B}{68}{}{section*.348}{}}
\@writefile{toc}{\contentsline {paragraph}{}{68}{section*.348}\protected@file@percent }
\newlabel{SYSTEM:DEFUN}{{B}{68}{}{section*.349}{}}
\@writefile{toc}{\contentsline {paragraph}{}{68}{section*.349}\protected@file@percent }
\newlabel{SYSTEM:DOCUMENTATION}{{B}{68}{}{section*.350}{}}
\@writefile{toc}{\contentsline {paragraph}{}{68}{section*.350}\protected@file@percent }
\newlabel{SYSTEM:FLOAT-BITS}{{B}{68}{}{section*.351}{}}
\@writefile{toc}{\contentsline {paragraph}{}{68}{section*.351}\protected@file@percent }
\newlabel{SYSTEM:IN-PACKAGE}{{B}{68}{}{section*.352}{}}
\@writefile{toc}{\contentsline {paragraph}{}{68}{section*.352}\protected@file@percent }
\newlabel{SYSTEM:MAKE-CONDITION}{{B}{69}{}{section*.353}{}}
\@writefile{toc}{\contentsline {paragraph}{}{69}{section*.353}\protected@file@percent }
\newlabel{SYSTEM:MAKE-EMF-CACHE}{{B}{69}{}{section*.354}{}}
\@writefile{toc}{\contentsline {paragraph}{}{69}{section*.354}\protected@file@percent }
\newlabel{SYSTEM:MAKE-INSTANCES-OBSOLETE}{{B}{69}{}{section*.355}{}}
\@writefile{toc}{\contentsline {paragraph}{}{69}{section*.355}\protected@file@percent }
\newlabel{SYSTEM:MAKE-INTEGER-TYPE}{{B}{69}{}{section*.356}{}}
\@writefile{toc}{\contentsline {paragraph}{}{69}{section*.356}\protected@file@percent }
\newlabel{SYSTEM:MAKE-LIST}{{B}{69}{}{section*.357}{}}
\@writefile{toc}{\contentsline {paragraph}{}{69}{section*.357}\protected@file@percent }
\newlabel{SYSTEM:MAKE-LOGICAL-PATHNAME}{{B}{69}{}{section*.358}{}}
\@writefile{toc}{\contentsline {paragraph}{}{69}{section*.358}\protected@file@percent }
\newlabel{SYSTEM:MAKE-SLOT-DEFINITION}{{B}{69}{}{section*.359}{}}
\@writefile{toc}{\contentsline {paragraph}{}{69}{section*.359}\protected@file@percent }
\newlabel{SYSTEM:MAKE-STRUCTURE}{{B}{69}{}{section*.360}{}}
\@writefile{toc}{\contentsline {paragraph}{}{69}{section*.360}\protected@file@percent }
\newlabel{SYSTEM:MEMBER}{{B}{69}{}{section*.361}{}}
\@writefile{toc}{\contentsline {paragraph}{}{69}{section*.361}\protected@file@percent }
\newlabel{SYSTEM:NSTRING-CAPITALIZE}{{B}{69}{}{section*.362}{}}
\@writefile{toc}{\contentsline {paragraph}{}{69}{section*.362}\protected@file@percent }
\newlabel{SYSTEM:NSTRING-DOWNCASE}{{B}{69}{}{section*.363}{}}
\@writefile{toc}{\contentsline {paragraph}{}{69}{section*.363}\protected@file@percent }
\newlabel{SYSTEM:NSTRING-UPCASE}{{B}{69}{}{section*.364}{}}
\@writefile{toc}{\contentsline {paragraph}{}{69}{section*.364}\protected@file@percent }
\newlabel{SYSTEM:OUTPUT-OBJECT}{{B}{69}{}{section*.365}{}}
\@writefile{toc}{\contentsline {paragraph}{}{69}{section*.365}\protected@file@percent }
\newlabel{SYSTEM:PUTF}{{B}{69}{}{section*.366}{}}
\@writefile{toc}{\contentsline {paragraph}{}{69}{section*.366}\protected@file@percent }
\newlabel{SYSTEM:REINIT-EMF-CACHE}{{B}{69}{}{section*.367}{}}
\@writefile{toc}{\contentsline {paragraph}{}{69}{section*.367}\protected@file@percent }
\newlabel{SYSTEM:SET-CLASS-DEFAULT-INITARGS}{{B}{69}{}{section*.368}{}}
\@writefile{toc}{\contentsline {paragraph}{}{69}{section*.368}\protected@file@percent }
\newlabel{SYSTEM:SET-CLASS-DIRECT-DEFAULT-INITARGS}{{B}{70}{}{section*.369}{}}
\@writefile{toc}{\contentsline {paragraph}{}{70}{section*.369}\protected@file@percent }
\newlabel{SYSTEM:SET-CLASS-DIRECT-METHODS}{{B}{70}{}{section*.370}{}}
\@writefile{toc}{\contentsline {paragraph}{}{70}{section*.370}\protected@file@percent }
\newlabel{SYSTEM:SET-CLASS-DIRECT-SLOTS}{{B}{70}{}{section*.371}{}}
\@writefile{toc}{\contentsline {paragraph}{}{70}{section*.371}\protected@file@percent }
\newlabel{SYSTEM:SET-CLASS-DIRECT-SUBCLASSES}{{B}{70}{}{section*.372}{}}
\@writefile{toc}{\contentsline {paragraph}{}{70}{section*.372}\protected@file@percent }
\newlabel{SYSTEM:SET-CLASS-DIRECT-SUPERCLASSES}{{B}{70}{}{section*.373}{}}
\@writefile{toc}{\contentsline {paragraph}{}{70}{section*.373}\protected@file@percent }
\newlabel{SYSTEM:SET-CLASS-DOCUMENTATION}{{B}{70}{}{section*.374}{}}
\@writefile{toc}{\contentsline {paragraph}{}{70}{section*.374}\protected@file@percent }
\newlabel{SYSTEM:SET-CLASS-FINALIZED-P}{{B}{70}{}{section*.375}{}}
\@writefile{toc}{\contentsline {paragraph}{}{70}{section*.375}\protected@file@percent }
\newlabel{SYSTEM:SET-CLASS-LAYOUT}{{B}{70}{}{section*.376}{}}
\@writefile{toc}{\contentsline {paragraph}{}{70}{section*.376}\protected@file@percent }
\newlabel{SYSTEM:SET-CLASS-NAME}{{B}{70}{}{section*.377}{}}
\@writefile{toc}{\contentsline {paragraph}{}{70}{section*.377}\protected@file@percent }
\newlabel{SYSTEM:SET-CLASS-PRECEDENCE-LIST}{{B}{70}{}{section*.378}{}}
\@writefile{toc}{\contentsline {paragraph}{}{70}{section*.378}\protected@file@percent }
\newlabel{SYSTEM:SET-CLASS-SLOTS}{{B}{70}{}{section*.379}{}}
\@writefile{toc}{\contentsline {paragraph}{}{70}{section*.379}\protected@file@percent }
\newlabel{SYSTEM:SET-DOCUMENTATION}{{B}{70}{}{section*.380}{}}
\@writefile{toc}{\contentsline {paragraph}{}{70}{section*.380}\protected@file@percent }
\newlabel{SYSTEM:SET-FILL-POINTER}{{B}{70}{}{section*.381}{}}
\@writefile{toc}{\contentsline {paragraph}{}{70}{section*.381}\protected@file@percent }
\newlabel{SYSTEM:SET-FIND-CLASS}{{B}{70}{}{section*.382}{}}
\@writefile{toc}{\contentsline {paragraph}{}{70}{section*.382}\protected@file@percent }
\newlabel{SYSTEM:SET-STANDARD-INSTANCE-ACCESS}{{B}{70}{}{section*.383}{}}
\@writefile{toc}{\contentsline {paragraph}{}{70}{section*.383}\protected@file@percent }
\newlabel{SYSTEM:SET-STD-INSTANCE-LAYOUT}{{B}{70}{}{section*.384}{}}
\@writefile{toc}{\contentsline {paragraph}{}{70}{section*.384}\protected@file@percent }
\newlabel{SYSTEM:STD-ALLOCATE-INSTANCE}{{B}{71}{}{section*.385}{}}
\@writefile{toc}{\contentsline {paragraph}{}{71}{section*.385}\protected@file@percent }
\newlabel{SYSTEM:STREAM-OUTPUT-OBJECT}{{B}{71}{}{section*.386}{}}
\@writefile{toc}{\contentsline {paragraph}{}{71}{section*.386}\protected@file@percent }
\newlabel{SYSTEM:STREAM-TERPRI}{{B}{71}{}{section*.387}{}}
\@writefile{toc}{\contentsline {paragraph}{}{71}{section*.387}\protected@file@percent }
\newlabel{SYSTEM:STREAM-WRITE-CHAR}{{B}{71}{}{section*.388}{}}
\@writefile{toc}{\contentsline {paragraph}{}{71}{section*.388}\protected@file@percent }
\newlabel{SYSTEM:STRING-CAPITALIZE}{{B}{71}{}{section*.389}{}}
\@writefile{toc}{\contentsline {paragraph}{}{71}{section*.389}\protected@file@percent }
\newlabel{SYSTEM:STRING-DOWNCASE}{{B}{71}{}{section*.390}{}}
\@writefile{toc}{\contentsline {paragraph}{}{71}{section*.390}\protected@file@percent }
\newlabel{SYSTEM:STRING-EQUAL}{{B}{71}{}{section*.391}{}}
\@writefile{toc}{\contentsline {paragraph}{}{71}{section*.391}\protected@file@percent }
\newlabel{SYSTEM:STRING-GREATERP}{{B}{71}{}{section*.392}{}}
\@writefile{toc}{\contentsline {paragraph}{}{71}{section*.392}\protected@file@percent }
\newlabel{SYSTEM:STRING-LESSP}{{B}{71}{}{section*.393}{}}
\@writefile{toc}{\contentsline {paragraph}{}{71}{section*.393}\protected@file@percent }
\newlabel{SYSTEM:STRING-NOT-EQUAL}{{B}{71}{}{section*.394}{}}
\@writefile{toc}{\contentsline {paragraph}{}{71}{section*.394}\protected@file@percent }
\newlabel{SYSTEM:STRING-NOT-GREATERP}{{B}{71}{}{section*.395}{}}
\@writefile{toc}{\contentsline {paragraph}{}{71}{section*.395}\protected@file@percent }
\newlabel{SYSTEM:STRING-NOT-LESSP}{{B}{71}{}{section*.396}{}}
\@writefile{toc}{\contentsline {paragraph}{}{71}{section*.396}\protected@file@percent }
\newlabel{SYSTEM:STRING-UPCASE}{{B}{71}{}{section*.397}{}}
\@writefile{toc}{\contentsline {paragraph}{}{71}{section*.397}\protected@file@percent }
\newlabel{SYSTEM:STRING/=}{{B}{71}{}{section*.398}{}}
\@writefile{toc}{\contentsline {paragraph}{}{71}{section*.398}\protected@file@percent }
\newlabel{SYSTEM:STRING<}{{B}{71}{}{section*.399}{}}
\@writefile{toc}{\contentsline {paragraph}{}{71}{section*.399}\protected@file@percent }
\newlabel{SYSTEM:STRING<=}{{B}{71}{}{section*.400}{}}
\@writefile{toc}{\contentsline {paragraph}{}{71}{section*.400}\protected@file@percent }
\newlabel{SYSTEM:STRING>}{{B}{72}{}{section*.401}{}}
\@writefile{toc}{\contentsline {paragraph}{}{72}{section*.401}\protected@file@percent }
\newlabel{SYSTEM:STRING>=}{{B}{72}{}{section*.402}{}}
\@writefile{toc}{\contentsline {paragraph}{}{72}{section*.402}\protected@file@percent }
\newlabel{SYSTEM:TYPE-ERROR}{{B}{72}{}{section*.403}{}}
\@writefile{toc}{\contentsline {paragraph}{}{72}{section*.403}\protected@file@percent }
\newlabel{SYSTEM:WILD-PATHNAME-P}{{B}{72}{}{section*.404}{}}
\@writefile{toc}{\contentsline {paragraph}{}{72}{section*.404}\protected@file@percent }
\newlabel{SYSTEM:*ABCL-CONTRIB*}{{B}{72}{}{section*.405}{}}
\@writefile{toc}{\contentsline {paragraph}{}{72}{section*.405}\protected@file@percent }
\newlabel{SYSTEM:*COMPILE-FILE-CLASS-EXTENSION*}{{B}{72}{}{section*.406}{}}
\@writefile{toc}{\contentsline {paragraph}{}{72}{section*.406}\protected@file@percent }
\newlabel{SYSTEM:*COMPILE-FILE-ENVIRONMENT*}{{B}{72}{}{section*.407}{}}
\@writefile{toc}{\contentsline {paragraph}{}{72}{section*.407}\protected@file@percent }
\newlabel{SYSTEM:*COMPILE-FILE-TYPE*}{{B}{72}{}{section*.408}{}}
\@writefile{toc}{\contentsline {paragraph}{}{72}{section*.408}\protected@file@percent }
\newlabel{SYSTEM:*COMPILE-FILE-ZIP*}{{B}{72}{}{section*.409}{}}
\@writefile{toc}{\contentsline {paragraph}{}{72}{section*.409}\protected@file@percent }
\newlabel{SYSTEM:*COMPILER-DIAGNOSTIC*}{{B}{72}{}{section*.410}{}}
\@writefile{toc}{\contentsline {paragraph}{}{72}{section*.410}\protected@file@percent }
\newlabel{SYSTEM:*COMPILER-ERROR-CONTEXT*}{{B}{72}{}{section*.411}{}}
\@writefile{toc}{\contentsline {paragraph}{}{72}{section*.411}\protected@file@percent }
\newlabel{SYSTEM:*CURRENT-PRINT-LENGTH*}{{B}{72}{}{section*.412}{}}
\@writefile{toc}{\contentsline {paragraph}{}{72}{section*.412}\protected@file@percent }
\newlabel{SYSTEM:*CURRENT-PRINT-LEVEL*}{{B}{72}{}{section*.413}{}}
\@writefile{toc}{\contentsline {paragraph}{}{72}{section*.413}\protected@file@percent }
\newlabel{SYSTEM:*DEBUG*}{{B}{72}{}{section*.414}{}}
\@writefile{toc}{\contentsline {paragraph}{}{72}{section*.414}\protected@file@percent }
\newlabel{ABCL-INTROSPECT/SYSTEM:*DEBUGGING-LOCALS-P*}{{B}{72}{}{section*.415}{}}
\@writefile{toc}{\contentsline {paragraph}{}{72}{section*.415}\protected@file@percent }
\newlabel{SYSTEM:*DISASSEMBLERS*}{{B}{73}{}{section*.416}{}}
\@writefile{toc}{\contentsline {paragraph}{}{73}{section*.416}\protected@file@percent }
\newlabel{SYSTEM:*ENABLE-AUTOCOMPILE*}{{B}{73}{}{section*.417}{}}
\@writefile{toc}{\contentsline {paragraph}{}{73}{section*.417}\protected@file@percent }
\newlabel{SYSTEM:*EXPLAIN*}{{B}{73}{}{section*.418}{}}
\@writefile{toc}{\contentsline {paragraph}{}{73}{section*.418}\protected@file@percent }
\newlabel{SYSTEM:*FASL-LOADER*}{{B}{73}{}{section*.419}{}}
\@writefile{toc}{\contentsline {paragraph}{}{73}{section*.419}\protected@file@percent }
\newlabel{SYSTEM:*FASL-VERSION*}{{B}{73}{}{section*.420}{}}
\@writefile{toc}{\contentsline {paragraph}{}{73}{section*.420}\protected@file@percent }
\newlabel{SYSTEM:*INLINE-DECLARATIONS*}{{B}{73}{}{section*.421}{}}
\@writefile{toc}{\contentsline {paragraph}{}{73}{section*.421}\protected@file@percent }
\newlabel{SYSTEM:*LOGICAL-PATHNAME-TRANSLATIONS*}{{B}{73}{}{section*.422}{}}
\@writefile{toc}{\contentsline {paragraph}{}{73}{section*.422}\protected@file@percent }
\newlabel{SYSTEM:*NOINFORM*}{{B}{73}{}{section*.423}{}}
\@writefile{toc}{\contentsline {paragraph}{}{73}{section*.423}\protected@file@percent }
\newlabel{SYSTEM:*SAFETY*}{{B}{73}{}{section*.424}{}}
\@writefile{toc}{\contentsline {paragraph}{}{73}{section*.424}\protected@file@percent }
\newlabel{SYSTEM:*SOURCE*}{{B}{73}{}{section*.425}{}}
\@writefile{toc}{\contentsline {paragraph}{}{73}{section*.425}\protected@file@percent }
\newlabel{SYSTEM:*SOURCE-POSITION*}{{B}{73}{}{section*.426}{}}
\@writefile{toc}{\contentsline {paragraph}{}{73}{section*.426}\protected@file@percent }
\newlabel{SYSTEM:*SPACE*}{{B}{73}{}{section*.427}{}}
\@writefile{toc}{\contentsline {paragraph}{}{73}{section*.427}\protected@file@percent }
\newlabel{SYSTEM:*SPEED*}{{B}{73}{}{section*.428}{}}
\@writefile{toc}{\contentsline {paragraph}{}{73}{section*.428}\protected@file@percent }
\newlabel{SYSTEM:*TRACED-NAMES*}{{B}{73}{}{section*.429}{}}
\@writefile{toc}{\contentsline {paragraph}{}{73}{section*.429}\protected@file@percent }
\newlabel{SYSTEM:+CL-PACKAGE+}{{B}{74}{}{section*.430}{}}
\@writefile{toc}{\contentsline {paragraph}{}{74}{section*.430}\protected@file@percent }
\newlabel{SYSTEM:+FALSE-TYPE+}{{B}{74}{}{section*.431}{}}
\@writefile{toc}{\contentsline {paragraph}{}{74}{section*.431}\protected@file@percent }
\newlabel{SYSTEM:+FIXNUM-TYPE+}{{B}{74}{}{section*.432}{}}
\@writefile{toc}{\contentsline {paragraph}{}{74}{section*.432}\protected@file@percent }
\newlabel{SYSTEM:+INTEGER-TYPE+}{{B}{74}{}{section*.433}{}}
\@writefile{toc}{\contentsline {paragraph}{}{74}{section*.433}\protected@file@percent }
\newlabel{SYSTEM:+KEYWORD-PACKAGE+}{{B}{74}{}{section*.434}{}}
\@writefile{toc}{\contentsline {paragraph}{}{74}{section*.434}\protected@file@percent }
\newlabel{SYSTEM:+SLOT-UNBOUND+}{{B}{74}{}{section*.435}{}}
\@writefile{toc}{\contentsline {paragraph}{}{74}{section*.435}\protected@file@percent }
\newlabel{SYSTEM:+TRUE-TYPE+}{{B}{74}{}{section*.436}{}}
\@writefile{toc}{\contentsline {paragraph}{}{74}{section*.436}\protected@file@percent }
\newlabel{SYSTEM:ASET}{{B}{74}{}{section*.437}{}}
\@writefile{toc}{\contentsline {paragraph}{}{74}{section*.437}\protected@file@percent }
\newlabel{SYSTEM:AUTOCOMPILE}{{B}{74}{}{section*.438}{}}
\@writefile{toc}{\contentsline {paragraph}{}{74}{section*.438}\protected@file@percent }
\newlabel{SYSTEM:AVAILABLE-ENCODINGS}{{B}{74}{}{section*.439}{}}
\@writefile{toc}{\contentsline {paragraph}{}{74}{section*.439}\protected@file@percent }
\newlabel{SYSTEM:AVER}{{B}{74}{}{section*.440}{}}
\@writefile{toc}{\contentsline {paragraph}{}{74}{section*.440}\protected@file@percent }
\newlabel{SYSTEM:BACKTRACE}{{B}{74}{}{section*.441}{}}
\@writefile{toc}{\contentsline {paragraph}{}{74}{section*.441}\protected@file@percent }
\newlabel{SYSTEM:BUILT-IN-FUNCTION-P}{{B}{74}{}{section*.442}{}}
\@writefile{toc}{\contentsline {paragraph}{}{74}{section*.442}\protected@file@percent }
\newlabel{SYSTEM:CACHE-EMF}{{B}{74}{}{section*.443}{}}
\@writefile{toc}{\contentsline {paragraph}{}{74}{section*.443}\protected@file@percent }
\newlabel{SYSTEM:CALL-COUNT}{{B}{74}{}{section*.444}{}}
\@writefile{toc}{\contentsline {paragraph}{}{74}{section*.444}\protected@file@percent }
\newlabel{SYSTEM:CALL-REGISTERS-LIMIT}{{B}{74}{}{section*.445}{}}
\@writefile{toc}{\contentsline {paragraph}{}{74}{section*.445}\protected@file@percent }
\newlabel{SYSTEM:CANONICALIZE-LOGICAL-HOST}{{B}{75}{}{section*.446}{}}
\@writefile{toc}{\contentsline {paragraph}{}{75}{section*.446}\protected@file@percent }
\newlabel{SYSTEM:CHECK-DECLARATION-TYPE}{{B}{75}{}{section*.447}{}}
\@writefile{toc}{\contentsline {paragraph}{}{75}{section*.447}\protected@file@percent }
\newlabel{SYSTEM:CHECK-SEQUENCE-BOUNDS}{{B}{75}{}{section*.448}{}}
\@writefile{toc}{\contentsline {paragraph}{}{75}{section*.448}\protected@file@percent }
\newlabel{SYSTEM:CHOOSE-DISASSEMBLER}{{B}{75}{}{section*.449}{}}
\@writefile{toc}{\contentsline {paragraph}{}{75}{section*.449}\protected@file@percent }
\newlabel{SYSTEM:CLASS-BYTES}{{B}{75}{}{section*.450}{}}
\@writefile{toc}{\contentsline {paragraph}{}{75}{section*.450}\protected@file@percent }
\newlabel{SYSTEM:CLEAR-ZIP-CACHE}{{B}{75}{}{section*.451}{}}
\@writefile{toc}{\contentsline {paragraph}{}{75}{section*.451}\protected@file@percent }
\newlabel{SYSTEM:COERCE-TO-CONDITION}{{B}{75}{}{section*.452}{}}
\@writefile{toc}{\contentsline {paragraph}{}{75}{section*.452}\protected@file@percent }
\newlabel{SYSTEM:COERCE-TO-FUNCTION}{{B}{75}{}{section*.453}{}}
\@writefile{toc}{\contentsline {paragraph}{}{75}{section*.453}\protected@file@percent }
\newlabel{SYSTEM:COMPILE-FILE-IF-NEEDED}{{B}{75}{}{section*.454}{}}
\@writefile{toc}{\contentsline {paragraph}{}{75}{section*.454}\protected@file@percent }
\newlabel{EXTENSIONS:COMPILE-SYSTEM}{{B}{75}{}{section*.455}{}}
\@writefile{toc}{\contentsline {paragraph}{}{75}{section*.455}\protected@file@percent }
\newlabel{SYSTEM:COMPILED-LISP-FUNCTION-P}{{B}{75}{}{section*.456}{}}
\@writefile{toc}{\contentsline {paragraph}{}{75}{section*.456}\protected@file@percent }
\newlabel{SYSTEM:COMPILER-DEFSTRUCT}{{B}{75}{}{section*.457}{}}
\@writefile{toc}{\contentsline {paragraph}{}{75}{section*.457}\protected@file@percent }
\newlabel{SYSTEM:COMPILER-ERROR}{{B}{75}{}{section*.458}{}}
\@writefile{toc}{\contentsline {paragraph}{}{75}{section*.458}\protected@file@percent }
\newlabel{SYSTEM:COMPILER-MACROEXPAND}{{B}{75}{}{section*.459}{}}
\@writefile{toc}{\contentsline {paragraph}{}{75}{section*.459}\protected@file@percent }
\newlabel{SYSTEM:COMPILER-STYLE-WARN}{{B}{76}{}{section*.460}{}}
\@writefile{toc}{\contentsline {paragraph}{}{76}{section*.460}\protected@file@percent }
\newlabel{SYSTEM:COMPILER-SUBTYPEP}{{B}{76}{}{section*.461}{}}
\@writefile{toc}{\contentsline {paragraph}{}{76}{section*.461}\protected@file@percent }
\newlabel{SYSTEM:COMPILER-UNSUPPORTED}{{B}{76}{}{section*.462}{}}
\@writefile{toc}{\contentsline {paragraph}{}{76}{section*.462}\protected@file@percent }
\newlabel{SYSTEM:COMPILER-WARN}{{B}{76}{}{section*.463}{}}
\@writefile{toc}{\contentsline {paragraph}{}{76}{section*.463}\protected@file@percent }
\newlabel{SYSTEM:CONCATENATE-FASLS}{{B}{76}{}{section*.464}{}}
\@writefile{toc}{\contentsline {paragraph}{}{76}{section*.464}\protected@file@percent }
\newlabel{SYSTEM:DEFCONST}{{B}{76}{}{section*.465}{}}
\@writefile{toc}{\contentsline {paragraph}{}{76}{section*.465}\protected@file@percent }
\newlabel{SYSTEM:DEFINE-SOURCE-TRANSFORM}{{B}{76}{}{section*.466}{}}
\@writefile{toc}{\contentsline {paragraph}{}{76}{section*.466}\protected@file@percent }
\newlabel{SYSTEM:DEFKNOWN}{{B}{76}{}{section*.467}{}}
\@writefile{toc}{\contentsline {paragraph}{}{76}{section*.467}\protected@file@percent }
\newlabel{SYSTEM:DELETE-EQ}{{B}{76}{}{section*.468}{}}
\@writefile{toc}{\contentsline {paragraph}{}{76}{section*.468}\protected@file@percent }
\newlabel{SYSTEM:DELETE-EQL}{{B}{76}{}{section*.469}{}}
\@writefile{toc}{\contentsline {paragraph}{}{76}{section*.469}\protected@file@percent }
\newlabel{SYSTEM:DESCRIBE-COMPILER-POLICY}{{B}{76}{}{section*.470}{}}
\@writefile{toc}{\contentsline {paragraph}{}{76}{section*.470}\protected@file@percent }
\newlabel{SYSTEM:DISABLE-ZIP-CACHE}{{B}{76}{}{section*.471}{}}
\@writefile{toc}{\contentsline {paragraph}{}{76}{section*.471}\protected@file@percent }
\newlabel{SYSTEM:DISASSEMBLE-CLASS-BYTES}{{B}{76}{}{section*.472}{}}
\@writefile{toc}{\contentsline {paragraph}{}{76}{section*.472}\protected@file@percent }
\newlabel{SYSTEM:DOUBLE-FLOAT-HIGH-BITS}{{B}{76}{}{section*.473}{}}
\@writefile{toc}{\contentsline {paragraph}{}{76}{section*.473}\protected@file@percent }
\newlabel{SYSTEM:DOUBLE-FLOAT-LOW-BITS}{{B}{76}{}{section*.474}{}}
\@writefile{toc}{\contentsline {paragraph}{}{76}{section*.474}\protected@file@percent }
\newlabel{SYSTEM:DUMP-FORM}{{B}{76}{}{section*.475}{}}
\@writefile{toc}{\contentsline {paragraph}{}{76}{section*.475}\protected@file@percent }
\newlabel{SYSTEM:DUMP-UNINTERNED-SYMBOL-INDEX}{{B}{77}{}{section*.476}{}}
\@writefile{toc}{\contentsline {paragraph}{}{77}{section*.476}\protected@file@percent }
\newlabel{SYSTEM:EMPTY-ENVIRONMENT-P}{{B}{77}{}{section*.477}{}}
\@writefile{toc}{\contentsline {paragraph}{}{77}{section*.477}\protected@file@percent }
\newlabel{SYSTEM:ENVIRONMENT}{{B}{77}{}{section*.478}{}}
\@writefile{toc}{\contentsline {paragraph}{}{77}{section*.478}\protected@file@percent }
\newlabel{SYSTEM:ENVIRONMENT-ADD-FUNCTION-DEFINITION}{{B}{77}{}{section*.479}{}}
\@writefile{toc}{\contentsline {paragraph}{}{77}{section*.479}\protected@file@percent }
\newlabel{SYSTEM:ENVIRONMENT-ADD-MACRO-DEFINITION}{{B}{77}{}{section*.480}{}}
\@writefile{toc}{\contentsline {paragraph}{}{77}{section*.480}\protected@file@percent }
\newlabel{SYSTEM:ENVIRONMENT-ADD-SYMBOL-BINDING}{{B}{77}{}{section*.481}{}}
\@writefile{toc}{\contentsline {paragraph}{}{77}{section*.481}\protected@file@percent }
\newlabel{SYSTEM:ENVIRONMENT-ALL-FUNCTIONS}{{B}{77}{}{section*.482}{}}
\@writefile{toc}{\contentsline {paragraph}{}{77}{section*.482}\protected@file@percent }
\newlabel{SYSTEM:ENVIRONMENT-ALL-VARIABLES}{{B}{77}{}{section*.483}{}}
\@writefile{toc}{\contentsline {paragraph}{}{77}{section*.483}\protected@file@percent }
\newlabel{SYSTEM:ENVIRONMENT-VARIABLES}{{B}{77}{}{section*.484}{}}
\@writefile{toc}{\contentsline {paragraph}{}{77}{section*.484}\protected@file@percent }
\newlabel{SYSTEM:EXPAND-INLINE}{{B}{77}{}{section*.485}{}}
\@writefile{toc}{\contentsline {paragraph}{}{77}{section*.485}\protected@file@percent }
\newlabel{SYSTEM:EXPAND-SOURCE-TRANSFORM}{{B}{77}{}{section*.486}{}}
\@writefile{toc}{\contentsline {paragraph}{}{77}{section*.486}\protected@file@percent }
\newlabel{SYSTEM:FDEFINITION-BLOCK-NAME}{{B}{77}{}{section*.487}{}}
\@writefile{toc}{\contentsline {paragraph}{}{77}{section*.487}\protected@file@percent }
\newlabel{SYSTEM:FIND-CONTRIB}{{B}{77}{}{section*.488}{}}
\@writefile{toc}{\contentsline {paragraph}{}{77}{section*.488}\protected@file@percent }
\newlabel{ABCL-INTROSPECT/SYSTEM:FIND-LOCALS}{{B}{77}{}{section*.489}{}}
\@writefile{toc}{\contentsline {paragraph}{}{77}{section*.489}\protected@file@percent }
\newlabel{SYSTEM:FIND-SYSTEM}{{B}{77}{}{section*.490}{}}
\@writefile{toc}{\contentsline {paragraph}{}{77}{section*.490}\protected@file@percent }
\newlabel{SYSTEM:FIXNUM-CONSTANT-VALUE}{{B}{78}{}{section*.491}{}}
\@writefile{toc}{\contentsline {paragraph}{}{78}{section*.491}\protected@file@percent }
\newlabel{SYSTEM:FIXNUM-TYPE-P}{{B}{78}{}{section*.492}{}}
\@writefile{toc}{\contentsline {paragraph}{}{78}{section*.492}\protected@file@percent }
\newlabel{SYSTEM:FLOAT-INFINITY-P}{{B}{78}{}{section*.493}{}}
\@writefile{toc}{\contentsline {paragraph}{}{78}{section*.493}\protected@file@percent }
\newlabel{SYSTEM:FLOAT-NAN-P}{{B}{78}{}{section*.494}{}}
\@writefile{toc}{\contentsline {paragraph}{}{78}{section*.494}\protected@file@percent }
\newlabel{SYSTEM:FLOAT-OVERFLOW-MODE}{{B}{78}{}{section*.495}{}}
\@writefile{toc}{\contentsline {paragraph}{}{78}{section*.495}\protected@file@percent }
\newlabel{SYSTEM:FLOAT-STRING}{{B}{78}{}{section*.496}{}}
\@writefile{toc}{\contentsline {paragraph}{}{78}{section*.496}\protected@file@percent }
\newlabel{SYSTEM:FLOAT-UNDERFLOW-MODE}{{B}{78}{}{section*.497}{}}
\@writefile{toc}{\contentsline {paragraph}{}{78}{section*.497}\protected@file@percent }
\newlabel{SYSTEM:FORWARD-REFERENCED-CLASS}{{B}{78}{}{section*.498}{}}
\@writefile{toc}{\contentsline {paragraph}{}{78}{section*.498}\protected@file@percent }
\newlabel{SYSTEM:FRAME-TO-LIST}{{B}{78}{}{section*.499}{}}
\@writefile{toc}{\contentsline {paragraph}{}{78}{section*.499}\protected@file@percent }
\newlabel{SYSTEM:FRAME-TO-STRING}{{B}{78}{}{section*.500}{}}
\@writefile{toc}{\contentsline {paragraph}{}{78}{section*.500}\protected@file@percent }
\newlabel{SYSTEM:FSET}{{B}{78}{}{section*.501}{}}
\@writefile{toc}{\contentsline {paragraph}{}{78}{section*.501}\protected@file@percent }
\newlabel{SYSTEM:FTYPE-RESULT-TYPE}{{B}{78}{}{section*.502}{}}
\@writefile{toc}{\contentsline {paragraph}{}{78}{section*.502}\protected@file@percent }
\newlabel{SYSTEM:FUNCTION-PLIST}{{B}{78}{}{section*.503}{}}
\@writefile{toc}{\contentsline {paragraph}{}{78}{section*.503}\protected@file@percent }
\newlabel{SYSTEM:FUNCTION-RESULT-TYPE}{{B}{78}{}{section*.504}{}}
\@writefile{toc}{\contentsline {paragraph}{}{78}{section*.504}\protected@file@percent }
\newlabel{SYSTEM:GET-CACHED-EMF}{{B}{78}{}{section*.505}{}}
\@writefile{toc}{\contentsline {paragraph}{}{78}{section*.505}\protected@file@percent }
\newlabel{SYSTEM:GET-FUNCTION-INFO-VALUE}{{B}{78}{}{section*.506}{}}
\@writefile{toc}{\contentsline {paragraph}{}{78}{section*.506}\protected@file@percent }
\newlabel{SYSTEM:GET-INPUT-STREAM}{{B}{79}{}{section*.507}{}}
\@writefile{toc}{\contentsline {paragraph}{}{79}{section*.507}\protected@file@percent }
\newlabel{SYSTEM:GETHASH1}{{B}{79}{}{section*.508}{}}
\@writefile{toc}{\contentsline {paragraph}{}{79}{section*.508}\protected@file@percent }
\newlabel{SYSTEM:GROVEL-JAVA-DEFINITIONS-IN-FILE}{{B}{79}{}{section*.509}{}}
\@writefile{toc}{\contentsline {paragraph}{}{79}{section*.509}\protected@file@percent }
\newlabel{SYSTEM:HASH-TABLE-WEAKNESS}{{B}{79}{}{section*.510}{}}
\@writefile{toc}{\contentsline {paragraph}{}{79}{section*.510}\protected@file@percent }
\newlabel{SYSTEM:HOT-COUNT}{{B}{79}{}{section*.511}{}}
\@writefile{toc}{\contentsline {paragraph}{}{79}{section*.511}\protected@file@percent }
\newlabel{SYSTEM:IDENTITY-HASH-CODE}{{B}{79}{}{section*.512}{}}
\@writefile{toc}{\contentsline {paragraph}{}{79}{section*.512}\protected@file@percent }
\newlabel{SYSTEM:INIT-FASL}{{B}{79}{}{section*.513}{}}
\@writefile{toc}{\contentsline {paragraph}{}{79}{section*.513}\protected@file@percent }
\newlabel{SYSTEM:INLINE-EXPANSION}{{B}{79}{}{section*.514}{}}
\@writefile{toc}{\contentsline {paragraph}{}{79}{section*.514}\protected@file@percent }
\newlabel{SYSTEM:INLINE-P}{{B}{79}{}{section*.515}{}}
\@writefile{toc}{\contentsline {paragraph}{}{79}{section*.515}\protected@file@percent }
\newlabel{SYSTEM:INSPECTED-PARTS}{{B}{79}{}{section*.516}{}}
\@writefile{toc}{\contentsline {paragraph}{}{79}{section*.516}\protected@file@percent }
\newlabel{SYSTEM:INTEGER-CONSTANT-VALUE}{{B}{79}{}{section*.517}{}}
\@writefile{toc}{\contentsline {paragraph}{}{79}{section*.517}\protected@file@percent }
\newlabel{SYSTEM:INTEGER-TYPE-HIGH}{{B}{79}{}{section*.518}{}}
\@writefile{toc}{\contentsline {paragraph}{}{79}{section*.518}\protected@file@percent }
\newlabel{SYSTEM:INTEGER-TYPE-LOW}{{B}{79}{}{section*.519}{}}
\@writefile{toc}{\contentsline {paragraph}{}{79}{section*.519}\protected@file@percent }
\newlabel{SYSTEM:INTEGER-TYPE-P}{{B}{79}{}{section*.520}{}}
\@writefile{toc}{\contentsline {paragraph}{}{79}{section*.520}\protected@file@percent }
\newlabel{SYSTEM:INTERACTIVE-EVAL}{{B}{79}{}{section*.521}{}}
\@writefile{toc}{\contentsline {paragraph}{}{79}{section*.521}\protected@file@percent }
\newlabel{SYSTEM:INTERNAL-COMPILER-ERROR}{{B}{79}{}{section*.522}{}}
\@writefile{toc}{\contentsline {paragraph}{}{79}{section*.522}\protected@file@percent }
\newlabel{SYSTEM:JAR-STREAM}{{B}{80}{}{section*.523}{}}
\@writefile{toc}{\contentsline {paragraph}{}{80}{section*.523}\protected@file@percent }
\newlabel{SYSTEM:JAVA-LONG-TYPE-P}{{B}{80}{}{section*.524}{}}
\@writefile{toc}{\contentsline {paragraph}{}{80}{section*.524}\protected@file@percent }
\newlabel{SYSTEM:JAVA.CLASS.PATH}{{B}{80}{}{section*.525}{}}
\@writefile{toc}{\contentsline {paragraph}{}{80}{section*.525}\protected@file@percent }
\newlabel{SYSTEM:LAMBDA-NAME}{{B}{80}{}{section*.526}{}}
\@writefile{toc}{\contentsline {paragraph}{}{80}{section*.526}\protected@file@percent }
\newlabel{SYSTEM:LAYOUT-CLASS}{{B}{80}{}{section*.527}{}}
\@writefile{toc}{\contentsline {paragraph}{}{80}{section*.527}\protected@file@percent }
\newlabel{SYSTEM:LAYOUT-LENGTH}{{B}{80}{}{section*.528}{}}
\@writefile{toc}{\contentsline {paragraph}{}{80}{section*.528}\protected@file@percent }
\newlabel{SYSTEM:LAYOUT-SLOT-INDEX}{{B}{80}{}{section*.529}{}}
\@writefile{toc}{\contentsline {paragraph}{}{80}{section*.529}\protected@file@percent }
\newlabel{SYSTEM:LAYOUT-SLOT-LOCATION}{{B}{80}{}{section*.530}{}}
\@writefile{toc}{\contentsline {paragraph}{}{80}{section*.530}\protected@file@percent }
\newlabel{SYSTEM:LIST-DELETE-EQ}{{B}{80}{}{section*.531}{}}
\@writefile{toc}{\contentsline {paragraph}{}{80}{section*.531}\protected@file@percent }
\newlabel{SYSTEM:LIST-DELETE-EQL}{{B}{80}{}{section*.532}{}}
\@writefile{toc}{\contentsline {paragraph}{}{80}{section*.532}\protected@file@percent }
\newlabel{SYSTEM:LIST-DIRECTORY}{{B}{80}{}{section*.533}{}}
\@writefile{toc}{\contentsline {paragraph}{}{80}{section*.533}\protected@file@percent }
\newlabel{SYSTEM:LOAD-COMPILED-FUNCTION}{{B}{80}{}{section*.534}{}}
\@writefile{toc}{\contentsline {paragraph}{}{80}{section*.534}\protected@file@percent }
\newlabel{SYSTEM:LOAD-SYSTEM-FILE}{{B}{80}{}{section*.535}{}}
\@writefile{toc}{\contentsline {paragraph}{}{80}{section*.535}\protected@file@percent }
\newlabel{SYSTEM:LOGICAL-HOST-P}{{B}{80}{}{section*.536}{}}
\@writefile{toc}{\contentsline {paragraph}{}{80}{section*.536}\protected@file@percent }
\newlabel{SYSTEM:LOGICAL-PATHNAME-P}{{B}{80}{}{section*.537}{}}
\@writefile{toc}{\contentsline {paragraph}{}{80}{section*.537}\protected@file@percent }
\newlabel{SYSTEM:LOOKUP-KNOWN-SYMBOL}{{B}{81}{}{section*.538}{}}
\@writefile{toc}{\contentsline {paragraph}{}{81}{section*.538}\protected@file@percent }
\newlabel{SYSTEM:MACRO-FUNCTION-P}{{B}{81}{}{section*.539}{}}
\@writefile{toc}{\contentsline {paragraph}{}{81}{section*.539}\protected@file@percent }
\newlabel{SYSTEM:MAKE-CLOSURE}{{B}{81}{}{section*.540}{}}
\@writefile{toc}{\contentsline {paragraph}{}{81}{section*.540}\protected@file@percent }
\newlabel{SYSTEM:MAKE-COMPILER-TYPE}{{B}{81}{}{section*.541}{}}
\@writefile{toc}{\contentsline {paragraph}{}{81}{section*.541}\protected@file@percent }
\newlabel{SYSTEM:MAKE-DOUBLE-FLOAT}{{B}{81}{}{section*.542}{}}
\@writefile{toc}{\contentsline {paragraph}{}{81}{section*.542}\protected@file@percent }
\newlabel{SYSTEM:MAKE-ENVIRONMENT}{{B}{81}{}{section*.543}{}}
\@writefile{toc}{\contentsline {paragraph}{}{81}{section*.543}\protected@file@percent }
\newlabel{SYSTEM:MAKE-FILE-STREAM}{{B}{81}{}{section*.544}{}}
\@writefile{toc}{\contentsline {paragraph}{}{81}{section*.544}\protected@file@percent }
\newlabel{SYSTEM:MAKE-FILL-POINTER-OUTPUT-STREAM}{{B}{81}{}{section*.545}{}}
\@writefile{toc}{\contentsline {paragraph}{}{81}{section*.545}\protected@file@percent }
\newlabel{SYSTEM:MAKE-INTEGER-TYPE}{{B}{81}{}{section*.546}{}}
\@writefile{toc}{\contentsline {paragraph}{}{81}{section*.546}\protected@file@percent }
\newlabel{SYSTEM:MAKE-KEYWORD}{{B}{81}{}{section*.547}{}}
\@writefile{toc}{\contentsline {paragraph}{}{81}{section*.547}\protected@file@percent }
\newlabel{SYSTEM:MAKE-LAYOUT}{{B}{81}{}{section*.548}{}}
\@writefile{toc}{\contentsline {paragraph}{}{81}{section*.548}\protected@file@percent }
\newlabel{SYSTEM:MAKE-MACRO}{{B}{81}{}{section*.549}{}}
\@writefile{toc}{\contentsline {paragraph}{}{81}{section*.549}\protected@file@percent }
\newlabel{SYSTEM:MAKE-MACRO-EXPANDER}{{B}{81}{}{section*.550}{}}
\@writefile{toc}{\contentsline {paragraph}{}{81}{section*.550}\protected@file@percent }
\newlabel{SYSTEM:MAKE-SINGLE-FLOAT}{{B}{81}{}{section*.551}{}}
\@writefile{toc}{\contentsline {paragraph}{}{81}{section*.551}\protected@file@percent }
\newlabel{SYSTEM:MAKE-STRUCTURE}{{B}{81}{}{section*.552}{}}
\@writefile{toc}{\contentsline {paragraph}{}{81}{section*.552}\protected@file@percent }
\newlabel{SYSTEM:MAKE-SYMBOL-MACRO}{{B}{81}{}{section*.553}{}}
\@writefile{toc}{\contentsline {paragraph}{}{81}{section*.553}\protected@file@percent }
\newlabel{SYSTEM:MATCH-WILD-JAR-PATHNAME}{{B}{82}{}{section*.554}{}}
\@writefile{toc}{\contentsline {paragraph}{}{82}{section*.554}\protected@file@percent }
\newlabel{SYSTEM:NAMED-LAMBDA}{{B}{82}{}{section*.555}{}}
\@writefile{toc}{\contentsline {paragraph}{}{82}{section*.555}\protected@file@percent }
\newlabel{SYSTEM:NORMALIZE-TYPE}{{B}{82}{}{section*.556}{}}
\@writefile{toc}{\contentsline {paragraph}{}{82}{section*.556}\protected@file@percent }
\newlabel{SYSTEM:NOTE-NAME-DEFINED}{{B}{82}{}{section*.557}{}}
\@writefile{toc}{\contentsline {paragraph}{}{82}{section*.557}\protected@file@percent }
\newlabel{SYSTEM:NOTINLINE-P}{{B}{82}{}{section*.558}{}}
\@writefile{toc}{\contentsline {paragraph}{}{82}{section*.558}\protected@file@percent }
\newlabel{SYSTEM:OUT-SYNONYM-OF}{{B}{82}{}{section*.559}{}}
\@writefile{toc}{\contentsline {paragraph}{}{82}{section*.559}\protected@file@percent }
\newlabel{SYSTEM:OUTPUT-OBJECT}{{B}{82}{}{section*.560}{}}
\@writefile{toc}{\contentsline {paragraph}{}{82}{section*.560}\protected@file@percent }
\newlabel{SYSTEM:PACKAGE-EXTERNAL-SYMBOLS}{{B}{82}{}{section*.561}{}}
\@writefile{toc}{\contentsline {paragraph}{}{82}{section*.561}\protected@file@percent }
\newlabel{SYSTEM:PACKAGE-INHERITED-SYMBOLS}{{B}{82}{}{section*.562}{}}
\@writefile{toc}{\contentsline {paragraph}{}{82}{section*.562}\protected@file@percent }
\newlabel{SYSTEM:PACKAGE-INTERNAL-SYMBOLS}{{B}{82}{}{section*.563}{}}
\@writefile{toc}{\contentsline {paragraph}{}{82}{section*.563}\protected@file@percent }
\newlabel{SYSTEM:PACKAGE-SYMBOLS}{{B}{82}{}{section*.564}{}}
\@writefile{toc}{\contentsline {paragraph}{}{82}{section*.564}\protected@file@percent }
\newlabel{SYSTEM:PARSE-BODY}{{B}{82}{}{section*.565}{}}
\@writefile{toc}{\contentsline {paragraph}{}{82}{section*.565}\protected@file@percent }
\newlabel{EXTENSIONS:PRECOMPILE}{{B}{82}{}{section*.566}{}}
\@writefile{toc}{\contentsline {paragraph}{}{82}{section*.566}\protected@file@percent }
\newlabel{SYSTEM:PROCESS-ALIVE-P}{{B}{82}{}{section*.567}{}}
\@writefile{toc}{\contentsline {paragraph}{}{82}{section*.567}\protected@file@percent }
\newlabel{SYSTEM:PROCESS-ERROR}{{B}{82}{}{section*.568}{}}
\@writefile{toc}{\contentsline {paragraph}{}{82}{section*.568}\protected@file@percent }
\newlabel{SYSTEM:PROCESS-EXIT-CODE}{{B}{82}{}{section*.569}{}}
\@writefile{toc}{\contentsline {paragraph}{}{82}{section*.569}\protected@file@percent }
\newlabel{SYSTEM:PROCESS-INPUT}{{B}{83}{}{section*.570}{}}
\@writefile{toc}{\contentsline {paragraph}{}{83}{section*.570}\protected@file@percent }
\newlabel{SYSTEM:PROCESS-KILL}{{B}{83}{}{section*.571}{}}
\@writefile{toc}{\contentsline {paragraph}{}{83}{section*.571}\protected@file@percent }
\newlabel{SYSTEM:PROCESS-OPTIMIZATION-DECLARATIONS}{{B}{83}{}{section*.572}{}}
\@writefile{toc}{\contentsline {paragraph}{}{83}{section*.572}\protected@file@percent }
\newlabel{SYSTEM:PROCESS-OUTPUT}{{B}{83}{}{section*.573}{}}
\@writefile{toc}{\contentsline {paragraph}{}{83}{section*.573}\protected@file@percent }
\newlabel{SYSTEM:PROCESS-P}{{B}{83}{}{section*.574}{}}
\@writefile{toc}{\contentsline {paragraph}{}{83}{section*.574}\protected@file@percent }
\newlabel{SYSTEM:PROCESS-PID}{{B}{83}{}{section*.575}{}}
\@writefile{toc}{\contentsline {paragraph}{}{83}{section*.575}\protected@file@percent }
\newlabel{SYSTEM:PROCESS-WAIT}{{B}{83}{}{section*.576}{}}
\@writefile{toc}{\contentsline {paragraph}{}{83}{section*.576}\protected@file@percent }
\newlabel{SYSTEM:PROCLAIMED-FTYPE}{{B}{83}{}{section*.577}{}}
\@writefile{toc}{\contentsline {paragraph}{}{83}{section*.577}\protected@file@percent }
\newlabel{SYSTEM:PROCLAIMED-TYPE}{{B}{83}{}{section*.578}{}}
\@writefile{toc}{\contentsline {paragraph}{}{83}{section*.578}\protected@file@percent }
\newlabel{SYSTEM:PSXHASH}{{B}{83}{}{section*.579}{}}
\@writefile{toc}{\contentsline {paragraph}{}{83}{section*.579}\protected@file@percent }
\newlabel{SYSTEM:PUT}{{B}{83}{}{section*.580}{}}
\@writefile{toc}{\contentsline {paragraph}{}{83}{section*.580}\protected@file@percent }
\newlabel{SYSTEM:PUTHASH}{{B}{83}{}{section*.581}{}}
\@writefile{toc}{\contentsline {paragraph}{}{83}{section*.581}\protected@file@percent }
\newlabel{SYSTEM:READ-8-BITS}{{B}{83}{}{section*.582}{}}
\@writefile{toc}{\contentsline {paragraph}{}{83}{section*.582}\protected@file@percent }
\newlabel{SYSTEM:READ-VECTOR-UNSIGNED-BYTE-8}{{B}{83}{}{section*.583}{}}
\@writefile{toc}{\contentsline {paragraph}{}{83}{section*.583}\protected@file@percent }
\newlabel{SYSTEM:RECORD-SOURCE-INFORMATION}{{B}{83}{}{section*.584}{}}
\@writefile{toc}{\contentsline {paragraph}{}{83}{section*.584}\protected@file@percent }
\newlabel{SYSTEM:RECORD-SOURCE-INFORMATION-FOR-TYPE}{{B}{84}{}{section*.585}{}}
\@writefile{toc}{\contentsline {paragraph}{}{84}{section*.585}\protected@file@percent }
\newlabel{SYSTEM:REMEMBER}{{B}{84}{}{section*.586}{}}
\@writefile{toc}{\contentsline {paragraph}{}{84}{section*.586}\protected@file@percent }
\newlabel{SYSTEM:REMOVE-ZIP-CACHE-ENTRY}{{B}{84}{}{section*.587}{}}
\@writefile{toc}{\contentsline {paragraph}{}{84}{section*.587}\protected@file@percent }
\newlabel{SYSTEM:REQUIRE-TYPE}{{B}{84}{}{section*.588}{}}
\@writefile{toc}{\contentsline {paragraph}{}{84}{section*.588}\protected@file@percent }
\newlabel{SYSTEM:RUN-PROGRAM}{{B}{84}{}{section*.589}{}}
\@writefile{toc}{\contentsline {paragraph}{}{84}{section*.589}\protected@file@percent }
\newlabel{SYSTEM:SET-CALL-COUNT}{{B}{85}{}{section*.590}{}}
\@writefile{toc}{\contentsline {paragraph}{}{85}{section*.590}\protected@file@percent }
\newlabel{SYSTEM:SET-CAR}{{B}{85}{}{section*.591}{}}
\@writefile{toc}{\contentsline {paragraph}{}{85}{section*.591}\protected@file@percent }
\newlabel{SYSTEM:SET-CDR}{{B}{85}{}{section*.592}{}}
\@writefile{toc}{\contentsline {paragraph}{}{85}{section*.592}\protected@file@percent }
\newlabel{SYSTEM:SET-CHAR}{{B}{85}{}{section*.593}{}}
\@writefile{toc}{\contentsline {paragraph}{}{85}{section*.593}\protected@file@percent }
\newlabel{SYSTEM:SET-FUNCTION-INFO-VALUE}{{B}{85}{}{section*.594}{}}
\@writefile{toc}{\contentsline {paragraph}{}{85}{section*.594}\protected@file@percent }
\newlabel{SYSTEM:SET-HOT-COUNT}{{B}{85}{}{section*.595}{}}
\@writefile{toc}{\contentsline {paragraph}{}{85}{section*.595}\protected@file@percent }
\newlabel{SYSTEM:SET-SCHAR}{{B}{85}{}{section*.596}{}}
\@writefile{toc}{\contentsline {paragraph}{}{85}{section*.596}\protected@file@percent }
\newlabel{SYSTEM:SET-STD-SLOT-VALUE}{{B}{86}{}{section*.597}{}}
\@writefile{toc}{\contentsline {paragraph}{}{86}{section*.597}\protected@file@percent }
\newlabel{SYSTEM:SETF-FUNCTION-NAME-P}{{B}{86}{}{section*.598}{}}
\@writefile{toc}{\contentsline {paragraph}{}{86}{section*.598}\protected@file@percent }
\newlabel{SYSTEM:SHA256}{{B}{86}{}{section*.599}{}}
\@writefile{toc}{\contentsline {paragraph}{}{86}{section*.599}\protected@file@percent }
\newlabel{SYSTEM:SHRINK-VECTOR}{{B}{86}{}{section*.600}{}}
\@writefile{toc}{\contentsline {paragraph}{}{86}{section*.600}\protected@file@percent }
\newlabel{SYSTEM:SIMPLE-FORMAT}{{B}{86}{}{section*.601}{}}
\@writefile{toc}{\contentsline {paragraph}{}{86}{section*.601}\protected@file@percent }
\newlabel{SYSTEM:SIMPLE-SEARCH}{{B}{86}{}{section*.602}{}}
\@writefile{toc}{\contentsline {paragraph}{}{86}{section*.602}\protected@file@percent }
\newlabel{SYSTEM:SIMPLE-TYPEP}{{B}{86}{}{section*.603}{}}
\@writefile{toc}{\contentsline {paragraph}{}{86}{section*.603}\protected@file@percent }
\newlabel{SYSTEM:SINGLE-FLOAT-BITS}{{B}{86}{}{section*.604}{}}
\@writefile{toc}{\contentsline {paragraph}{}{86}{section*.604}\protected@file@percent }
\newlabel{SYSTEM:SLOT-DEFINITION}{{B}{86}{}{section*.605}{}}
\@writefile{toc}{\contentsline {paragraph}{}{86}{section*.605}\protected@file@percent }
\newlabel{SYSTEM:SOURCE-TRANSFORM}{{B}{86}{}{section*.606}{}}
\@writefile{toc}{\contentsline {paragraph}{}{86}{section*.606}\protected@file@percent }
\newlabel{SYSTEM:STANDARD-INSTANCE-ACCESS}{{B}{86}{}{section*.607}{}}
\@writefile{toc}{\contentsline {paragraph}{}{86}{section*.607}\protected@file@percent }
\newlabel{SYSTEM:STANDARD-OBJECT-P}{{B}{86}{}{section*.608}{}}
\@writefile{toc}{\contentsline {paragraph}{}{86}{section*.608}\protected@file@percent }
\newlabel{SYSTEM:STD-INSTANCE-CLASS}{{B}{86}{}{section*.609}{}}
\@writefile{toc}{\contentsline {paragraph}{}{86}{section*.609}\protected@file@percent }
\newlabel{SYSTEM:STD-INSTANCE-LAYOUT}{{B}{86}{}{section*.610}{}}
\@writefile{toc}{\contentsline {paragraph}{}{86}{section*.610}\protected@file@percent }
\newlabel{SYSTEM:STD-SLOT-BOUNDP}{{B}{86}{}{section*.611}{}}
\@writefile{toc}{\contentsline {paragraph}{}{86}{section*.611}\protected@file@percent }
\newlabel{SYSTEM:STD-SLOT-VALUE}{{B}{86}{}{section*.612}{}}
\@writefile{toc}{\contentsline {paragraph}{}{86}{section*.612}\protected@file@percent }
\newlabel{SYSTEM:STRUCTURE-LENGTH}{{B}{87}{}{section*.613}{}}
\@writefile{toc}{\contentsline {paragraph}{}{87}{section*.613}\protected@file@percent }
\newlabel{SYSTEM:STRUCTURE-OBJECT-P}{{B}{87}{}{section*.614}{}}
\@writefile{toc}{\contentsline {paragraph}{}{87}{section*.614}\protected@file@percent }
\newlabel{SYSTEM:STRUCTURE-REF}{{B}{87}{}{section*.615}{}}
\@writefile{toc}{\contentsline {paragraph}{}{87}{section*.615}\protected@file@percent }
\newlabel{SYSTEM:STRUCTURE-SET}{{B}{87}{}{section*.616}{}}
\@writefile{toc}{\contentsline {paragraph}{}{87}{section*.616}\protected@file@percent }
\newlabel{SYSTEM:SUBCLASSP}{{B}{87}{}{section*.617}{}}
\@writefile{toc}{\contentsline {paragraph}{}{87}{section*.617}\protected@file@percent }
\newlabel{SYSTEM:SVSET}{{B}{87}{}{section*.618}{}}
\@writefile{toc}{\contentsline {paragraph}{}{87}{section*.618}\protected@file@percent }
\newlabel{SYSTEM:SWAP-SLOTS}{{B}{87}{}{section*.619}{}}
\@writefile{toc}{\contentsline {paragraph}{}{87}{section*.619}\protected@file@percent }
\newlabel{SYSTEM:SYMBOL-MACRO-P}{{B}{87}{}{section*.620}{}}
\@writefile{toc}{\contentsline {paragraph}{}{87}{section*.620}\protected@file@percent }
\newlabel{SYSTEM:SYSTEM-ARTIFACTS-ARE-JARS-P}{{B}{87}{}{section*.621}{}}
\@writefile{toc}{\contentsline {paragraph}{}{87}{section*.621}\protected@file@percent }
\newlabel{SYSTEM:UNDEFINED-FUNCTION-CALLED}{{B}{87}{}{section*.622}{}}
\@writefile{toc}{\contentsline {paragraph}{}{87}{section*.622}\protected@file@percent }
\newlabel{SYSTEM:UNTRACED-FUNCTION}{{B}{87}{}{section*.623}{}}
\@writefile{toc}{\contentsline {paragraph}{}{87}{section*.623}\protected@file@percent }
\newlabel{SYSTEM:UNZIP}{{B}{87}{}{section*.624}{}}
\@writefile{toc}{\contentsline {paragraph}{}{87}{section*.624}\protected@file@percent }
\newlabel{SYSTEM:URL-STREAM}{{B}{87}{}{section*.625}{}}
\@writefile{toc}{\contentsline {paragraph}{}{87}{section*.625}\protected@file@percent }
\newlabel{SYSTEM:VECTOR-DELETE-EQ}{{B}{87}{}{section*.626}{}}
\@writefile{toc}{\contentsline {paragraph}{}{87}{section*.626}\protected@file@percent }
\newlabel{SYSTEM:VECTOR-DELETE-EQL}{{B}{87}{}{section*.627}{}}
\@writefile{toc}{\contentsline {paragraph}{}{87}{section*.627}\protected@file@percent }
\newlabel{SYSTEM:WHITESPACEP}{{B}{87}{}{section*.628}{}}
\@writefile{toc}{\contentsline {paragraph}{}{87}{section*.628}\protected@file@percent }
\newlabel{SYSTEM:WRITE-8-BITS}{{B}{88}{}{section*.629}{}}
\@writefile{toc}{\contentsline {paragraph}{}{88}{section*.629}\protected@file@percent }
\newlabel{SYSTEM:WRITE-VECTOR-UNSIGNED-BYTE-8}{{B}{88}{}{section*.630}{}}
\@writefile{toc}{\contentsline {paragraph}{}{88}{section*.630}\protected@file@percent }
\newlabel{SYSTEM:ZIP}{{B}{88}{}{section*.631}{}}
\@writefile{toc}{\contentsline {paragraph}{}{88}{section*.631}\protected@file@percent }
\@setckpt{system}{
\setcounter{page}{89}
\setcounter{equation}{0}
\setcounter{enumi}{6}
\setcounter{enumii}{0}
\setcounter{enumiii}{0}
\setcounter{enumiv}{0}
\setcounter{footnote}{0}
\setcounter{mpfootnote}{0}
\setcounter{part}{0}
\setcounter{chapter}{2}
\setcounter{section}{0}
\setcounter{subsection}{0}
\setcounter{subsubsection}{0}
\setcounter{paragraph}{0}
\setcounter{subparagraph}{0}
\setcounter{figure}{0}
\setcounter{table}{0}
\setcounter{Item}{6}
\setcounter{Hfootnote}{28}
\setcounter{bookmark@seq@number}{68}
\setcounter{lstnumber}{38}
\setcounter{cp@cntr}{0}
\setcounter{section@level}{4}
\setcounter{lstlisting}{0}
}
