\relax 
\providecommand\hyper@newdestlabel[2]{}
\newlabel{EXTENSIONS:CADDR}{{3.4.3}{33}{}{section*.120}{}}
\@writefile{toc}{\contentsline {paragraph}{}{33}{section*.120}\protected@file@percent }
\newlabel{EXTENSIONS:CADR}{{3.4.3}{33}{}{section*.121}{}}
\@writefile{toc}{\contentsline {paragraph}{}{33}{section*.121}\protected@file@percent }
\newlabel{EXTENSIONS:CAR}{{3.4.3}{33}{}{section*.122}{}}
\@writefile{toc}{\contentsline {paragraph}{}{33}{section*.122}\protected@file@percent }
\newlabel{EXTENSIONS:CDR}{{3.4.3}{33}{}{section*.123}{}}
\@writefile{toc}{\contentsline {paragraph}{}{33}{section*.123}\protected@file@percent }
\newlabel{EXTENSIONS:*AUTOLOAD-VERBOSE*}{{3.4.3}{33}{}{section*.124}{}}
\@writefile{toc}{\contentsline {paragraph}{}{33}{section*.124}\protected@file@percent }
\newlabel{EXTENSIONS:*BATCH-MODE*}{{3.4.3}{33}{}{section*.125}{}}
\@writefile{toc}{\contentsline {paragraph}{}{33}{section*.125}\protected@file@percent }
\newlabel{EXTENSIONS:*COMMAND-LINE-ARGUMENT-LIST*}{{3.4.3}{33}{}{section*.126}{}}
\@writefile{toc}{\contentsline {paragraph}{}{33}{section*.126}\protected@file@percent }
\newlabel{EXTENSIONS:*DEBUG-CONDITION*}{{3.4.3}{33}{}{section*.127}{}}
\@writefile{toc}{\contentsline {paragraph}{}{33}{section*.127}\protected@file@percent }
\newlabel{EXTENSIONS:*DEBUG-LEVEL*}{{3.4.3}{33}{}{section*.128}{}}
\@writefile{toc}{\contentsline {paragraph}{}{33}{section*.128}\protected@file@percent }
\newlabel{EXTENSIONS:*DISASSEMBLER*}{{3.4.3}{33}{}{section*.129}{}}
\@writefile{toc}{\contentsline {paragraph}{}{33}{section*.129}\protected@file@percent }
\newlabel{EXTENSIONS:*ED-FUNCTIONS*}{{3.4.3}{33}{}{section*.130}{}}
\@writefile{toc}{\contentsline {paragraph}{}{33}{section*.130}\protected@file@percent }
\newlabel{EXTENSIONS:*ENABLE-INLINE-EXPANSION*}{{3.4.3}{33}{}{section*.131}{}}
\@writefile{toc}{\contentsline {paragraph}{}{33}{section*.131}\protected@file@percent }
\newlabel{EXTENSIONS:*INSPECTOR-HOOK*}{{3.4.3}{33}{}{section*.132}{}}
\@writefile{toc}{\contentsline {paragraph}{}{33}{section*.132}\protected@file@percent }
\newlabel{EXTENSIONS:*LISP-HOME*}{{3.4.3}{33}{}{section*.133}{}}
\@writefile{toc}{\contentsline {paragraph}{}{33}{section*.133}\protected@file@percent }
\newlabel{EXTENSIONS:*LOAD-TRUENAME-FASL*}{{3.4.3}{33}{}{section*.134}{}}
\@writefile{toc}{\contentsline {paragraph}{}{33}{section*.134}\protected@file@percent }
\newlabel{EXTENSIONS:*PRINT-STRUCTURE*}{{3.4.3}{33}{}{section*.135}{}}
\@writefile{toc}{\contentsline {paragraph}{}{33}{section*.135}\protected@file@percent }
\newlabel{EXTENSIONS:*REQUIRE-STACK-FRAME*}{{3.4.3}{34}{}{section*.136}{}}
\@writefile{toc}{\contentsline {paragraph}{}{34}{section*.136}\protected@file@percent }
\newlabel{EXTENSIONS:*SAVED-BACKTRACE*}{{3.4.3}{34}{}{section*.137}{}}
\@writefile{toc}{\contentsline {paragraph}{}{34}{section*.137}\protected@file@percent }
\newlabel{EXTENSIONS:*SUPPRESS-COMPILER-WARNINGS*}{{3.4.3}{34}{}{section*.138}{}}
\@writefile{toc}{\contentsline {paragraph}{}{34}{section*.138}\protected@file@percent }
\newlabel{EXTENSIONS:*WARN-ON-REDEFINITION*}{{3.4.3}{34}{}{section*.139}{}}
\@writefile{toc}{\contentsline {paragraph}{}{34}{section*.139}\protected@file@percent }
\newlabel{EXTENSIONS:ADD-PACKAGE-LOCAL-NICKNAME}{{3.4.3}{34}{}{section*.140}{}}
\@writefile{toc}{\contentsline {paragraph}{}{34}{section*.140}\protected@file@percent }
\newlabel{EXTENSIONS:ADJOIN-EQL}{{3.4.3}{34}{}{section*.141}{}}
\@writefile{toc}{\contentsline {paragraph}{}{34}{section*.141}\protected@file@percent }
\newlabel{EXTENSIONS:ARGLIST}{{3.4.3}{34}{}{section*.142}{}}
\@writefile{toc}{\contentsline {paragraph}{}{34}{section*.142}\protected@file@percent }
\newlabel{EXTENSIONS:AS-JAR-PATHNAME-ARCHIVE}{{3.4.3}{34}{}{section*.143}{}}
\@writefile{toc}{\contentsline {paragraph}{}{34}{section*.143}\protected@file@percent }
\newlabel{EXTENSIONS:ASSQ}{{3.4.3}{34}{}{section*.144}{}}
\@writefile{toc}{\contentsline {paragraph}{}{34}{section*.144}\protected@file@percent }
\newlabel{EXTENSIONS:ASSQL}{{3.4.3}{34}{}{section*.145}{}}
\@writefile{toc}{\contentsline {paragraph}{}{34}{section*.145}\protected@file@percent }
\newlabel{EXTENSIONS:AUTOLOAD}{{3.4.3}{34}{}{section*.146}{}}
\@writefile{toc}{\contentsline {paragraph}{}{34}{section*.146}\protected@file@percent }
\newlabel{EXTENSIONS:AUTOLOAD-MACRO}{{3.4.3}{34}{}{section*.147}{}}
\@writefile{toc}{\contentsline {paragraph}{}{34}{section*.147}\protected@file@percent }
\newlabel{EXTENSIONS:AUTOLOAD-REF-P}{{3.4.3}{34}{}{section*.148}{}}
\@writefile{toc}{\contentsline {paragraph}{}{34}{section*.148}\protected@file@percent }
\newlabel{EXTENSIONS:AUTOLOAD-SETF-EXPANDER}{{3.4.3}{34}{}{section*.149}{}}
\@writefile{toc}{\contentsline {paragraph}{}{34}{section*.149}\protected@file@percent }
\newlabel{EXTENSIONS:AUTOLOAD-SETF-FUNCTION}{{3.4.3}{34}{}{section*.150}{}}
\@writefile{toc}{\contentsline {paragraph}{}{34}{section*.150}\protected@file@percent }
\newlabel{EXTENSIONS:AUTOLOADP}{{3.4.3}{35}{}{section*.151}{}}
\@writefile{toc}{\contentsline {paragraph}{}{35}{section*.151}\protected@file@percent }
\newlabel{EXTENSIONS:CANCEL-FINALIZATION}{{3.4.3}{35}{}{section*.152}{}}
\@writefile{toc}{\contentsline {paragraph}{}{35}{section*.152}\protected@file@percent }
\newlabel{EXTENSIONS:CHAR-TO-UTF8}{{3.4.3}{35}{}{section*.153}{}}
\@writefile{toc}{\contentsline {paragraph}{}{35}{section*.153}\protected@file@percent }
\newlabel{EXTENSIONS:CHARPOS}{{3.4.3}{35}{}{section*.154}{}}
\@writefile{toc}{\contentsline {paragraph}{}{35}{section*.154}\protected@file@percent }
\newlabel{EXTENSIONS:CLASSP}{{3.4.3}{35}{}{section*.155}{}}
\@writefile{toc}{\contentsline {paragraph}{}{35}{section*.155}\protected@file@percent }
\newlabel{EXTENSIONS:COLLECT}{{3.4.3}{35}{}{section*.156}{}}
\@writefile{toc}{\contentsline {paragraph}{}{35}{section*.156}\protected@file@percent }
\newlabel{EXTENSIONS:COMPILE-SYSTEM}{{3.4.3}{35}{}{section*.157}{}}
\@writefile{toc}{\contentsline {paragraph}{}{35}{section*.157}\protected@file@percent }
\newlabel{EXTENSIONS:DOUBLE-FLOAT-NEGATIVE-INFINITY}{{3.4.3}{35}{}{section*.158}{}}
\@writefile{toc}{\contentsline {paragraph}{}{35}{section*.158}\protected@file@percent }
\newlabel{EXTENSIONS:DOUBLE-FLOAT-POSITIVE-INFINITY}{{3.4.3}{35}{}{section*.159}{}}
\@writefile{toc}{\contentsline {paragraph}{}{35}{section*.159}\protected@file@percent }
\newlabel{EXTENSIONS:DUMP-JAVA-STACK}{{3.4.3}{35}{}{section*.160}{}}
\@writefile{toc}{\contentsline {paragraph}{}{35}{section*.160}\protected@file@percent }
\newlabel{EXTENSIONS:EXIT}{{3.4.3}{35}{}{section*.161}{}}
\@writefile{toc}{\contentsline {paragraph}{}{35}{section*.161}\protected@file@percent }
\newlabel{EXTENSIONS:FEATUREP}{{3.4.3}{36}{}{section*.162}{}}
\@writefile{toc}{\contentsline {paragraph}{}{36}{section*.162}\protected@file@percent }
\newlabel{EXTENSIONS:FILE-DIRECTORY-P}{{3.4.3}{36}{}{section*.163}{}}
\@writefile{toc}{\contentsline {paragraph}{}{36}{section*.163}\protected@file@percent }
\newlabel{EXTENSIONS:FINALIZE}{{3.4.3}{36}{}{section*.164}{}}
\@writefile{toc}{\contentsline {paragraph}{}{36}{section*.164}\protected@file@percent }
\newlabel{EXTENSIONS:FIXNUMP}{{3.4.3}{36}{}{section*.165}{}}
\@writefile{toc}{\contentsline {paragraph}{}{36}{section*.165}\protected@file@percent }
\newlabel{EXTENSIONS:GC}{{3.4.3}{36}{}{section*.166}{}}
\@writefile{toc}{\contentsline {paragraph}{}{36}{section*.166}\protected@file@percent }
\newlabel{EXTENSIONS:GET-FLOATING-POINT-MODES}{{3.4.3}{36}{}{section*.167}{}}
\@writefile{toc}{\contentsline {paragraph}{}{36}{section*.167}\protected@file@percent }
\newlabel{EXTENSIONS:GET-PID}{{3.4.3}{36}{}{section*.168}{}}
\@writefile{toc}{\contentsline {paragraph}{}{36}{section*.168}\protected@file@percent }
\newlabel{EXTENSIONS:GET-SOCKET-STREAM}{{3.4.3}{36}{}{section*.169}{}}
\@writefile{toc}{\contentsline {paragraph}{}{36}{section*.169}\protected@file@percent }
\newlabel{EXTENSIONS:GET-TIME-ZONE}{{3.4.3}{36}{}{section*.170}{}}
\@writefile{toc}{\contentsline {paragraph}{}{36}{section*.170}\protected@file@percent }
\newlabel{EXTENSIONS:GETENV}{{3.4.3}{36}{}{section*.171}{}}
\@writefile{toc}{\contentsline {paragraph}{}{36}{section*.171}\protected@file@percent }
\newlabel{EXTENSIONS:GETENV-ALL}{{3.4.3}{36}{}{section*.172}{}}
\@writefile{toc}{\contentsline {paragraph}{}{36}{section*.172}\protected@file@percent }
\newlabel{EXTENSIONS:INIT-GUI}{{3.4.3}{36}{}{section*.173}{}}
\@writefile{toc}{\contentsline {paragraph}{}{36}{section*.173}\protected@file@percent }
\newlabel{EXTENSIONS:INTERRUPT-LISP}{{3.4.3}{36}{}{section*.174}{}}
\@writefile{toc}{\contentsline {paragraph}{}{36}{section*.174}\protected@file@percent }
\newlabel{EXTENSIONS:JAR-PATHNAME}{{3.4.3}{36}{}{section*.175}{}}
\@writefile{toc}{\contentsline {paragraph}{}{36}{section*.175}\protected@file@percent }
\newlabel{EXTENSIONS:MACROEXPAND-ALL}{{3.4.3}{37}{}{section*.176}{}}
\@writefile{toc}{\contentsline {paragraph}{}{37}{section*.176}\protected@file@percent }
\newlabel{EXTENSIONS:MAILBOX}{{3.4.3}{37}{}{section*.177}{}}
\@writefile{toc}{\contentsline {paragraph}{}{37}{section*.177}\protected@file@percent }
\newlabel{EXTENSIONS:MAKE-DIALOG-PROMPT-STREAM}{{3.4.3}{37}{}{section*.178}{}}
\@writefile{toc}{\contentsline {paragraph}{}{37}{section*.178}\protected@file@percent }
\newlabel{EXTENSIONS:MAKE-SERVER-SOCKET}{{3.4.3}{37}{}{section*.179}{}}
\@writefile{toc}{\contentsline {paragraph}{}{37}{section*.179}\protected@file@percent }
\newlabel{EXTENSIONS:MAKE-SLIME-INPUT-STREAM}{{3.4.3}{37}{}{section*.180}{}}
\@writefile{toc}{\contentsline {paragraph}{}{37}{section*.180}\protected@file@percent }
\newlabel{EXTENSIONS:MAKE-SLIME-OUTPUT-STREAM}{{3.4.3}{37}{}{section*.181}{}}
\@writefile{toc}{\contentsline {paragraph}{}{37}{section*.181}\protected@file@percent }
\newlabel{EXTENSIONS:MAKE-SOCKET}{{3.4.3}{37}{}{section*.182}{}}
\@writefile{toc}{\contentsline {paragraph}{}{37}{section*.182}\protected@file@percent }
\newlabel{EXTENSIONS:MAKE-TEMP-DIRECTORY}{{3.4.3}{37}{}{section*.183}{}}
\@writefile{toc}{\contentsline {paragraph}{}{37}{section*.183}\protected@file@percent }
\newlabel{EXTENSIONS:MAKE-TEMP-FILE}{{3.4.3}{37}{}{section*.184}{}}
\@writefile{toc}{\contentsline {paragraph}{}{37}{section*.184}\protected@file@percent }
\newlabel{EXTENSIONS:MAKE-WEAK-REFERENCE}{{3.4.3}{37}{}{section*.185}{}}
\@writefile{toc}{\contentsline {paragraph}{}{37}{section*.185}\protected@file@percent }
\newlabel{EXTENSIONS:MEMQ}{{3.4.3}{37}{}{section*.186}{}}
\@writefile{toc}{\contentsline {paragraph}{}{37}{section*.186}\protected@file@percent }
\newlabel{EXTENSIONS:MEMQL}{{3.4.3}{37}{}{section*.187}{}}
\@writefile{toc}{\contentsline {paragraph}{}{37}{section*.187}\protected@file@percent }
\newlabel{EXTENSIONS:MOST-NEGATIVE-JAVA-LONG}{{3.4.3}{37}{}{section*.188}{}}
\@writefile{toc}{\contentsline {paragraph}{}{37}{section*.188}\protected@file@percent }
\newlabel{EXTENSIONS:MOST-POSITIVE-JAVA-LONG}{{3.4.3}{37}{}{section*.189}{}}
\@writefile{toc}{\contentsline {paragraph}{}{37}{section*.189}\protected@file@percent }
\newlabel{EXTENSIONS:MUTEX}{{3.4.3}{37}{}{section*.190}{}}
\@writefile{toc}{\contentsline {paragraph}{}{37}{section*.190}\protected@file@percent }
\newlabel{EXTENSIONS:NEQ}{{3.4.3}{37}{}{section*.191}{}}
\@writefile{toc}{\contentsline {paragraph}{}{37}{section*.191}\protected@file@percent }
\newlabel{EXTENSIONS:NIL-VECTOR}{{3.4.3}{38}{}{section*.192}{}}
\@writefile{toc}{\contentsline {paragraph}{}{38}{section*.192}\protected@file@percent }
\newlabel{EXTENSIONS:OS-UNIX-P}{{3.4.3}{38}{}{section*.193}{}}
\@writefile{toc}{\contentsline {paragraph}{}{38}{section*.193}\protected@file@percent }
\newlabel{EXTENSIONS:OS-WINDOWS-P}{{3.4.3}{38}{}{section*.194}{}}
\@writefile{toc}{\contentsline {paragraph}{}{38}{section*.194}\protected@file@percent }
\newlabel{EXTENSIONS:PACKAGE-LOCAL-NICKNAMES}{{3.4.3}{38}{}{section*.195}{}}
\@writefile{toc}{\contentsline {paragraph}{}{38}{section*.195}\protected@file@percent }
\newlabel{EXTENSIONS:PACKAGE-LOCALLY-NICKNAMED-BY-LIST}{{3.4.3}{38}{}{section*.196}{}}
\@writefile{toc}{\contentsline {paragraph}{}{38}{section*.196}\protected@file@percent }
\newlabel{EXTENSIONS:PATHNAME-JAR-P}{{3.4.3}{38}{}{section*.197}{}}
\@writefile{toc}{\contentsline {paragraph}{}{38}{section*.197}\protected@file@percent }
\newlabel{EXTENSIONS:PATHNAME-URL-P}{{3.4.3}{38}{}{section*.198}{}}
\@writefile{toc}{\contentsline {paragraph}{}{38}{section*.198}\protected@file@percent }
\newlabel{EXTENSIONS:PRECOMPILE}{{3.4.3}{38}{}{section*.199}{}}
\@writefile{toc}{\contentsline {paragraph}{}{38}{section*.199}\protected@file@percent }
\newlabel{EXTENSIONS:PROBE-DIRECTORY}{{3.4.3}{38}{}{section*.200}{}}
\@writefile{toc}{\contentsline {paragraph}{}{38}{section*.200}\protected@file@percent }
\newlabel{EXTENSIONS:QUIT}{{3.4.3}{38}{}{section*.201}{}}
\@writefile{toc}{\contentsline {paragraph}{}{38}{section*.201}\protected@file@percent }
\newlabel{EXTENSIONS:READ-CLASS}{{3.4.3}{38}{}{section*.202}{}}
\@writefile{toc}{\contentsline {paragraph}{}{38}{section*.202}\protected@file@percent }
\newlabel{EXTENSIONS:READ-TIMEOUT}{{3.4.3}{38}{}{section*.203}{}}
\@writefile{toc}{\contentsline {paragraph}{}{38}{section*.203}\protected@file@percent }
\newlabel{EXTENSIONS:REMOVE-PACKAGE-LOCAL-NICKNAME}{{3.4.3}{38}{}{section*.204}{}}
\@writefile{toc}{\contentsline {paragraph}{}{38}{section*.204}\protected@file@percent }
\newlabel{EXTENSIONS:RESOLVE}{{3.4.3}{38}{}{section*.205}{}}
\@writefile{toc}{\contentsline {paragraph}{}{38}{section*.205}\protected@file@percent }
\newlabel{EXTENSIONS:RUN-SHELL-COMMAND}{{3.4.3}{38}{}{section*.206}{}}
\@writefile{toc}{\contentsline {paragraph}{}{38}{section*.206}\protected@file@percent }
\newlabel{EXTENSIONS:SERVER-SOCKET-CLOSE}{{3.4.3}{39}{}{section*.207}{}}
\@writefile{toc}{\contentsline {paragraph}{}{39}{section*.207}\protected@file@percent }
\newlabel{EXTENSIONS:SET-FLOATING-POINT-MODES}{{3.4.3}{39}{}{section*.208}{}}
\@writefile{toc}{\contentsline {paragraph}{}{39}{section*.208}\protected@file@percent }
\newlabel{EXTENSIONS:SHOW-RESTARTS}{{3.4.3}{39}{}{section*.209}{}}
\@writefile{toc}{\contentsline {paragraph}{}{39}{section*.209}\protected@file@percent }
\newlabel{EXTENSIONS:SIMPLE-STRING-FILL}{{3.4.3}{39}{}{section*.210}{}}
\@writefile{toc}{\contentsline {paragraph}{}{39}{section*.210}\protected@file@percent }
\newlabel{EXTENSIONS:SIMPLE-STRING-SEARCH}{{3.4.3}{39}{}{section*.211}{}}
\@writefile{toc}{\contentsline {paragraph}{}{39}{section*.211}\protected@file@percent }
\newlabel{EXTENSIONS:SINGLE-FLOAT-NEGATIVE-INFINITY}{{3.4.3}{39}{}{section*.212}{}}
\@writefile{toc}{\contentsline {paragraph}{}{39}{section*.212}\protected@file@percent }
\newlabel{EXTENSIONS:SINGLE-FLOAT-POSITIVE-INFINITY}{{3.4.3}{39}{}{section*.213}{}}
\@writefile{toc}{\contentsline {paragraph}{}{39}{section*.213}\protected@file@percent }
\newlabel{EXTENSIONS:SLIME-INPUT-STREAM}{{3.4.3}{39}{}{section*.214}{}}
\@writefile{toc}{\contentsline {paragraph}{}{39}{section*.214}\protected@file@percent }
\newlabel{EXTENSIONS:SLIME-OUTPUT-STREAM}{{3.4.3}{39}{}{section*.215}{}}
\@writefile{toc}{\contentsline {paragraph}{}{39}{section*.215}\protected@file@percent }
\newlabel{EXTENSIONS:SOCKET-ACCEPT}{{3.4.3}{39}{}{section*.216}{}}
\@writefile{toc}{\contentsline {paragraph}{}{39}{section*.216}\protected@file@percent }
\newlabel{EXTENSIONS:SOCKET-CLOSE}{{3.4.3}{39}{}{section*.217}{}}
\@writefile{toc}{\contentsline {paragraph}{}{39}{section*.217}\protected@file@percent }
\newlabel{EXTENSIONS:SOCKET-LOCAL-ADDRESS}{{3.4.3}{39}{}{section*.218}{}}
\@writefile{toc}{\contentsline {paragraph}{}{39}{section*.218}\protected@file@percent }
\newlabel{EXTENSIONS:SOCKET-LOCAL-PORT}{{3.4.3}{39}{}{section*.219}{}}
\@writefile{toc}{\contentsline {paragraph}{}{39}{section*.219}\protected@file@percent }
\newlabel{EXTENSIONS:SOCKET-PEER-ADDRESS}{{3.4.3}{39}{}{section*.220}{}}
\@writefile{toc}{\contentsline {paragraph}{}{39}{section*.220}\protected@file@percent }
\newlabel{EXTENSIONS:SOCKET-PEER-PORT}{{3.4.3}{39}{}{section*.221}{}}
\@writefile{toc}{\contentsline {paragraph}{}{39}{section*.221}\protected@file@percent }
\newlabel{EXTENSIONS:SOURCE}{{3.4.3}{39}{}{section*.222}{}}
\@writefile{toc}{\contentsline {paragraph}{}{39}{section*.222}\protected@file@percent }
\newlabel{EXTENSIONS:SOURCE-FILE-POSITION}{{3.4.3}{40}{}{section*.223}{}}
\@writefile{toc}{\contentsline {paragraph}{}{40}{section*.223}\protected@file@percent }
\newlabel{EXTENSIONS:SOURCE-PATHNAME}{{3.4.3}{40}{}{section*.224}{}}
\@writefile{toc}{\contentsline {paragraph}{}{40}{section*.224}\protected@file@percent }
\newlabel{EXTENSIONS:SPECIAL-VARIABLE-P}{{3.4.3}{40}{}{section*.225}{}}
\@writefile{toc}{\contentsline {paragraph}{}{40}{section*.225}\protected@file@percent }
\newlabel{EXTENSIONS:STREAM-UNIX-FD}{{3.4.3}{40}{}{section*.226}{}}
\@writefile{toc}{\contentsline {paragraph}{}{40}{section*.226}\protected@file@percent }
\newlabel{EXTENSIONS:STRING-FIND}{{3.4.3}{40}{}{section*.227}{}}
\@writefile{toc}{\contentsline {paragraph}{}{40}{section*.227}\protected@file@percent }
\newlabel{EXTENSIONS:STRING-INPUT-STREAM-CURRENT}{{3.4.3}{40}{}{section*.228}{}}
\@writefile{toc}{\contentsline {paragraph}{}{40}{section*.228}\protected@file@percent }
\newlabel{EXTENSIONS:STRING-POSITION}{{3.4.3}{40}{}{section*.229}{}}
\@writefile{toc}{\contentsline {paragraph}{}{40}{section*.229}\protected@file@percent }
\newlabel{EXTENSIONS:STYLE-WARN}{{3.4.3}{40}{}{section*.230}{}}
\@writefile{toc}{\contentsline {paragraph}{}{40}{section*.230}\protected@file@percent }
\newlabel{EXTENSIONS:TRULY-THE}{{3.4.3}{40}{}{section*.231}{}}
\@writefile{toc}{\contentsline {paragraph}{}{40}{section*.231}\protected@file@percent }
\newlabel{EXTENSIONS:UPTIME}{{3.4.3}{40}{}{section*.232}{}}
\@writefile{toc}{\contentsline {paragraph}{}{40}{section*.232}\protected@file@percent }
\newlabel{EXTENSIONS:URI-DECODE}{{3.4.3}{40}{}{section*.233}{}}
\@writefile{toc}{\contentsline {paragraph}{}{40}{section*.233}\protected@file@percent }
\newlabel{EXTENSIONS:URI-ENCODE}{{3.4.3}{40}{}{section*.234}{}}
\@writefile{toc}{\contentsline {paragraph}{}{40}{section*.234}\protected@file@percent }
\newlabel{EXTENSIONS:URL-PATHNAME}{{3.4.3}{40}{}{section*.235}{}}
\@writefile{toc}{\contentsline {paragraph}{}{40}{section*.235}\protected@file@percent }
\newlabel{EXTENSIONS:URL-PATHNAME-AUTHORITY}{{3.4.3}{40}{}{section*.236}{}}
\@writefile{toc}{\contentsline {paragraph}{}{40}{section*.236}\protected@file@percent }
\newlabel{EXTENSIONS:URL-PATHNAME-FRAGMENT}{{3.4.3}{40}{}{section*.237}{}}
\@writefile{toc}{\contentsline {paragraph}{}{40}{section*.237}\protected@file@percent }
\newlabel{EXTENSIONS:URL-PATHNAME-QUERY}{{3.4.3}{40}{}{section*.238}{}}
\@writefile{toc}{\contentsline {paragraph}{}{40}{section*.238}\protected@file@percent }
\newlabel{EXTENSIONS:URL-PATHNAME-SCHEME}{{3.4.3}{41}{}{section*.239}{}}
\@writefile{toc}{\contentsline {paragraph}{}{41}{section*.239}\protected@file@percent }
\newlabel{EXTENSIONS:WEAK-REFERENCE}{{3.4.3}{41}{}{section*.240}{}}
\@writefile{toc}{\contentsline {paragraph}{}{41}{section*.240}\protected@file@percent }
\newlabel{EXTENSIONS:WEAK-REFERENCE-VALUE}{{3.4.3}{41}{}{section*.241}{}}
\@writefile{toc}{\contentsline {paragraph}{}{41}{section*.241}\protected@file@percent }
\newlabel{EXTENSIONS:WRITE-CLASS}{{3.4.3}{41}{}{section*.242}{}}
\@writefile{toc}{\contentsline {paragraph}{}{41}{section*.242}\protected@file@percent }
\newlabel{EXTENSIONS:WRITE-TIMEOUT}{{3.4.3}{41}{}{section*.243}{}}
\@writefile{toc}{\contentsline {paragraph}{}{41}{section*.243}\protected@file@percent }
\@setckpt{extensions}{
\setcounter{page}{42}
\setcounter{equation}{0}
\setcounter{enumi}{0}
\setcounter{enumii}{0}
\setcounter{enumiii}{0}
\setcounter{enumiv}{0}
\setcounter{footnote}{2}
\setcounter{mpfootnote}{0}
\setcounter{part}{0}
\setcounter{chapter}{3}
\setcounter{section}{4}
\setcounter{subsection}{3}
\setcounter{subsubsection}{0}
\setcounter{paragraph}{0}
\setcounter{subparagraph}{0}
\setcounter{figure}{0}
\setcounter{table}{0}
\setcounter{Item}{0}
\setcounter{Hfootnote}{13}
\setcounter{bookmark@seq@number}{36}
\setcounter{lstnumber}{2}
\setcounter{cp@cntr}{0}
\setcounter{section@level}{4}
\setcounter{lstlisting}{0}
}
