<?xml version="1.0" encoding="UTF-8" standalone="no"?>
<!DOCTYPE svg PUBLIC "-//W3C//DTD SVG 1.1//EN"
 "http://www.w3.org/Graphics/SVG/1.1/DTD/svg11.dtd">
<!-- Generated by graphviz version 2.40.1 (20161225.0304)
 -->
<!-- Title: ACModel Pages: 1 -->
<svg width="1828pt" height="908pt"
 viewBox="0.00 0.00 1828.00 908.00" xmlns="http://www.w3.org/2000/svg" xmlns:xlink="http://www.w3.org/1999/xlink">
<g id="graph0" class="graph" transform="scale(1 1) rotate(0) translate(4 904)">
<title>ACModel</title>
<polygon fill="#ffffff" stroke="transparent" points="-4,4 -4,-904 1824,-904 1824,4 -4,4"/>
<!-- File -->
<g id="node1" class="node">
<title>File</title>
<polygon fill="none" stroke="#000000" points="62.5,-597.5 62.5,-673.5 171.5,-673.5 171.5,-597.5 62.5,-597.5"/>
<text text-anchor="middle" x="117" y="-658.3" font-family="Helvetica,sans-Serif" font-size="14.00" fill="#000000">File</text>
<polyline fill="none" stroke="#000000" points="62.5,-650.5 171.5,-650.5 "/>
<text text-anchor="middle" x="117" y="-635.3" font-family="Helvetica,sans-Serif" font-size="14.00" fill="#000000">filename: string</text>
<text text-anchor="middle" x="117" y="-620.3" font-family="Helvetica,sans-Serif" font-size="14.00" fill="#000000">len: int</text>
<text text-anchor="middle" x="117" y="-605.3" font-family="Helvetica,sans-Serif" font-size="14.00" fill="#000000">time: int</text>
</g>
<!-- TUnit -->
<g id="node2" class="node">
<title>TUnit</title>
<polygon fill="none" stroke="#000000" points="121,-234 121,-280 175,-280 175,-234 121,-234"/>
<text text-anchor="middle" x="148" y="-264.8" font-family="Helvetica,sans-Serif" font-size="14.00" fill="#000000">TUnit</text>
<polyline fill="none" stroke="#000000" points="121,-257 175,-257 "/>
<text text-anchor="middle" x="148" y="-241.8" font-family="Helvetica,sans-Serif" font-size="14.00" fill="#000000"> </text>
</g>
<!-- File&#45;&gt;TUnit -->
<g id="edge1" class="edge">
<title>File&#45;&gt;TUnit</title>
<path fill="none" stroke="#000000" d="M117.4046,-581.9212C118.0645,-541.2689 119.7494,-484.0351 124,-434 128.7118,-378.5362 138.6154,-313.8311 144.1137,-280.1125"/>
<polygon fill="none" stroke="#000000" points="112.1516,-582.1064 117.1924,-597.178 122.6506,-582.2525 112.1516,-582.1064"/>
</g>
<!-- Header -->
<g id="node3" class="node">
<title>Header</title>
<polygon fill="none" stroke="#000000" points="125.5,-434.5 125.5,-480.5 186.5,-480.5 186.5,-434.5 125.5,-434.5"/>
<text text-anchor="middle" x="156" y="-465.3" font-family="Helvetica,sans-Serif" font-size="14.00" fill="#000000">Header</text>
<polyline fill="none" stroke="#000000" points="125.5,-457.5 186.5,-457.5 "/>
<text text-anchor="middle" x="156" y="-442.3" font-family="Helvetica,sans-Serif" font-size="14.00" fill="#000000"> </text>
</g>
<!-- File&#45;&gt;Header -->
<g id="edge2" class="edge">
<title>File&#45;&gt;Header</title>
<path fill="none" stroke="#000000" d="M128.6288,-582.4248C136.052,-548.5446 145.304,-506.3178 150.926,-480.6584"/>
<polygon fill="none" stroke="#000000" points="123.4486,-581.5385 125.3665,-597.3145 133.7053,-583.7858 123.4486,-581.5385"/>
</g>
<!-- Header&#45;&gt;TUnit -->
<g id="edge3" class="edge">
<title>Header&#45;&gt;TUnit</title>
<path fill="none" stroke="#000000" d="M155.0666,-434.1077C153.6516,-398.6426 150.9568,-331.106 149.3349,-290.455"/>
<polygon fill="#000000" stroke="#000000" points="152.8234,-290.0958 148.9274,-280.2433 145.829,-290.3749 152.8234,-290.0958"/>
<text text-anchor="middle" x="160.5" y="-373.8" font-family="Helvetica,sans-Serif" font-size="14.00" fill="#000000">in</text>
<text text-anchor="middle" x="136.4274" y="-284.0433" font-family="Helvetica,sans-Serif" font-size="14.00" fill="#000000">0..N</text>
</g>
<!-- Source -->
<g id="node4" class="node">
<title>Source</title>
<polygon fill="none" stroke="#000000" points="28,-725.5 28,-801.5 168,-801.5 168,-725.5 28,-725.5"/>
<text text-anchor="middle" x="98" y="-786.3" font-family="Helvetica,sans-Serif" font-size="14.00" fill="#000000">Source</text>
<polyline fill="none" stroke="#000000" points="28,-778.5 168,-778.5 "/>
<text text-anchor="middle" x="98" y="-763.3" font-family="Helvetica,sans-Serif" font-size="14.00" fill="#000000">kind: SourceLocKind</text>
<text text-anchor="middle" x="98" y="-748.3" font-family="Helvetica,sans-Serif" font-size="14.00" fill="#000000">line: int</text>
<text text-anchor="middle" x="98" y="-733.3" font-family="Helvetica,sans-Serif" font-size="14.00" fill="#000000">len: int</text>
</g>
<!-- Source&#45;&gt;File -->
<g id="edge4" class="edge">
<title>Source&#45;&gt;File</title>
<path fill="none" stroke="#000000" d="M103.6492,-725.4423C105.5843,-712.4056 107.7761,-697.64 109.8161,-683.8968"/>
<polygon fill="#000000" stroke="#000000" points="113.3335,-684.0376 111.3398,-673.632 106.4093,-683.0097 113.3335,-684.0376"/>
<text text-anchor="middle" x="118" y="-695.8" font-family="Helvetica,sans-Serif" font-size="14.00" fill="#000000">file</text>
</g>
<!-- MemberIntro -->
<g id="node5" class="node">
<title>MemberIntro</title>
<polygon fill="none" stroke="#000000" points="738.5,-234 738.5,-280 833.5,-280 833.5,-234 738.5,-234"/>
<text text-anchor="middle" x="786" y="-264.8" font-family="Helvetica,sans-Serif" font-size="14.00" fill="#000000">MemberIntro</text>
<polyline fill="none" stroke="#000000" points="738.5,-257 833.5,-257 "/>
<text text-anchor="middle" x="786" y="-241.8" font-family="Helvetica,sans-Serif" font-size="14.00" fill="#000000"> </text>
</g>
<!-- Introduction -->
<g id="node6" class="node">
<title>Introduction</title>
<polygon fill="none" stroke="#000000" points="642.5,-121 642.5,-167 729.5,-167 729.5,-121 642.5,-121"/>
<text text-anchor="middle" x="686" y="-151.8" font-family="Helvetica,sans-Serif" font-size="14.00" fill="#000000">Introduction</text>
<polyline fill="none" stroke="#000000" points="642.5,-144 729.5,-144 "/>
<text text-anchor="middle" x="686" y="-128.8" font-family="Helvetica,sans-Serif" font-size="14.00" fill="#000000"> </text>
</g>
<!-- MemberIntro&#45;&gt;Introduction -->
<g id="edge5" class="edge">
<title>MemberIntro&#45;&gt;Introduction</title>
<path fill="none" stroke="#000000" d="M765.5222,-233.8601C750.4226,-216.7976 729.7267,-193.4111 713.2332,-174.7735"/>
<polygon fill="#000000" stroke="#000000" points="715.6987,-172.2782 706.4504,-167.109 710.4566,-176.9172 715.6987,-172.2782"/>
<text text-anchor="middle" x="754.5" y="-196.8" font-family="Helvetica,sans-Serif" font-size="14.00" fill="#000000">intro</text>
</g>
<!-- Name -->
<g id="node7" class="node">
<title>Name</title>
<polygon fill="none" stroke="#000000" points="450,-733 450,-794 542,-794 542,-733 450,-733"/>
<text text-anchor="middle" x="496" y="-778.8" font-family="Helvetica,sans-Serif" font-size="14.00" fill="#000000">Name</text>
<polyline fill="none" stroke="#000000" points="450,-771 542,-771 "/>
<text text-anchor="middle" x="496" y="-755.8" font-family="Helvetica,sans-Serif" font-size="14.00" fill="#000000">name: string</text>
<text text-anchor="middle" x="496" y="-740.8" font-family="Helvetica,sans-Serif" font-size="14.00" fill="#000000">builtin: bool</text>
</g>
<!-- MemberIntro&#45;&gt;Name -->
<g id="edge6" class="edge">
<title>MemberIntro&#45;&gt;Name</title>
<path fill="none" stroke="#000000" d="M756.8449,-280.1227C748.643,-287.702 740.2622,-296.6083 734,-306 715.1557,-334.2617 707,-343.532 707,-377.5 707,-635.5 707,-635.5 707,-635.5 707,-708.0474 614.6922,-740.6232 552.1853,-754.3656"/>
<polygon fill="#000000" stroke="#000000" points="551.1144,-751.0139 542.0441,-756.4893 552.5492,-757.8653 551.1144,-751.0139"/>
<text text-anchor="middle" x="736" y="-518.8" font-family="Helvetica,sans-Serif" font-size="14.00" fill="#000000">members</text>
<text text-anchor="middle" x="554.5441" y="-760.2893" font-family="Helvetica,sans-Serif" font-size="14.00" fill="#000000">0..N</text>
</g>
<!-- ClassSlice -->
<g id="node20" class="node">
<title>ClassSlice</title>
<polygon fill="none" stroke="#000000" points="536,-8 536,-54 636,-54 636,-8 536,-8"/>
<text text-anchor="middle" x="586" y="-38.8" font-family="Helvetica,sans-Serif" font-size="14.00" fill="#000000">ClassSlice</text>
<polyline fill="none" stroke="#000000" points="536,-31 636,-31 "/>
<text text-anchor="middle" x="586" y="-15.8" font-family="Helvetica,sans-Serif" font-size="14.00" fill="#000000">is_struct: bool</text>
</g>
<!-- Introduction&#45;&gt;ClassSlice -->
<g id="edge67" class="edge">
<title>Introduction&#45;&gt;ClassSlice</title>
<path fill="none" stroke="#000000" d="M642.2717,-133.6792C621.8117,-126.4387 599.2906,-114.4561 587,-95 581.347,-86.0513 579.7622,-74.9018 580.0009,-64.428"/>
<polygon fill="#000000" stroke="#000000" points="583.5037,-64.5205 580.7642,-54.286 576.5235,-63.9951 583.5037,-64.5205"/>
<text text-anchor="middle" x="625.5" y="-83.8" font-family="Helvetica,sans-Serif" font-size="14.00" fill="#000000">named_slice</text>
<text text-anchor="middle" x="569.7642" y="-58.086" font-family="Helvetica,sans-Serif" font-size="14.00" fill="#000000">0..1</text>
</g>
<!-- Introduction&#45;&gt;ClassSlice -->
<g id="edge68" class="edge">
<title>Introduction&#45;&gt;ClassSlice</title>
<path fill="none" stroke="#000000" d="M678.7513,-109.2833C675.447,-99.1168 670.7166,-88.4692 664,-80 655.951,-69.8507 645.1867,-61.2185 634.2312,-54.1594"/>
<polygon fill="#000000" stroke="#000000" points="678.7524,-109.2877 684.2305,-113.9772 682.0087,-120.8375 676.5306,-116.148 678.7524,-109.2877"/>
<text text-anchor="middle" x="704.5" y="-83.8" font-family="Helvetica,sans-Serif" font-size="14.00" fill="#000000">anon_slice</text>
<text text-anchor="middle" x="623.2312" y="-57.9594" font-family="Helvetica,sans-Serif" font-size="14.00" fill="#000000">0..1</text>
</g>
<!-- Name&#45;&gt;TUnit -->
<g id="edge21" class="edge">
<title>Name&#45;&gt;TUnit</title>
<path fill="none" stroke="#000000" d="M449.8503,-744.5135C431.2121,-735.2138 410.4941,-722.6192 395,-707 386.6123,-698.5445 219.9174,-390.2727 165.2201,-288.9284"/>
<polygon fill="#000000" stroke="#000000" points="168.2622,-287.1956 160.433,-280.0573 162.1019,-290.5199 168.2622,-287.1956"/>
<text text-anchor="middle" x="319.5" y="-518.8" font-family="Helvetica,sans-Serif" font-size="14.00" fill="#000000">tunits</text>
<text text-anchor="middle" x="172.933" y="-283.8573" font-family="Helvetica,sans-Serif" font-size="14.00" fill="#000000">0..N</text>
</g>
<!-- Class -->
<g id="node9" class="node">
<title>Class</title>
<polygon fill="none" stroke="#000000" points="794,-499.5 794,-545.5 848,-545.5 848,-499.5 794,-499.5"/>
<text text-anchor="middle" x="821" y="-530.3" font-family="Helvetica,sans-Serif" font-size="14.00" fill="#000000">Class</text>
<polyline fill="none" stroke="#000000" points="794,-522.5 848,-522.5 "/>
<text text-anchor="middle" x="821" y="-507.3" font-family="Helvetica,sans-Serif" font-size="14.00" fill="#000000"> </text>
</g>
<!-- Name&#45;&gt;Class -->
<g id="edge29" class="edge">
<title>Name&#45;&gt;Class</title>
<path fill="none" stroke="#000000" d="M557.3674,-760.5009C636.5102,-755.2702 767.8332,-741.5159 800,-707 841.2108,-662.7797 833.3195,-584.3617 826.1458,-545.5619"/>
<polygon fill="none" stroke="#000000" points="556.9255,-755.2682 542.2794,-761.4371 557.5758,-765.748 556.9255,-755.2682"/>
</g>
<!-- Any -->
<g id="node14" class="node">
<title>Any</title>
<polygon fill="none" stroke="#000000" points="403.5,-853.5 403.5,-899.5 462.5,-899.5 462.5,-853.5 403.5,-853.5"/>
<text text-anchor="middle" x="433" y="-884.3" font-family="Helvetica,sans-Serif" font-size="14.00" fill="#000000">Any</text>
<polyline fill="none" stroke="#000000" points="403.5,-876.5 462.5,-876.5 "/>
<text text-anchor="middle" x="433" y="-861.3" font-family="Helvetica,sans-Serif" font-size="14.00" fill="#000000">jpid: int</text>
</g>
<!-- Name&#45;&gt;Any -->
<g id="edge20" class="edge">
<title>Name&#45;&gt;Any</title>
<path fill="none" stroke="#000000" d="M441.1852,-802.8106C436.7178,-808.0904 432.8381,-813.8343 430,-820 425.2766,-830.2613 425.4022,-842.7051 426.9736,-853.2997"/>
<polygon fill="#000000" stroke="#000000" points="441.4808,-802.5007 442.7275,-795.3982 449.7632,-793.8172 448.5165,-800.9198 441.4808,-802.5007"/>
<text text-anchor="middle" x="454" y="-823.8" font-family="Helvetica,sans-Serif" font-size="14.00" fill="#000000">children</text>
<text text-anchor="middle" x="414.4736" y="-842.0997" font-family="Helvetica,sans-Serif" font-size="14.00" fill="#000000">0..N</text>
</g>
<!-- Namespace -->
<g id="node17" class="node">
<title>Namespace</title>
<polygon fill="none" stroke="#000000" points="192.5,-612.5 192.5,-658.5 281.5,-658.5 281.5,-612.5 192.5,-612.5"/>
<text text-anchor="middle" x="237" y="-643.3" font-family="Helvetica,sans-Serif" font-size="14.00" fill="#000000">Namespace</text>
<polyline fill="none" stroke="#000000" points="192.5,-635.5 281.5,-635.5 "/>
<text text-anchor="middle" x="237" y="-620.3" font-family="Helvetica,sans-Serif" font-size="14.00" fill="#000000"> </text>
</g>
<!-- Name&#45;&gt;Namespace -->
<g id="edge22" class="edge">
<title>Name&#45;&gt;Namespace</title>
<path fill="none" stroke="#000000" d="M435.0902,-747.0044C403.9212,-737.3957 365.9239,-723.8392 334,-707 308.649,-693.6279 282.6515,-674.0911 263.9597,-658.8174"/>
<polygon fill="none" stroke="#000000" points="433.9109,-752.1314 449.7864,-751.4014 436.9207,-742.072 433.9109,-752.1314"/>
</g>
<!-- Function -->
<g id="node18" class="node">
<title>Function</title>
<polygon fill="none" stroke="#000000" points="1018,-339.5 1018,-415.5 1194,-415.5 1194,-339.5 1018,-339.5"/>
<text text-anchor="middle" x="1106" y="-400.3" font-family="Helvetica,sans-Serif" font-size="14.00" fill="#000000">Function</text>
<polyline fill="none" stroke="#000000" points="1018,-392.5 1194,-392.5 "/>
<text text-anchor="middle" x="1106" y="-377.3" font-family="Helvetica,sans-Serif" font-size="14.00" fill="#000000">kind: FunctionType</text>
<text text-anchor="middle" x="1106" y="-362.3" font-family="Helvetica,sans-Serif" font-size="14.00" fill="#000000">variadic_args: bool</text>
<text text-anchor="middle" x="1106" y="-347.3" font-family="Helvetica,sans-Serif" font-size="14.00" fill="#000000">cv_qualifiers: CVQualifiers</text>
</g>
<!-- Name&#45;&gt;Function -->
<g id="edge23" class="edge">
<title>Name&#45;&gt;Function</title>
<path fill="none" stroke="#000000" d="M557.3546,-760.0241C623.8111,-754.618 731.9868,-740.9878 819,-707 916.9533,-668.7389 949.8137,-659.0587 1018,-579 1059.4589,-530.3224 1084.3381,-459.081 1096.585,-415.6417"/>
<polygon fill="none" stroke="#000000" points="556.7685,-754.8034 542.2082,-761.172 557.5621,-765.2733 556.7685,-754.8034"/>
</g>
<!-- Variable -->
<g id="node19" class="node">
<title>Variable</title>
<polygon fill="none" stroke="#000000" points="1597.5,-354.5 1597.5,-400.5 1724.5,-400.5 1724.5,-354.5 1597.5,-354.5"/>
<text text-anchor="middle" x="1661" y="-385.3" font-family="Helvetica,sans-Serif" font-size="14.00" fill="#000000">Variable</text>
<polyline fill="none" stroke="#000000" points="1597.5,-377.5 1724.5,-377.5 "/>
<text text-anchor="middle" x="1661" y="-362.3" font-family="Helvetica,sans-Serif" font-size="14.00" fill="#000000">kind: VariableType</text>
</g>
<!-- Name&#45;&gt;Variable -->
<g id="edge27" class="edge">
<title>Name&#45;&gt;Variable</title>
<path fill="none" stroke="#000000" d="M557.2866,-761.0356C756.0612,-752.5933 1374.3611,-722.6419 1449,-674 1481.8389,-652.599 1460.5026,-620.3304 1492,-597 1522.3319,-574.5329 1538.112,-587.0042 1575,-579 1642.5572,-564.341 1670.8209,-586.2836 1727,-546 1769.8351,-515.2848 1793.0351,-479.248 1766,-434 1756.5504,-418.1844 1740.9804,-406.5367 1724.6877,-398.0704"/>
<polygon fill="none" stroke="#000000" points="556.8461,-755.7994 542.0795,-761.6742 557.2866,-766.2902 556.8461,-755.7994"/>
</g>
<!-- Name&#45;&gt;ClassSlice -->
<g id="edge33" class="edge">
<title>Name&#45;&gt;ClassSlice</title>
<path fill="none" stroke="#000000" d="M496,-717.9127C496,-693.4732 496,-662.8438 496,-635.5 496,-635.5 496,-635.5 496,-377.5 496,-344.8364 497.1755,-333.1397 479,-306 471.3814,-294.624 460.242,-300.1858 454,-288 441.4373,-263.4747 445.9217,-252.3448 454,-226 475.5129,-155.8424 531.7541,-88.1997 563.4459,-54.0375"/>
<polygon fill="none" stroke="#000000" points="490.7501,-717.9823 496,-732.9823 501.2501,-717.9823 490.7501,-717.9823"/>
</g>
<!-- Pointcut -->
<g id="node34" class="node">
<title>Pointcut</title>
<polygon fill="none" stroke="#000000" points="169.5,-113.5 169.5,-174.5 296.5,-174.5 296.5,-113.5 169.5,-113.5"/>
<text text-anchor="middle" x="233" y="-159.3" font-family="Helvetica,sans-Serif" font-size="14.00" fill="#000000">Pointcut</text>
<polyline fill="none" stroke="#000000" points="169.5,-151.5 296.5,-151.5 "/>
<text text-anchor="middle" x="233" y="-136.3" font-family="Helvetica,sans-Serif" font-size="14.00" fill="#000000">expr: string</text>
<text text-anchor="middle" x="233" y="-121.3" font-family="Helvetica,sans-Serif" font-size="14.00" fill="#000000">kind: PointcutType</text>
</g>
<!-- Name&#45;&gt;Pointcut -->
<g id="edge61" class="edge">
<title>Name&#45;&gt;Pointcut</title>
<path fill="none" stroke="#000000" d="M484.5253,-718.0304C450.7996,-584.6743 353.7983,-203.2659 345,-193 332.3626,-178.2546 314.4509,-167.79 296.6497,-160.43"/>
<polygon fill="none" stroke="#000000" points="479.4587,-719.4095 488.2243,-732.6657 489.6386,-716.8365 479.4587,-719.4095"/>
</g>
<!-- BaseIntro -->
<g id="node8" class="node">
<title>BaseIntro</title>
<polygon fill="none" stroke="#000000" points="852,-234 852,-280 926,-280 926,-234 852,-234"/>
<text text-anchor="middle" x="889" y="-264.8" font-family="Helvetica,sans-Serif" font-size="14.00" fill="#000000">BaseIntro</text>
<polyline fill="none" stroke="#000000" points="852,-257 926,-257 "/>
<text text-anchor="middle" x="889" y="-241.8" font-family="Helvetica,sans-Serif" font-size="14.00" fill="#000000"> </text>
</g>
<!-- BaseIntro&#45;&gt;Introduction -->
<g id="edge7" class="edge">
<title>BaseIntro&#45;&gt;Introduction</title>
<path fill="none" stroke="#000000" d="M855.6153,-233.8721C851.4128,-231.1479 847.137,-228.4639 843,-226 809.1206,-205.8221 769.7887,-185.2839 738.9678,-169.8093"/>
<polygon fill="#000000" stroke="#000000" points="740.2014,-166.5132 729.6914,-165.1755 737.0732,-172.7754 740.2014,-166.5132"/>
<text text-anchor="middle" x="822.5" y="-196.8" font-family="Helvetica,sans-Serif" font-size="14.00" fill="#000000">intro</text>
</g>
<!-- BaseIntro&#45;&gt;Class -->
<g id="edge8" class="edge">
<title>BaseIntro&#45;&gt;Class</title>
<path fill="none" stroke="#000000" d="M926.0663,-263.8594C966.319,-272.9695 1021.9982,-291.4436 999,-321 979.0085,-346.6923 953.6952,-319.0123 928,-339 871.3331,-383.0799 889.2204,-420.2269 851,-481 848.9885,-484.1984 846.8181,-487.4787 844.5969,-490.7254"/>
<polygon fill="#000000" stroke="#000000" points="841.555,-488.9669 838.6731,-499.1622 847.2839,-492.9893 841.555,-488.9669"/>
<text text-anchor="middle" x="946.5" y="-373.8" font-family="Helvetica,sans-Serif" font-size="14.00" fill="#000000">bases</text>
<text text-anchor="middle" x="826.1731" y="-487.9622" font-family="Helvetica,sans-Serif" font-size="14.00" fill="#000000">0..N</text>
</g>
<!-- Class&#45;&gt;Class -->
<g id="edge30" class="edge">
<title>Class&#45;&gt;Class</title>
<path fill="none" stroke="#000000" d="M848.2408,-526.9956C858.0239,-527.0923 866,-525.5938 866,-522.5 866,-520.6147 863.0382,-519.3219 858.5105,-518.6213"/>
<polygon fill="#000000" stroke="#000000" points="858.4327,-515.1104 848.2408,-518.0044 858.0129,-522.0978 858.4327,-515.1104"/>
<text text-anchor="middle" x="884.5" y="-518.8" font-family="Helvetica,sans-Serif" font-size="14.00" fill="#000000">bases</text>
<text text-anchor="middle" x="860.7408" y="-506.8044" font-family="Helvetica,sans-Serif" font-size="14.00" fill="#000000">0..N</text>
</g>
<!-- Class&#45;&gt;Class -->
<g id="edge31" class="edge">
<title>Class&#45;&gt;Class</title>
<path fill="none" stroke="#000000" d="M848.0572,-530.0712C873.1767,-533.4144 903,-530.8906 903,-522.5 903,-515.2238 880.5724,-512.3595 858.2338,-513.9072"/>
<polygon fill="#000000" stroke="#000000" points="857.6576,-510.4474 848.0572,-514.9288 858.3568,-517.4124 857.6576,-510.4474"/>
<text text-anchor="middle" x="925.5" y="-518.8" font-family="Helvetica,sans-Serif" font-size="14.00" fill="#000000">derived</text>
<text text-anchor="middle" x="860.5572" y="-518.7288" font-family="Helvetica,sans-Serif" font-size="14.00" fill="#000000">0..N</text>
</g>
<!-- ClassPlan -->
<g id="node10" class="node">
<title>ClassPlan</title>
<polygon fill="none" stroke="#000000" points="782.5,-354.5 782.5,-400.5 859.5,-400.5 859.5,-354.5 782.5,-354.5"/>
<text text-anchor="middle" x="821" y="-385.3" font-family="Helvetica,sans-Serif" font-size="14.00" fill="#000000">ClassPlan</text>
<polyline fill="none" stroke="#000000" points="782.5,-377.5 859.5,-377.5 "/>
<text text-anchor="middle" x="821" y="-362.3" font-family="Helvetica,sans-Serif" font-size="14.00" fill="#000000"> </text>
</g>
<!-- Class&#45;&gt;ClassPlan -->
<g id="edge32" class="edge">
<title>Class&#45;&gt;ClassPlan</title>
<path fill="none" stroke="#000000" d="M821,-486.8571C821,-460.008 821,-423.9712 821,-400.7389"/>
<polygon fill="#000000" stroke="#000000" points="821.0001,-487.2032 825,-493.2033 821,-499.2032 817,-493.2032 821.0001,-487.2032"/>
<text text-anchor="middle" x="834" y="-453.8" font-family="Helvetica,sans-Serif" font-size="14.00" fill="#000000">plan</text>
<text text-anchor="middle" x="810" y="-404.5389" font-family="Helvetica,sans-Serif" font-size="14.00" fill="#000000">0..1</text>
</g>
<!-- Aspect -->
<g id="node37" class="node">
<title>Aspect</title>
<polygon fill="none" stroke="#000000" points="525,-354.5 525,-400.5 583,-400.5 583,-354.5 525,-354.5"/>
<text text-anchor="middle" x="554" y="-385.3" font-family="Helvetica,sans-Serif" font-size="14.00" fill="#000000">Aspect</text>
<polyline fill="none" stroke="#000000" points="525,-377.5 583,-377.5 "/>
<text text-anchor="middle" x="554" y="-362.3" font-family="Helvetica,sans-Serif" font-size="14.00" fill="#000000"> </text>
</g>
<!-- Class&#45;&gt;Aspect -->
<g id="edge71" class="edge">
<title>Class&#45;&gt;Aspect</title>
<path fill="none" stroke="#000000" d="M779.7536,-503.6658C719.6407,-476.0992 613.3121,-426.8517 597,-416 590.3257,-411.5599 583.6237,-406.1351 577.563,-400.7746"/>
<polygon fill="none" stroke="#000000" points="777.7801,-508.5363 793.604,-510.0087 782.152,-498.9898 777.7801,-508.5363"/>
</g>
<!-- ClassPlan&#45;&gt;MemberIntro -->
<g id="edge10" class="edge">
<title>ClassPlan&#45;&gt;MemberIntro</title>
<path fill="none" stroke="#000000" d="M771.8699,-353.686C759.5604,-345.1838 747.9043,-334.3288 741,-321 733.5655,-306.6477 742.7664,-291.8095 754.7433,-280.0383"/>
<polygon fill="#000000" stroke="#000000" points="772.1367,-353.8551 779.3459,-353.6872 782.2736,-360.2773 775.0644,-360.4451 772.1367,-353.8551"/>
<text text-anchor="middle" x="787" y="-309.8" font-family="Helvetica,sans-Serif" font-size="14.00" fill="#000000">member_intros</text>
<text text-anchor="middle" x="742.2433" y="-283.8383" font-family="Helvetica,sans-Serif" font-size="14.00" fill="#000000">0..N</text>
</g>
<!-- ClassPlan&#45;&gt;BaseIntro -->
<g id="edge9" class="edge">
<title>ClassPlan&#45;&gt;BaseIntro</title>
<path fill="none" stroke="#000000" d="M836.5739,-343.2748C842.3318,-331.2977 849.1356,-317.8796 856,-306 861.0287,-297.2972 867.0433,-288.0768 872.5521,-280.0104"/>
<polygon fill="#000000" stroke="#000000" points="836.5299,-343.368 837.585,-350.5015 831.406,-354.2191 830.3509,-347.0855 836.5299,-343.368"/>
<text text-anchor="middle" x="891" y="-309.8" font-family="Helvetica,sans-Serif" font-size="14.00" fill="#000000">base_intros</text>
<text text-anchor="middle" x="860.0521" y="-283.8104" font-family="Helvetica,sans-Serif" font-size="14.00" fill="#000000">0..N</text>
</g>
<!-- CodeAdvice -->
<g id="node11" class="node">
<title>CodeAdvice</title>
<polygon fill="none" stroke="#000000" points="546,-499.5 546,-545.5 660,-545.5 660,-499.5 546,-499.5"/>
<text text-anchor="middle" x="603" y="-530.3" font-family="Helvetica,sans-Serif" font-size="14.00" fill="#000000">CodeAdvice</text>
<polyline fill="none" stroke="#000000" points="546,-522.5 660,-522.5 "/>
<text text-anchor="middle" x="603" y="-507.3" font-family="Helvetica,sans-Serif" font-size="14.00" fill="#000000">conditional: bool</text>
</g>
<!-- AdviceCode -->
<g id="node12" class="node">
<title>AdviceCode</title>
<polygon fill="none" stroke="#000000" points="462.5,-226.5 462.5,-287.5 649.5,-287.5 649.5,-226.5 462.5,-226.5"/>
<text text-anchor="middle" x="556" y="-272.3" font-family="Helvetica,sans-Serif" font-size="14.00" fill="#000000">AdviceCode</text>
<polyline fill="none" stroke="#000000" points="462.5,-264.5 649.5,-264.5 "/>
<text text-anchor="middle" x="556" y="-249.3" font-family="Helvetica,sans-Serif" font-size="14.00" fill="#000000">kind: AdviceCodeType</text>
<text text-anchor="middle" x="556" y="-234.3" font-family="Helvetica,sans-Serif" font-size="14.00" fill="#000000">context: AdviceCodeContext</text>
</g>
<!-- CodeAdvice&#45;&gt;AdviceCode -->
<g id="edge11" class="edge">
<title>CodeAdvice&#45;&gt;AdviceCode</title>
<path fill="none" stroke="#000000" d="M608.9259,-499.2609C618.1404,-458.3608 632.1866,-371.6343 605,-306 603.557,-302.5162 601.7327,-299.1509 599.6423,-295.9274"/>
<polygon fill="#000000" stroke="#000000" points="602.3367,-293.6851 593.566,-287.7415 596.716,-297.8573 602.3367,-293.6851"/>
<text text-anchor="middle" x="640" y="-373.8" font-family="Helvetica,sans-Serif" font-size="14.00" fill="#000000">advice</text>
</g>
<!-- CodePlan -->
<g id="node13" class="node">
<title>CodePlan</title>
<polygon fill="none" stroke="#000000" points="524,-612.5 524,-658.5 600,-658.5 600,-612.5 524,-612.5"/>
<text text-anchor="middle" x="562" y="-643.3" font-family="Helvetica,sans-Serif" font-size="14.00" fill="#000000">CodePlan</text>
<polyline fill="none" stroke="#000000" points="524,-635.5 600,-635.5 "/>
<text text-anchor="middle" x="562" y="-620.3" font-family="Helvetica,sans-Serif" font-size="14.00" fill="#000000"> </text>
</g>
<!-- CodePlan&#45;&gt;CodeAdvice -->
<g id="edge12" class="edge">
<title>CodePlan&#45;&gt;CodeAdvice</title>
<path fill="none" stroke="#000000" d="M536.3582,-601.5185C530.3363,-589.3386 527.3682,-575.7275 534,-564 538.0597,-556.8208 543.9132,-550.7465 550.5179,-545.649"/>
<polygon fill="#000000" stroke="#000000" points="536.5372,-601.827 543.0081,-605.0095 542.5593,-612.2066 536.0884,-609.0242 536.5372,-601.827"/>
<text text-anchor="middle" x="553.5" y="-567.8" font-family="Helvetica,sans-Serif" font-size="14.00" fill="#000000">before</text>
<text text-anchor="middle" x="538.0179" y="-549.449" font-family="Helvetica,sans-Serif" font-size="14.00" fill="#000000">0..N</text>
</g>
<!-- CodePlan&#45;&gt;CodeAdvice -->
<g id="edge13" class="edge">
<title>CodePlan&#45;&gt;CodeAdvice</title>
<path fill="none" stroke="#000000" d="M574.5587,-600.8869C581.0684,-582.9457 588.8417,-561.5218 594.6153,-545.609"/>
<polygon fill="#000000" stroke="#000000" points="574.4889,-601.0796 576.2025,-608.0842 570.3959,-612.3601 568.6822,-605.3555 574.4889,-601.0796"/>
<text text-anchor="middle" x="608.5" y="-567.8" font-family="Helvetica,sans-Serif" font-size="14.00" fill="#000000">around</text>
<text text-anchor="middle" x="583.6153" y="-549.409" font-family="Helvetica,sans-Serif" font-size="14.00" fill="#000000">0..1</text>
</g>
<!-- CodePlan&#45;&gt;CodeAdvice -->
<g id="edge14" class="edge">
<title>CodePlan&#45;&gt;CodeAdvice</title>
<path fill="none" stroke="#000000" d="M610.1582,-607.7037C619.7772,-599.7437 628.5789,-590.1451 634,-579 639.4323,-567.8319 634.3257,-555.7264 626.7981,-545.5961"/>
<polygon fill="#000000" stroke="#000000" points="609.9321,-607.8747 607.56,-614.6845 600.3617,-615.1141 602.7338,-608.3043 609.9321,-607.8747"/>
<text text-anchor="middle" x="650" y="-567.8" font-family="Helvetica,sans-Serif" font-size="14.00" fill="#000000">after</text>
<text text-anchor="middle" x="614.2981" y="-549.3961" font-family="Helvetica,sans-Serif" font-size="14.00" fill="#000000">0..N</text>
</g>
<!-- CodePlan&#45;&gt;CodePlan -->
<g id="edge15" class="edge">
<title>CodePlan&#45;&gt;CodePlan</title>
<path fill="none" stroke="#000000" d="M611.9746,-644.447C615.7075,-642.4472 618,-639.4648 618,-635.5 618,-628.25 610.3346,-624.2852 600.214,-623.6055"/>
<polygon fill="#000000" stroke="#000000" points="611.854,-644.4772 607.0064,-649.8159 600.214,-647.3945 605.0615,-642.0559 611.854,-644.4772"/>
<text text-anchor="middle" x="648.5" y="-631.8" font-family="Helvetica,sans-Serif" font-size="14.00" fill="#000000">next_level</text>
<text text-anchor="middle" x="611.214" y="-612.4055" font-family="Helvetica,sans-Serif" font-size="14.00" fill="#000000">0..1</text>
</g>
<!-- Any&#45;&gt;Source -->
<g id="edge16" class="edge">
<title>Any&#45;&gt;Source</title>
<path fill="none" stroke="#000000" d="M391.2769,-868.1665C356.1607,-860.7413 304.8046,-848.9156 261,-835 223.1656,-822.981 214.3522,-817.9505 178,-802 174.7536,-800.5756 171.4449,-799.0963 168.1111,-797.5836"/>
<polygon fill="#000000" stroke="#000000" points="391.6877,-868.252 398.3773,-865.5594 403.4356,-870.6987 396.7461,-873.3913 391.6877,-868.252"/>
<text text-anchor="middle" x="281.5" y="-823.8" font-family="Helvetica,sans-Serif" font-size="14.00" fill="#000000">source</text>
<text text-anchor="middle" x="180.6111" y="-801.3836" font-family="Helvetica,sans-Serif" font-size="14.00" fill="#000000">0..N</text>
</g>
<!-- Any&#45;&gt;Name -->
<g id="edge19" class="edge">
<title>Any&#45;&gt;Name</title>
<path fill="none" stroke="#000000" d="M473.5866,-846.362C476.7665,-842.8055 479.6495,-839.005 482,-835 489.1706,-822.782 492.7466,-807.5692 494.5008,-794.3206"/>
<polygon fill="none" stroke="#000000" points="469.8674,-842.655 462.7061,-856.8423 477.1517,-850.2174 469.8674,-842.655"/>
</g>
<!-- Type -->
<g id="node15" class="node">
<title>Type</title>
<polygon fill="none" stroke="#000000" points="1323.5,-234 1323.5,-280 1436.5,-280 1436.5,-234 1323.5,-234"/>
<text text-anchor="middle" x="1380" y="-264.8" font-family="Helvetica,sans-Serif" font-size="14.00" fill="#000000">Type</text>
<polyline fill="none" stroke="#000000" points="1323.5,-257 1436.5,-257 "/>
<text text-anchor="middle" x="1380" y="-241.8" font-family="Helvetica,sans-Serif" font-size="14.00" fill="#000000">signature: string</text>
</g>
<!-- Any&#45;&gt;Type -->
<g id="edge17" class="edge">
<title>Any&#45;&gt;Type</title>
<path fill="none" stroke="#000000" d="M477.9342,-875.2468C716.089,-868.3162 1820,-832.4714 1820,-763.5 1820,-763.5 1820,-763.5 1820,-377.5 1820,-298.8923 1555.4585,-269.7396 1436.6215,-260.6094"/>
<polygon fill="none" stroke="#000000" points="477.454,-870.0083 462.6111,-875.6873 477.7559,-880.504 477.454,-870.0083"/>
</g>
<!-- Arg -->
<g id="node16" class="node">
<title>Arg</title>
<polygon fill="none" stroke="#000000" points="3,-.5 3,-61.5 95,-61.5 95,-.5 3,-.5"/>
<text text-anchor="middle" x="49" y="-46.3" font-family="Helvetica,sans-Serif" font-size="14.00" fill="#000000">Arg</text>
<polyline fill="none" stroke="#000000" points="3,-38.5 95,-38.5 "/>
<text text-anchor="middle" x="49" y="-23.3" font-family="Helvetica,sans-Serif" font-size="14.00" fill="#000000">type: string</text>
<text text-anchor="middle" x="49" y="-8.3" font-family="Helvetica,sans-Serif" font-size="14.00" fill="#000000">name: string</text>
</g>
<!-- Any&#45;&gt;Arg -->
<g id="edge18" class="edge">
<title>Any&#45;&gt;Arg</title>
<path fill="none" stroke="#000000" d="M388.1732,-873.486C293.442,-866.3258 76.847,-845.5391 19,-802 3.7544,-790.5252 0,-782.5814 0,-763.5 0,-763.5 0,-763.5 0,-144 0,-114.2775 14.4459,-83.5177 27.6504,-61.6096"/>
<polygon fill="none" stroke="#000000" points="387.9936,-878.7368 403.3363,-874.5936 388.7586,-868.2647 387.9936,-878.7368"/>
</g>
<!-- Code -->
<g id="node21" class="node">
<title>Code</title>
<polygon fill="none" stroke="#000000" points="1450,-740.5 1450,-786.5 1504,-786.5 1504,-740.5 1450,-740.5"/>
<text text-anchor="middle" x="1477" y="-771.3" font-family="Helvetica,sans-Serif" font-size="14.00" fill="#000000">Code</text>
<polyline fill="none" stroke="#000000" points="1450,-763.5 1504,-763.5 "/>
<text text-anchor="middle" x="1477" y="-748.3" font-family="Helvetica,sans-Serif" font-size="14.00" fill="#000000"> </text>
</g>
<!-- Any&#45;&gt;Code -->
<g id="edge34" class="edge">
<title>Any&#45;&gt;Code</title>
<path fill="none" stroke="#000000" d="M477.5156,-871.6817C654.7802,-852.4951 1307.6988,-781.8248 1449.6466,-766.4607"/>
<polygon fill="none" stroke="#000000" points="476.9111,-866.4664 462.5632,-873.3002 478.0411,-876.9054 476.9111,-866.4664"/>
</g>
<!-- Advice -->
<g id="node35" class="node">
<title>Advice</title>
<polygon fill="none" stroke="#000000" points="275.5,-354.5 275.5,-400.5 332.5,-400.5 332.5,-354.5 275.5,-354.5"/>
<text text-anchor="middle" x="304" y="-385.3" font-family="Helvetica,sans-Serif" font-size="14.00" fill="#000000">Advice</text>
<polyline fill="none" stroke="#000000" points="275.5,-377.5 332.5,-377.5 "/>
<text text-anchor="middle" x="304" y="-362.3" font-family="Helvetica,sans-Serif" font-size="14.00" fill="#000000">lid: int</text>
</g>
<!-- Any&#45;&gt;Advice -->
<g id="edge63" class="edge">
<title>Any&#45;&gt;Advice</title>
<path fill="none" stroke="#000000" d="M405.9052,-840.9C382.4913,-808.0423 349.9755,-756.9222 334,-707 298.6355,-596.4888 300.402,-455.2249 302.7208,-400.5464"/>
<polygon fill="none" stroke="#000000" points="401.925,-844.3529 414.9975,-853.3902 410.414,-838.1733 401.925,-844.3529"/>
</g>
<!-- Function&#45;&gt;TUnit -->
<g id="edge26" class="edge">
<title>Function&#45;&gt;TUnit</title>
<path fill="none" stroke="#000000" d="M1027.6668,-339.3958C996.7433,-326.2281 960.429,-313.0244 926,-306 845.7401,-289.6249 266.3354,-315.0006 189,-288 186.878,-287.2591 184.7766,-286.3639 182.7124,-285.352"/>
<polygon fill="#000000" stroke="#000000" points="184.3597,-282.2615 173.9511,-280.2839 180.8546,-288.3208 184.3597,-282.2615"/>
<text text-anchor="middle" x="1002" y="-309.8" font-family="Helvetica,sans-Serif" font-size="14.00" fill="#000000">static_in</text>
<text text-anchor="middle" x="184.9511" y="-269.0839" font-family="Helvetica,sans-Serif" font-size="14.00" fill="#000000">0..1</text>
</g>
<!-- Function&#45;&gt;Type -->
<g id="edge24" class="edge">
<title>Function&#45;&gt;Type</title>
<path fill="none" stroke="#000000" d="M1067.5299,-327.8982C1065.5961,-320.1361 1066.4244,-312.5327 1072,-306 1088.1031,-287.1326 1238.9711,-270.169 1323.418,-262.0513"/>
<polygon fill="#000000" stroke="#000000" points="1067.6292,-328.1451 1073.5796,-332.2186 1072.1081,-339.278 1066.1577,-335.2045 1067.6292,-328.1451"/>
<text text-anchor="middle" x="1105.5" y="-309.8" font-family="Helvetica,sans-Serif" font-size="14.00" fill="#000000">result_type</text>
<text text-anchor="middle" x="1312.418" y="-250.8513" font-family="Helvetica,sans-Serif" font-size="14.00" fill="#000000">0..1</text>
</g>
<!-- Function&#45;&gt;Type -->
<g id="edge25" class="edge">
<title>Function&#45;&gt;Type</title>
<path fill="none" stroke="#000000" d="M1135.8744,-329.73C1143.4228,-320.7176 1152.2073,-312.1906 1162,-306 1188.4362,-289.288 1268.061,-274.1883 1323.3806,-265.3004"/>
<polygon fill="#000000" stroke="#000000" points="1135.8499,-329.7613 1135.3104,-336.9522 1128.4651,-339.2199 1129.0047,-332.029 1135.8499,-329.7613"/>
<text text-anchor="middle" x="1192" y="-309.8" font-family="Helvetica,sans-Serif" font-size="14.00" fill="#000000">arg_types</text>
<text text-anchor="middle" x="1310.8806" y="-269.1004" font-family="Helvetica,sans-Serif" font-size="14.00" fill="#000000">0..N</text>
</g>
<!-- Variable&#45;&gt;Type -->
<g id="edge28" class="edge">
<title>Variable&#45;&gt;Type</title>
<path fill="none" stroke="#000000" d="M1607.1992,-348.6425C1580.6999,-334.935 1548.0567,-318.7935 1518,-306 1491.683,-294.7983 1461.8458,-283.979 1436.6645,-275.3693"/>
<polygon fill="#000000" stroke="#000000" points="1607.5126,-348.8058 1614.682,-348.0312 1618.1544,-354.3512 1610.985,-355.1258 1607.5126,-348.8058"/>
<text text-anchor="middle" x="1562" y="-309.8" font-family="Helvetica,sans-Serif" font-size="14.00" fill="#000000">type</text>
</g>
<!-- Code&#45;&gt;CodePlan -->
<g id="edge35" class="edge">
<title>Code&#45;&gt;CodePlan</title>
<path fill="none" stroke="#000000" d="M1437.4305,-757.9646C1286.5642,-736.8598 748.4941,-661.5888 600.1261,-640.8335"/>
<polygon fill="#000000" stroke="#000000" points="1437.7316,-758.0066 1444.2279,-754.8765 1449.6159,-759.6692 1443.1195,-762.7993 1437.7316,-758.0066"/>
<text text-anchor="middle" x="1059" y="-695.8" font-family="Helvetica,sans-Serif" font-size="14.00" fill="#000000">plan</text>
<text text-anchor="middle" x="611.1261" y="-644.6335" font-family="Helvetica,sans-Serif" font-size="14.00" fill="#000000">0..1</text>
</g>
<!-- Access -->
<g id="node22" class="node">
<title>Access</title>
<polygon fill="none" stroke="#000000" points="1302.5,-597.5 1302.5,-673.5 1439.5,-673.5 1439.5,-597.5 1302.5,-597.5"/>
<text text-anchor="middle" x="1371" y="-658.3" font-family="Helvetica,sans-Serif" font-size="14.00" fill="#000000">Access</text>
<polyline fill="none" stroke="#000000" points="1302.5,-650.5 1439.5,-650.5 "/>
<text text-anchor="middle" x="1371" y="-635.3" font-family="Helvetica,sans-Serif" font-size="14.00" fill="#000000">lid: int</text>
<text text-anchor="middle" x="1371" y="-620.3" font-family="Helvetica,sans-Serif" font-size="14.00" fill="#000000">target_object_lid: int</text>
<text text-anchor="middle" x="1371" y="-605.3" font-family="Helvetica,sans-Serif" font-size="14.00" fill="#000000">cfg_block_lid: int</text>
</g>
<!-- Code&#45;&gt;Access -->
<g id="edge36" class="edge">
<title>Code&#45;&gt;Access</title>
<path fill="none" stroke="#000000" d="M1448.1162,-728.6214C1433.9998,-711.5752 1416.9824,-691.0259 1402.5288,-673.5725"/>
<polygon fill="none" stroke="#000000" points="1444.1934,-732.1158 1457.8042,-740.3202 1452.2805,-725.4188 1444.1934,-732.1158"/>
</g>
<!-- Execution -->
<g id="node31" class="node">
<title>Execution</title>
<polygon fill="none" stroke="#000000" points="1604,-612.5 1604,-658.5 1680,-658.5 1680,-612.5 1604,-612.5"/>
<text text-anchor="middle" x="1642" y="-643.3" font-family="Helvetica,sans-Serif" font-size="14.00" fill="#000000">Execution</text>
<polyline fill="none" stroke="#000000" points="1604,-635.5 1680,-635.5 "/>
<text text-anchor="middle" x="1642" y="-620.3" font-family="Helvetica,sans-Serif" font-size="14.00" fill="#000000"> </text>
</g>
<!-- Code&#45;&gt;Execution -->
<g id="edge58" class="edge">
<title>Code&#45;&gt;Execution</title>
<path fill="none" stroke="#000000" d="M1516.4808,-734.1331C1539.5391,-716.8382 1569.1038,-694.4156 1595,-674 1601.1296,-669.1676 1607.6428,-663.912 1613.8055,-658.8816"/>
<polygon fill="none" stroke="#000000" points="1513.2699,-729.9786 1504.4047,-743.1684 1519.5603,-738.3859 1513.2699,-729.9786"/>
</g>
<!-- Construction -->
<g id="node32" class="node">
<title>Construction</title>
<polygon fill="none" stroke="#000000" points="1698,-612.5 1698,-658.5 1790,-658.5 1790,-612.5 1698,-612.5"/>
<text text-anchor="middle" x="1744" y="-643.3" font-family="Helvetica,sans-Serif" font-size="14.00" fill="#000000">Construction</text>
<polyline fill="none" stroke="#000000" points="1698,-635.5 1790,-635.5 "/>
<text text-anchor="middle" x="1744" y="-620.3" font-family="Helvetica,sans-Serif" font-size="14.00" fill="#000000"> </text>
</g>
<!-- Code&#45;&gt;Construction -->
<g id="edge59" class="edge">
<title>Code&#45;&gt;Construction</title>
<path fill="none" stroke="#000000" d="M1518.5611,-748.9339C1562.2018,-732.9609 1632.2363,-705.387 1689,-674 1697.1601,-669.488 1705.5912,-664.0362 1713.3271,-658.6726"/>
<polygon fill="none" stroke="#000000" points="1516.6157,-744.0545 1504.2905,-754.0871 1520.182,-753.9303 1516.6157,-744.0545"/>
</g>
<!-- Destruction -->
<g id="node33" class="node">
<title>Destruction</title>
<polygon fill="none" stroke="#000000" points="1500.5,-612.5 1500.5,-658.5 1585.5,-658.5 1585.5,-612.5 1500.5,-612.5"/>
<text text-anchor="middle" x="1543" y="-643.3" font-family="Helvetica,sans-Serif" font-size="14.00" fill="#000000">Destruction</text>
<polyline fill="none" stroke="#000000" points="1500.5,-635.5 1585.5,-635.5 "/>
<text text-anchor="middle" x="1543" y="-620.3" font-family="Helvetica,sans-Serif" font-size="14.00" fill="#000000"> </text>
</g>
<!-- Code&#45;&gt;Destruction -->
<g id="edge60" class="edge">
<title>Code&#45;&gt;Destruction</title>
<path fill="none" stroke="#000000" d="M1495.9397,-726.7684C1507.2822,-704.7708 1521.3506,-677.4868 1531.1368,-658.5074"/>
<polygon fill="none" stroke="#000000" points="1491.1603,-724.5821 1488.9521,-740.3202 1500.4927,-729.3941 1491.1603,-724.5821"/>
</g>
<!-- Access&#45;&gt;Class -->
<g id="edge37" class="edge">
<title>Access&#45;&gt;Class</title>
<path fill="none" stroke="#000000" d="M1302.3407,-630.5001C1221.7582,-623.5627 1084.5765,-608.4039 970,-579 930.6366,-568.8981 887.3883,-551.7865 857.674,-539.0356"/>
<polygon fill="#000000" stroke="#000000" points="858.7076,-535.6687 848.141,-534.895 855.9188,-542.0892 858.7076,-535.6687"/>
<text text-anchor="middle" x="1006.5" y="-567.8" font-family="Helvetica,sans-Serif" font-size="14.00" fill="#000000">target_class</text>
<text text-anchor="middle" x="859.141" y="-538.695" font-family="Helvetica,sans-Serif" font-size="14.00" fill="#000000">0..1</text>
</g>
<!-- Get -->
<g id="node23" class="node">
<title>Get</title>
<polygon fill="none" stroke="#000000" points="1544,-499.5 1544,-545.5 1598,-545.5 1598,-499.5 1544,-499.5"/>
<text text-anchor="middle" x="1571" y="-530.3" font-family="Helvetica,sans-Serif" font-size="14.00" fill="#000000">Get</text>
<polyline fill="none" stroke="#000000" points="1544,-522.5 1598,-522.5 "/>
<text text-anchor="middle" x="1571" y="-507.3" font-family="Helvetica,sans-Serif" font-size="14.00" fill="#000000"> </text>
</g>
<!-- Access&#45;&gt;Get -->
<g id="edge38" class="edge">
<title>Access&#45;&gt;Get</title>
<path fill="none" stroke="#000000" d="M1453.7282,-598.6131C1455.1603,-598.0649 1456.5851,-597.5267 1458,-597 1483.6929,-587.4355 1493.6574,-593.378 1517,-579 1531.0945,-570.3184 1544.0193,-557.0797 1553.6881,-545.599"/>
<polygon fill="none" stroke="#000000" points="1451.5436,-593.8318 1439.5448,-604.2526 1455.4232,-603.5888 1451.5436,-593.8318"/>
</g>
<!-- Set -->
<g id="node24" class="node">
<title>Set</title>
<polygon fill="none" stroke="#000000" points="1664,-499.5 1664,-545.5 1718,-545.5 1718,-499.5 1664,-499.5"/>
<text text-anchor="middle" x="1691" y="-530.3" font-family="Helvetica,sans-Serif" font-size="14.00" fill="#000000">Set</text>
<polyline fill="none" stroke="#000000" points="1664,-522.5 1718,-522.5 "/>
<text text-anchor="middle" x="1691" y="-507.3" font-family="Helvetica,sans-Serif" font-size="14.00" fill="#000000"> </text>
</g>
<!-- Access&#45;&gt;Set -->
<g id="edge40" class="edge">
<title>Access&#45;&gt;Set</title>
<path fill="none" stroke="#000000" d="M1454.0663,-598.3187C1455.3833,-597.8671 1456.6952,-597.4271 1458,-597 1493.4606,-585.392 1504.2147,-589.5645 1540,-579 1584.1599,-565.9632 1633.9163,-546.3515 1663.843,-533.9976"/>
<polygon fill="none" stroke="#000000" points="1452.1133,-593.443 1439.8416,-603.541 1455.732,-603.2998 1452.1133,-593.443"/>
</g>
<!-- Call -->
<g id="node25" class="node">
<title>Call</title>
<polygon fill="none" stroke="#000000" points="1096.5,-499.5 1096.5,-545.5 1209.5,-545.5 1209.5,-499.5 1096.5,-499.5"/>
<text text-anchor="middle" x="1153" y="-530.3" font-family="Helvetica,sans-Serif" font-size="14.00" fill="#000000">Call</text>
<polyline fill="none" stroke="#000000" points="1096.5,-522.5 1209.5,-522.5 "/>
<text text-anchor="middle" x="1153" y="-507.3" font-family="Helvetica,sans-Serif" font-size="14.00" fill="#000000">default_args: int</text>
</g>
<!-- Access&#45;&gt;Call -->
<g id="edge42" class="edge">
<title>Access&#45;&gt;Call</title>
<path fill="none" stroke="#000000" d="M1288.5715,-599.5314C1274.5663,-592.9688 1260.2681,-585.9814 1247,-579 1227.6222,-568.8038 1206.6852,-556.3667 1189.5002,-545.7596"/>
<polygon fill="none" stroke="#000000" points="1286.6112,-604.409 1302.4299,-605.9364 1291.0164,-594.8777 1286.6112,-604.409"/>
</g>
<!-- Builtin -->
<g id="node26" class="node">
<title>Builtin</title>
<polygon fill="none" stroke="#000000" points="1232,-499.5 1232,-545.5 1286,-545.5 1286,-499.5 1232,-499.5"/>
<text text-anchor="middle" x="1259" y="-530.3" font-family="Helvetica,sans-Serif" font-size="14.00" fill="#000000">Builtin</text>
<polyline fill="none" stroke="#000000" points="1232,-522.5 1286,-522.5 "/>
<text text-anchor="middle" x="1259" y="-507.3" font-family="Helvetica,sans-Serif" font-size="14.00" fill="#000000"> </text>
</g>
<!-- Access&#45;&gt;Builtin -->
<g id="edge46" class="edge">
<title>Access&#45;&gt;Builtin</title>
<path fill="none" stroke="#000000" d="M1362.8203,-582.6717C1360.1531,-575.8998 1356.6353,-569.4433 1352,-564 1335.1494,-544.2123 1306.9861,-533.4659 1286.058,-527.9019"/>
<polygon fill="none" stroke="#000000" points="1357.8755,-584.4539 1367.2944,-597.2541 1367.9136,-581.374 1357.8755,-584.4539"/>
</g>
<!-- Ref -->
<g id="node27" class="node">
<title>Ref</title>
<polygon fill="none" stroke="#000000" points="1419,-499.5 1419,-545.5 1473,-545.5 1473,-499.5 1419,-499.5"/>
<text text-anchor="middle" x="1446" y="-530.3" font-family="Helvetica,sans-Serif" font-size="14.00" fill="#000000">Ref</text>
<polyline fill="none" stroke="#000000" points="1419,-522.5 1473,-522.5 "/>
<text text-anchor="middle" x="1446" y="-507.3" font-family="Helvetica,sans-Serif" font-size="14.00" fill="#000000"> </text>
</g>
<!-- Access&#45;&gt;Ref -->
<g id="edge49" class="edge">
<title>Access&#45;&gt;Ref</title>
<path fill="none" stroke="#000000" d="M1404.891,-584.4376C1413.918,-570.8369 1423.2266,-556.8119 1430.6983,-545.5546"/>
<polygon fill="none" stroke="#000000" points="1400.3124,-581.8423 1396.3916,-597.2434 1409.0608,-587.6488 1400.3124,-581.8423"/>
</g>
<!-- GetRef -->
<g id="node28" class="node">
<title>GetRef</title>
<polygon fill="none" stroke="#000000" points="917.5,-434.5 917.5,-480.5 1044.5,-480.5 1044.5,-434.5 917.5,-434.5"/>
<text text-anchor="middle" x="981" y="-465.3" font-family="Helvetica,sans-Serif" font-size="14.00" fill="#000000">GetRef</text>
<polyline fill="none" stroke="#000000" points="917.5,-457.5 1044.5,-457.5 "/>
<text text-anchor="middle" x="981" y="-442.3" font-family="Helvetica,sans-Serif" font-size="14.00" fill="#000000">kind: VariableType</text>
</g>
<!-- Access&#45;&gt;GetRef -->
<g id="edge52" class="edge">
<title>Access&#45;&gt;GetRef</title>
<path fill="none" stroke="#000000" d="M1287.0997,-627.881C1235.4941,-620.593 1169.2745,-606.4266 1116,-579 1068.0603,-554.3198 1023.9304,-508.3997 999.9106,-480.6267"/>
<polygon fill="none" stroke="#000000" points="1286.7129,-633.1254 1302.2716,-629.8867 1288.089,-622.716 1286.7129,-633.1254"/>
</g>
<!-- SetRef -->
<g id="node29" class="node">
<title>SetRef</title>
<polygon fill="none" stroke="#000000" points="1281.5,-434.5 1281.5,-480.5 1408.5,-480.5 1408.5,-434.5 1281.5,-434.5"/>
<text text-anchor="middle" x="1345" y="-465.3" font-family="Helvetica,sans-Serif" font-size="14.00" fill="#000000">SetRef</text>
<polyline fill="none" stroke="#000000" points="1281.5,-457.5 1408.5,-457.5 "/>
<text text-anchor="middle" x="1345" y="-442.3" font-family="Helvetica,sans-Serif" font-size="14.00" fill="#000000">kind: VariableType</text>
</g>
<!-- Access&#45;&gt;SetRef -->
<g id="edge54" class="edge">
<title>Access&#45;&gt;SetRef</title>
<path fill="none" stroke="#000000" d="M1371.5234,-582.1486C1371.2076,-576.0155 1370.7204,-569.8624 1370,-564 1366.4094,-534.7819 1358.002,-501.903 1351.9269,-480.5074"/>
<polygon fill="none" stroke="#000000" points="1366.2769,-582.3464 1371.9903,-597.1761 1376.7718,-582.0202 1366.2769,-582.3464"/>
</g>
<!-- CallRef -->
<g id="node30" class="node">
<title>CallRef</title>
<polygon fill="none" stroke="#000000" points="1439.5,-434.5 1439.5,-480.5 1566.5,-480.5 1566.5,-434.5 1439.5,-434.5"/>
<text text-anchor="middle" x="1503" y="-465.3" font-family="Helvetica,sans-Serif" font-size="14.00" fill="#000000">CallRef</text>
<polyline fill="none" stroke="#000000" points="1439.5,-457.5 1566.5,-457.5 "/>
<text text-anchor="middle" x="1503" y="-442.3" font-family="Helvetica,sans-Serif" font-size="14.00" fill="#000000">kind: VariableType</text>
</g>
<!-- Access&#45;&gt;CallRef -->
<g id="edge56" class="edge">
<title>Access&#45;&gt;CallRef</title>
<path fill="none" stroke="#000000" d="M1444.5968,-587.7141C1458.7529,-575.5934 1472.2002,-561.5409 1482,-546 1494.55,-526.0976 1499.605,-499.3825 1501.6382,-480.5273"/>
<polygon fill="none" stroke="#000000" points="1440.953,-583.9094 1432.6034,-597.4315 1447.5631,-592.0677 1440.953,-583.9094"/>
</g>
<!-- Get&#45;&gt;Variable -->
<g id="edge39" class="edge">
<title>Get&#45;&gt;Variable</title>
<path fill="none" stroke="#000000" d="M1598.006,-512.2661C1612.2992,-505.4974 1628.9295,-495.2219 1639,-481 1653.5057,-460.5146 1658.7941,-432.4112 1660.5722,-410.6581"/>
<polygon fill="#000000" stroke="#000000" points="1664.0733,-410.7451 1661.1881,-400.5507 1657.0863,-410.3193 1664.0733,-410.7451"/>
<text text-anchor="middle" x="1680" y="-453.8" font-family="Helvetica,sans-Serif" font-size="14.00" fill="#000000">variable</text>
<text text-anchor="middle" x="1650.1881" y="-404.3507" font-family="Helvetica,sans-Serif" font-size="14.00" fill="#000000">0..1</text>
</g>
<!-- Set&#45;&gt;Variable -->
<g id="edge41" class="edge">
<title>Set&#45;&gt;Variable</title>
<path fill="none" stroke="#000000" d="M1703.6784,-499.4078C1706.2877,-493.5691 1708.6496,-487.1937 1710,-481 1714.4499,-460.5906 1717.3041,-453.5703 1710,-434 1706.5992,-424.8881 1700.9934,-416.2712 1694.7641,-408.6398"/>
<polygon fill="#000000" stroke="#000000" points="1697.0697,-405.9619 1687.8348,-400.7688 1691.8156,-410.5874 1697.0697,-405.9619"/>
<text text-anchor="middle" x="1738" y="-453.8" font-family="Helvetica,sans-Serif" font-size="14.00" fill="#000000">variable</text>
<text text-anchor="middle" x="1676.8348" y="-404.5688" font-family="Helvetica,sans-Serif" font-size="14.00" fill="#000000">0..1</text>
</g>
<!-- Call&#45;&gt;Type -->
<g id="edge44" class="edge">
<title>Call&#45;&gt;Type</title>
<path fill="none" stroke="#000000" d="M1173.9676,-488.7284C1175.382,-486.1404 1176.7425,-483.5451 1178,-481 1179.8783,-477.1986 1231.2126,-342.1951 1234,-339 1257.8891,-311.6165 1293.2581,-291.4244 1323.2006,-277.9295"/>
<polygon fill="#000000" stroke="#000000" points="1173.9442,-488.7694 1174.4296,-495.9641 1167.975,-499.1795 1167.4896,-491.9847 1173.9442,-488.7694"/>
<text text-anchor="middle" x="1291" y="-373.8" font-family="Helvetica,sans-Serif" font-size="14.00" fill="#000000">variadic_arg_types</text>
<text text-anchor="middle" x="1310.7006" y="-281.7295" font-family="Helvetica,sans-Serif" font-size="14.00" fill="#000000">0..N</text>
</g>
<!-- Call&#45;&gt;Function -->
<g id="edge43" class="edge">
<title>Call&#45;&gt;Function</title>
<path fill="none" stroke="#000000" d="M1145.4486,-499.2032C1139.0115,-479.344 1129.5515,-450.1587 1121.5089,-425.3466"/>
<polygon fill="#000000" stroke="#000000" points="1124.8044,-424.1624 1118.3914,-415.7289 1118.1455,-426.3209 1124.8044,-424.1624"/>
<text text-anchor="middle" x="1156.5" y="-453.8" font-family="Helvetica,sans-Serif" font-size="14.00" fill="#000000">target</text>
</g>
<!-- Call&#45;&gt;Access -->
<g id="edge45" class="edge">
<title>Call&#45;&gt;Access</title>
<path fill="none" stroke="#000000" d="M1122.8961,-556.1892C1119.2677,-564.049 1118.5193,-572.1241 1124,-579 1145.9693,-606.5621 1237.2202,-621.7571 1302.4068,-629.2679"/>
<polygon fill="#000000" stroke="#000000" points="1123.0347,-555.9634 1122.7659,-548.7573 1129.3144,-545.7376 1129.5831,-552.9438 1123.0347,-555.9634"/>
<text text-anchor="middle" x="1170" y="-567.8" font-family="Helvetica,sans-Serif" font-size="14.00" fill="#000000">implicit_access</text>
<text text-anchor="middle" x="1289.9068" y="-633.0679" font-family="Helvetica,sans-Serif" font-size="14.00" fill="#000000">0..N</text>
</g>
<!-- Builtin&#45;&gt;Function -->
<g id="edge47" class="edge">
<title>Builtin&#45;&gt;Function</title>
<path fill="none" stroke="#000000" d="M1239.664,-499.3502C1223.8298,-480.9052 1200.4551,-454.8139 1178,-434 1173.7448,-430.0558 1169.2386,-426.0872 1164.6396,-422.1815"/>
<polygon fill="#000000" stroke="#000000" points="1166.7633,-419.3953 1156.8401,-415.6832 1162.2825,-424.7733 1166.7633,-419.3953"/>
<text text-anchor="middle" x="1240.5" y="-453.8" font-family="Helvetica,sans-Serif" font-size="14.00" fill="#000000">target</text>
</g>
<!-- Builtin&#45;&gt;Access -->
<g id="edge48" class="edge">
<title>Builtin&#45;&gt;Access</title>
<path fill="none" stroke="#000000" d="M1250.7803,-557.9291C1250.7514,-565.3173 1252.1075,-572.7506 1256,-579 1266.6435,-596.0878 1284.1336,-608.155 1302.2994,-616.6158"/>
<polygon fill="#000000" stroke="#000000" points="1250.8018,-557.7013 1247.3852,-551.3509 1251.9331,-545.7547 1255.3496,-552.1051 1250.8018,-557.7013"/>
<text text-anchor="middle" x="1302" y="-567.8" font-family="Helvetica,sans-Serif" font-size="14.00" fill="#000000">implicit_access</text>
<text text-anchor="middle" x="1289.7994" y="-605.4158" font-family="Helvetica,sans-Serif" font-size="14.00" fill="#000000">0..N</text>
</g>
<!-- Ref&#45;&gt;Type -->
<g id="edge51" class="edge">
<title>Ref&#45;&gt;Type</title>
<path fill="none" stroke="#000000" d="M1437.2987,-487.497C1423.603,-432.4028 1397.3838,-326.9302 1385.7753,-280.2326"/>
<polygon fill="#000000" stroke="#000000" points="1437.3634,-487.7575 1442.6927,-492.6153 1440.2584,-499.4031 1434.929,-494.5453 1437.3634,-487.7575"/>
<text text-anchor="middle" x="1431" y="-373.8" font-family="Helvetica,sans-Serif" font-size="14.00" fill="#000000">type</text>
</g>
<!-- Ref&#45;&gt;Variable -->
<g id="edge50" class="edge">
<title>Ref&#45;&gt;Variable</title>
<path fill="none" stroke="#000000" d="M1473.0974,-516.0889C1504.6253,-508.1598 1554.1396,-494.1015 1568,-481 1584.3739,-465.5227 1573.3387,-451.9171 1587,-434 1594.7333,-423.8576 1604.7296,-414.5999 1614.8593,-406.6449"/>
<polygon fill="#000000" stroke="#000000" points="1617.077,-409.3566 1622.971,-400.5525 1612.8731,-403.7594 1617.077,-409.3566"/>
<text text-anchor="middle" x="1611" y="-453.8" font-family="Helvetica,sans-Serif" font-size="14.00" fill="#000000">variable</text>
</g>
<!-- GetRef&#45;&gt;Type -->
<g id="edge53" class="edge">
<title>GetRef&#45;&gt;Type</title>
<path fill="none" stroke="#000000" d="M972.0803,-422.3212C967.7778,-396.9992 966.5983,-363.1817 983,-339 984.335,-337.0318 1059.7107,-306.6442 1062,-306 1151.53,-280.8081 1259.1176,-267.6579 1323.4019,-261.5423"/>
<polygon fill="#000000" stroke="#000000" points="972.1293,-422.569 977.2179,-427.6784 974.4587,-434.3408 969.3701,-429.2314 972.1293,-422.569"/>
<text text-anchor="middle" x="996" y="-373.8" font-family="Helvetica,sans-Serif" font-size="14.00" fill="#000000">type</text>
</g>
<!-- SetRef&#45;&gt;Type -->
<g id="edge55" class="edge">
<title>SetRef&#45;&gt;Type</title>
<path fill="none" stroke="#000000" d="M1351.1906,-422.0365C1358.3291,-381.1432 1369.8593,-315.0914 1375.9426,-280.2433"/>
<polygon fill="#000000" stroke="#000000" points="1351.1471,-422.2865 1354.0557,-428.885 1349.0834,-434.1077 1346.1748,-427.5092 1351.1471,-422.2865"/>
<text text-anchor="middle" x="1378" y="-373.8" font-family="Helvetica,sans-Serif" font-size="14.00" fill="#000000">type</text>
</g>
<!-- CallRef&#45;&gt;Type -->
<g id="edge57" class="edge">
<title>CallRef&#45;&gt;Type</title>
<path fill="none" stroke="#000000" d="M1500.3154,-422.3918C1496.0286,-388.8261 1484.898,-338.6317 1456,-306 1447.1531,-296.01 1435.8024,-287.252 1424.5861,-280.0092"/>
<polygon fill="#000000" stroke="#000000" points="1500.3211,-422.4441 1504.9591,-427.9658 1501.646,-434.3708 1497.008,-428.8491 1500.3211,-422.4441"/>
<text text-anchor="middle" x="1512" y="-373.8" font-family="Helvetica,sans-Serif" font-size="14.00" fill="#000000">type</text>
</g>
<!-- Pointcut&#45;&gt;Arg -->
<g id="edge62" class="edge">
<title>Pointcut&#45;&gt;Arg</title>
<path fill="none" stroke="#000000" d="M172.9737,-107.136C147.6496,-91.5837 118.6341,-73.7644 95.0434,-59.2766"/>
<polygon fill="#000000" stroke="#000000" points="172.9813,-107.1407 180.1874,-106.8721 183.207,-113.4206 176.0008,-113.6892 172.9813,-107.1407"/>
<text text-anchor="middle" x="166.5" y="-83.8" font-family="Helvetica,sans-Serif" font-size="14.00" fill="#000000">args</text>
<text text-anchor="middle" x="107.5434" y="-63.0766" font-family="Helvetica,sans-Serif" font-size="14.00" fill="#000000">0..N</text>
</g>
<!-- Advice&#45;&gt;Introduction -->
<g id="edge66" class="edge">
<title>Advice&#45;&gt;Introduction</title>
<path fill="none" stroke="#000000" d="M331.0236,-342.1253C358.6308,-308.1457 404.3838,-257.4576 454,-226 513.8914,-188.0277 593.6605,-164.8221 642.3457,-153.1989"/>
<polygon fill="none" stroke="#000000" points="326.6007,-339.2516 321.3612,-354.2553 334.8135,-345.7938 326.6007,-339.2516"/>
</g>
<!-- Advice&#45;&gt;AdviceCode -->
<g id="edge65" class="edge">
<title>Advice&#45;&gt;AdviceCode</title>
<path fill="none" stroke="#000000" d="M345.7396,-351.2838C373.5848,-334.0162 407.7778,-313.2972 423,-306 436.6466,-299.4581 451.4122,-293.2315 465.9716,-287.5462"/>
<polygon fill="none" stroke="#000000" points="342.6487,-347.0238 332.691,-359.4095 348.1992,-355.9369 342.6487,-347.0238"/>
</g>
<!-- Advice&#45;&gt;Pointcut -->
<g id="edge64" class="edge">
<title>Advice&#45;&gt;Pointcut</title>
<path fill="none" stroke="#000000" d="M265.9528,-348.618C248.396,-332.8629 229.3957,-311.7402 220,-288 205.3588,-251.0058 213.8309,-204.6205 222.408,-174.6542"/>
<polygon fill="#000000" stroke="#000000" points="266.3816,-348.986 273.5398,-349.8582 275.4878,-356.8012 268.3296,-355.929 266.3816,-348.986"/>
<text text-anchor="middle" x="244" y="-253.3" font-family="Helvetica,sans-Serif" font-size="14.00" fill="#000000">pointcut</text>
</g>
<!-- Order -->
<g id="node36" class="node">
<title>Order</title>
<polygon fill="none" stroke="#000000" points="277,-234 277,-280 331,-280 331,-234 277,-234"/>
<text text-anchor="middle" x="304" y="-264.8" font-family="Helvetica,sans-Serif" font-size="14.00" fill="#000000">Order</text>
<polyline fill="none" stroke="#000000" points="277,-257 331,-257 "/>
<text text-anchor="middle" x="304" y="-241.8" font-family="Helvetica,sans-Serif" font-size="14.00" fill="#000000"> </text>
</g>
<!-- Advice&#45;&gt;Order -->
<g id="edge69" class="edge">
<title>Advice&#45;&gt;Order</title>
<path fill="none" stroke="#000000" d="M304,-339.0236C304,-319.6538 304,-296.8148 304,-280.1623"/>
<polygon fill="none" stroke="#000000" points="298.7501,-339.2664 304,-354.2664 309.2501,-339.2664 298.7501,-339.2664"/>
</g>
<!-- Order&#45;&gt;Pointcut -->
<g id="edge70" class="edge">
<title>Order&#45;&gt;Pointcut</title>
<path fill="none" stroke="#000000" d="M275.4809,-224.1774C271.4198,-218.9154 267.455,-213.416 264,-208 257.3602,-197.5916 251.1775,-185.5491 246.108,-174.7374"/>
<polygon fill="#000000" stroke="#000000" points="275.7888,-224.5611 282.6641,-226.7363 283.3005,-233.9193 276.4253,-231.7441 275.7888,-224.5611"/>
<text text-anchor="middle" x="304.5" y="-196.8" font-family="Helvetica,sans-Serif" font-size="14.00" fill="#000000">aspect_exprs</text>
<text text-anchor="middle" x="233.608" y="-178.5374" font-family="Helvetica,sans-Serif" font-size="14.00" fill="#000000">0..N</text>
</g>
<!-- Aspect&#45;&gt;Introduction -->
<g id="edge72" class="edge">
<title>Aspect&#45;&gt;Introduction</title>
<path fill="none" stroke="#000000" d="M592.9183,-348.7633C619.1557,-328.5971 650.4816,-302.702 659,-288 681.1879,-249.7054 685.6874,-196.9431 686.2935,-167.0713"/>
<polygon fill="#000000" stroke="#000000" points="592.7218,-348.9127 590.3671,-355.7286 583.1699,-356.1764 585.5246,-349.3606 592.7218,-348.9127"/>
<text text-anchor="middle" x="697" y="-253.3" font-family="Helvetica,sans-Serif" font-size="14.00" fill="#000000">intros</text>
<text text-anchor="middle" x="673.7935" y="-170.8713" font-family="Helvetica,sans-Serif" font-size="14.00" fill="#000000">0..N</text>
</g>
<!-- Aspect&#45;&gt;AdviceCode -->
<g id="edge73" class="edge">
<title>Aspect&#45;&gt;AdviceCode</title>
<path fill="none" stroke="#000000" d="M554.5867,-342.1537C554.8721,-324.9588 555.212,-304.4797 555.4869,-287.9144"/>
<polygon fill="#000000" stroke="#000000" points="554.5849,-342.268 558.4847,-348.3336 554.3856,-354.2664 550.4858,-348.2008 554.5849,-342.268"/>
<text text-anchor="middle" x="578" y="-309.8" font-family="Helvetica,sans-Serif" font-size="14.00" fill="#000000">advices</text>
<text text-anchor="middle" x="542.9869" y="-291.7144" font-family="Helvetica,sans-Serif" font-size="14.00" fill="#000000">0..N</text>
</g>
<!-- Aspect&#45;&gt;Order -->
<g id="edge74" class="edge">
<title>Aspect&#45;&gt;Order</title>
<path fill="none" stroke="#000000" d="M513.8469,-358.1462C462.5462,-333.4193 375.1345,-291.2868 331.0803,-270.0527"/>
<polygon fill="#000000" stroke="#000000" points="514.0227,-358.2309 521.1644,-357.2328 524.8325,-363.4413 517.6908,-364.4394 514.0227,-358.2309"/>
<text text-anchor="middle" x="455.5" y="-309.8" font-family="Helvetica,sans-Serif" font-size="14.00" fill="#000000">orders</text>
<text text-anchor="middle" x="343.5803" y="-273.8527" font-family="Helvetica,sans-Serif" font-size="14.00" fill="#000000">0..N</text>
</g>
<!-- Model -->
<g id="node38" class="node">
<title>Model</title>
<polygon fill="none" stroke="#000000" points="186.5,-740.5 186.5,-786.5 287.5,-786.5 287.5,-740.5 186.5,-740.5"/>
<text text-anchor="middle" x="237" y="-771.3" font-family="Helvetica,sans-Serif" font-size="14.00" fill="#000000">Model</text>
<polyline fill="none" stroke="#000000" points="186.5,-763.5 287.5,-763.5 "/>
<text text-anchor="middle" x="237" y="-748.3" font-family="Helvetica,sans-Serif" font-size="14.00" fill="#000000">version: string</text>
</g>
<!-- Model&#45;&gt;File -->
<g id="edge75" class="edge">
<title>Model&#45;&gt;File</title>
<path fill="none" stroke="#000000" d="M207.0594,-731.5634C190.5749,-713.9798 170.0087,-692.0426 152.693,-673.5725"/>
<polygon fill="#000000" stroke="#000000" points="207.0616,-731.5657 214.0834,-733.2072 215.2689,-740.3202 208.2471,-738.6787 207.0616,-731.5657"/>
<text text-anchor="middle" x="192.5" y="-695.8" font-family="Helvetica,sans-Serif" font-size="14.00" fill="#000000">files</text>
<text text-anchor="middle" x="165.193" y="-677.3725" font-family="Helvetica,sans-Serif" font-size="14.00" fill="#000000">0..N</text>
</g>
<!-- Model&#45;&gt;Namespace -->
<g id="edge76" class="edge">
<title>Model&#45;&gt;Namespace</title>
<path fill="none" stroke="#000000" d="M237,-728.0196C237,-705.8132 237,-677.8483 237,-658.5074"/>
<polygon fill="#000000" stroke="#000000" points="237.0001,-728.3202 241,-734.3202 237,-740.3202 233,-734.3201 237.0001,-728.3202"/>
<text text-anchor="middle" x="249" y="-695.8" font-family="Helvetica,sans-Serif" font-size="14.00" fill="#000000">root</text>
</g>
</g>
</svg>
