G04 flash and draw line with different regular apertures *
%MOMM*%
%FSLAX23Y23*%
%LNTOP*%
%ADD11C,1.0000X0.4000*%
%ADD12R,1.0000X0.5000X0.4000*%
%ADD13O,1.0000X0.5000X0.4000*%
%ADD14P,1.0000X3X0X0.4000*%
%ADD15P,1.0000X3X30X0.4000*%

G54D11*X10000Y01000D03*
G54D11*X10000Y12000D02*Y12300D01*

G54D12*X20000Y01000D03*
G54D12*X20000Y12000D02*Y12300D01*

G54D13*X30000Y01000D03*
G54D13*X30000Y12000D02*Y12300D01*

G54D14*X40000Y01000D03*
G54D14*X40000Y12000D02*Y12300D01*

G54D15*X50000Y01000D03*
G54D15*X50000Y12000D02*Y12300D01*
M02*
