/* XPM */
static char * dir_close_xpm[] = {
"16 16 83 1",
" 	c None",
".	c #385160",
"+	c #364E5B",
"@	c #37505D",
"#	c #2E3B44",
"$	c #395462",
"%	c #48728A",
"&	c #466E86",
"*	c #42657B",
"=	c #293237",
"-	c #374F5C",
";	c #477088",
">	c #3D5C6D",
",	c #3D5C6E",
"'	c #3C5B6C",
")	c #3B5869",
"!	c #364D5A",
"~	c #467086",
"{	c #3A5665",
"]	c #43687E",
"^	c #416478",
"/	c #406174",
"(	c #3E5F71",
"_	c #3E5D70",
":	c #283136",
"<	c #466E85",
"[	c #3C5A6A",
"}	c #3A5666",
"|	c #38515F",
"1	c #354955",
"2	c #334650",
"3	c #31424B",
"4	c #304048",
"5	c #2E3C45",
"6	c #272F33",
"7	c #456D85",
"8	c #3B5768",
"9	c #395564",
"0	c #354A56",
"a	c #2E3C44",
"b	c #2D3A42",
"c	c #456C83",
"d	c #364A57",
"e	c #344752",
"f	c #32444D",
"g	c #2C3840",
"h	c #2C3940",
"i	c #446A81",
"j	c #385260",
"k	c #364D58",
"l	c #354954",
"m	c #32444E",
"n	c #304149",
"o	c #2F3D46",
"p	c #2B373E",
"q	c #272E33",
"r	c #528AA6",
"s	c #5189A3",
"t	c #4F839E",
"u	c #4D7E98",
"v	c #4B7994",
"w	c #48758D",
"x	c #48748C",
"y	c #283034",
"z	c #5289A5",
"A	c #5186A2",
"B	c #4A7790",
"C	c #47728A",
"D	c #3D5D6E",
"E	c #426478",
"F	c #293236",
"G	c #4F829D",
"H	c #4D7C97",
"I	c #4A7891",
"J	c #48728C",
"K	c #477189",
"L	c #416477",
"M	c #406072",
"N	c #50859E",
"O	c #4E819C",
"P	c #406074",
"Q	c #272E32",
"R	c #262D31",
"                ",
"  .+@#          ",
" $%&&*=         ",
"-;>,')$!+++++.  ",
"-~''){>]^/(,>_: ",
"-<[[}$|!1234556 ",
"-7889.+0234abb6 ",
"-c{9.+def4abgh6 ",
"-i$j@klmnobgpgq ",
"-rrrrstuvwx_*}y ",
"-rrzAtuBwCDE$^F ",
"-rzAGHIJK(L$M.y ",
"-rNOHBxKMP9D+(: ",
" QRRRRRRRRRRR6  ",
"                ",
"                "};
