/* XPM */
static char * spam_xpm[] = {
"12 12 103 2",
"  	c None",
". 	c #C3C3F3",
"+ 	c #A6A6F3",
"@ 	c #A7A7F3",
"# 	c #AAAAF4",
"$ 	c #ABABF4",
"% 	c #A8A8F3",
"& 	c #A6A6E9",
"* 	c #3333CC",
"= 	c #4141D4",
"- 	c #4D4DD7",
"; 	c #6A6AE0",
"> 	c #7F7FE4",
", 	c #7979E2",
"' 	c #5555D7",
") 	c #3737CD",
"! 	c #3333A5",
"~ 	c #3838CE",
"{ 	c #7272E3",
"] 	c #B1B1F1",
"^ 	c #BFBFFB",
"/ 	c #DCDCFF",
"( 	c #E4E4FD",
"_ 	c #A4A4EC",
": 	c #4A4AD3",
"< 	c #3333C6",
"[ 	c #3333A4",
"} 	c #3C3CD1",
"| 	c #8888E8",
"1 	c #E7E7FC",
"2 	c #D2D2FF",
"3 	c #B5B5FF",
"4 	c #FCFCFF",
"5 	c #C7C7F4",
"6 	c #5858D7",
"7 	c #3333B7",
"8 	c #3333A3",
"9 	c #5C5CD9",
"0 	c #9999E8",
"a 	c #ADADF2",
"b 	c #A1A1EE",
"c 	c #7878E5",
"d 	c #6262E5",
"e 	c #A0A0F0",
"f 	c #A8A8FA",
"g 	c #3C3CB4",
"h 	c #9191F7",
"i 	c #E6E6FD",
"j 	c #E4E4FE",
"k 	c #7F7FE5",
"l 	c #3C3CD0",
"m 	c #3B3BD0",
"n 	c #7A7AE5",
"o 	c #D7D7FF",
"p 	c #B7B7FA",
"q 	c #5454C4",
"r 	c #B0B0F7",
"s 	c #F1F1FE",
"t 	c #E3E3FF",
"u 	c #8A8AEB",
"v 	c #4949DA",
"w 	c #4242D2",
"x 	c #8787EB",
"y 	c #DFDFFF",
"z 	c #D8D8FA",
"A 	c #7070C4",
"B 	c #5A5ADB",
"C 	c #B4B4F7",
"D 	c #CACAFF",
"E 	c #C6C6FF",
"F 	c #9191FF",
"G 	c #9090EB",
"H 	c #C2C2FF",
"I 	c #CDCDFF",
"J 	c #9E9EED",
"K 	c #4444B6",
"L 	c #3D3DD0",
"M 	c #7474E8",
"N 	c #BDBDFD",
"O 	c #ECECFF",
"P 	c #A0A0F7",
"Q 	c #E9E9FF",
"R 	c #FEFEFF",
"S 	c #E3E3FD",
"T 	c #8585E4",
"U 	c #3D3DB2",
"V 	c #3535CE",
"W 	c #4444D8",
"X 	c #9A9AED",
"Y 	c #5F5FDC",
"Z 	c #A6A6ED",
"` 	c #B4B4ED",
" .	c #9393E8",
"..	c #4F4FCA",
"+.	c #3535AD",
"@.	c #3434B2",
"#.	c #3B3BB5",
"$.	c #4242B6",
"%.	c #3737B2",
"&.	c #4545B6",
"*.	c #4848B6",
"=.	c #4242B5",
"-.	c #3737AA",
". + + @ + # $ $ % + + & ",
"* * * = - ; > , ' ) * ! ",
"* * ~ { ] ^ / ( _ : < [ ",
"* * } | 1 2 3 4 5 6 7 8 ",
"  9 0 a b c d e f { g   ",
"  h i j k l m n o p q   ",
"  r s t u v w x y z A   ",
"  B C D E F G H I J K   ",
"  L M N O P Q R S T U   ",
"  V W M X Y Z `  ...+.  ",
"    @.#.$.%.&.*.=.-.    ",
"                        "};
