/* XPM */
static char * outbox_open_xpm[] = {
"16 16 119 2",
"  	c None",
". 	c #774115",
"+ 	c #5D3500",
"@ 	c #613300",
"# 	c #4A1C00",
"$ 	c #026110",
"% 	c #046811",
"& 	c #2E1A00",
"* 	c #FFF270",
"= 	c #F3F3F3",
"- 	c #FFFFA4",
"; 	c #FFFFB4",
"> 	c #076014",
", 	c #30AD41",
"' 	c #108C21",
") 	c #026310",
"! 	c #7A480C",
"~ 	c #BE9943",
"{ 	c #FEDE42",
"] 	c #D3AF39",
"^ 	c #1C7720",
"/ 	c #4BC95B",
"( 	c #3AB54B",
"_ 	c #2FAB40",
": 	c #169527",
"< 	c #096210",
"[ 	c #4E2800",
"} 	c #502800",
"| 	c #2C1100",
"1 	c #000000",
"2 	c #7F441C",
"3 	c #FFFF8E",
"4 	c #FFF68C",
"5 	c #0F6C1C",
"6 	c #74F185",
"7 	c #70EC81",
"8 	c #45C156",
"9 	c #3EB94F",
"0 	c #32AF43",
"a 	c #129024",
"b 	c #036211",
"c 	c #DEC16F",
"d 	c #BCA25A",
"e 	c #270E00",
"f 	c #7F4010",
"g 	c #D3AF62",
"h 	c #7DAC3E",
"i 	c #80A135",
"j 	c #3CB84D",
"k 	c #4ECA5F",
"l 	c #51CE62",
"m 	c #147122",
"n 	c #485C06",
"o 	c #3F5E08",
"p 	c #886105",
"q 	c #766527",
"r 	c #F9E474",
"s 	c #41BD52",
"t 	c #57D368",
"u 	c #59D66A",
"v 	c #177524",
"w 	c #FFF39E",
"x 	c #85420A",
"y 	c #A98947",
"z 	c #F0EFEE",
"A 	c #FEF69F",
"B 	c #FDF79F",
"C 	c #5AD76B",
"D 	c #FEFDA2",
"E 	c #FDF79B",
"F 	c #FEF79B",
"G 	c #FBF08B",
"H 	c #F3E785",
"I 	c #754300",
"J 	c #A78846",
"K 	c #EAE7E5",
"L 	c #FAF49C",
"M 	c #5FDB70",
"N 	c #177525",
"O 	c #FBF599",
"P 	c #FBF59A",
"Q 	c #FCF69A",
"R 	c #CEAA5E",
"S 	c #F5EF97",
"T 	c #F6F097",
"U 	c #F7F098",
"V 	c #42BE53",
"W 	c #43C054",
"X 	c #0D6C1B",
"Y 	c #F7F196",
"Z 	c #F6ED8C",
"` 	c #F8F297",
" .	c #F6EC8C",
"..	c #8E7542",
"+.	c #F4ED96",
"@.	c #F1E790",
"#.	c #F2E992",
"$.	c #F1E991",
"%.	c #F3E992",
"&.	c #F3ED93",
"*.	c #F3E991",
"=.	c #F3EE96",
"-.	c #F3EA92",
";.	c #F2E689",
">.	c #E7CF68",
",.	c #EFE38E",
"'.	c #E7DB87",
").	c #E9DF89",
"!.	c #EADE8A",
"~.	c #E8E08A",
"{.	c #E8DD87",
"].	c #E8E08C",
"^.	c #E8DE87",
"/.	c #E9DD87",
"(.	c #E8DA80",
"_.	c #E9DF88",
":.	c #BF9850",
"<.	c #4C1F00",
"[.	c #512402",
"                                ",
"                                ",
"    . + @ #   $ %               ",
"  & * = - ; > , ' )             ",
"  ! ~ { ] ^ / ( _ : < [ } | 1   ",
"  2 3 4 5 6 7 8 9 0 a b c d e   ",
"  f 4 g h i j k l m n o p 1 1 1 ",
"  q g r = = s t u v = = = = w 1 ",
"  x y z A B s t C v D E F G H 1 ",
"  I J K L L s t M N O O P Q g 1 ",
"  1 R S T U j V W X Y Z `  ...1 ",
"  1 +.@.#.$.%.&.*.=.%.-.;.>.1   ",
"  1 ,.'.).!.~.{.].^./.(._.:.<.  ",
"  1 1 1 1 1 1 1 1 1 1 1 1 [.1   ",
"                                ",
"                                "};
