/* XPM */
static char * mail_attach_xpm[] = {
"32 32 234 2",
"  	c None",
". 	c #A7A7A7",
"+ 	c #A6A6A6",
"@ 	c #4E4E4E",
"# 	c #000000",
"$ 	c #010101",
"% 	c #1B1B1B",
"& 	c #6A6A6A",
"* 	c #202020",
"= 	c #7B7B7B",
"- 	c #808080",
"; 	c #7F7F7D",
"> 	c #7E7F7A",
", 	c #7E7E77",
"' 	c #7D7E73",
") 	c #7C7D70",
"! 	c #7C7D6D",
"~ 	c #7B7D6A",
"{ 	c #525347",
"] 	c #030303",
"^ 	c #2A2A2A",
"/ 	c #ACACAC",
"( 	c #262626",
"_ 	c #DEDEDE",
": 	c #C7C7C7",
"< 	c #BEBEBB",
"[ 	c #BDBEB5",
"} 	c #BCBDB1",
"| 	c #BBBCAC",
"1 	c #BABBA7",
"2 	c #B9BBA3",
"3 	c #B8BB9F",
"4 	c #EAEDCA",
"5 	c #4B4C41",
"6 	c #090909",
"7 	c #161616",
"8 	c #101010",
"9 	c #FFFFFF",
"0 	c #20201F",
"a 	c #424239",
"b 	c #070706",
"c 	c #282828",
"d 	c #777777",
"e 	c #181818",
"f 	c #A8A8A8",
"g 	c #FDFEF7",
"h 	c #20201E",
"i 	c #707070",
"j 	c #636363",
"k 	c #2E2E2E",
"l 	c #AAAAAA",
"m 	c #FAFAFA",
"n 	c #F8F8F8",
"o 	c #8F8F8F",
"p 	c #5D5D5D",
"q 	c #10100F",
"r 	c #FCFDF0",
"s 	c #1F201D",
"t 	c #7A7A7A",
"u 	c #0F0F0F",
"v 	c #3D3D3D",
"w 	c #7D7D7D",
"x 	c #F0F0F0",
"y 	c #F7F7F7",
"z 	c #F6F6F6",
"A 	c #EAEAEA",
"B 	c #111111",
"C 	c #FAFCE9",
"D 	c #1F1F1C",
"E 	c #070707",
"F 	c #515151",
"G 	c #B2B2B2",
"H 	c #EEEEEE",
"I 	c #CACACA",
"J 	c #F4F4F4",
"K 	c #F5F5F5",
"L 	c #FBFBFB",
"M 	c #3F3F3F",
"N 	c #9C9C9C",
"O 	c #989898",
"P 	c #080808",
"Q 	c #F9FBE2",
"R 	c #0B0B0B",
"S 	c #9F9F9F",
"T 	c #EFEFEF",
"U 	c #ABABAB",
"V 	c #0C0C0C",
"W 	c #252525",
"X 	c #E4E4E4",
"Y 	c #D4D4D4",
"Z 	c #F9F9F9",
"` 	c #9D9D9D",
" .	c #525252",
"..	c #10100E",
"+.	c #F7FADB",
"@.	c #1F1F1B",
"#.	c #2B2B2B",
"$.	c #F1F1F1",
"%.	c #292929",
"&.	c #040403",
"*.	c #3D3E34",
"=.	c #060606",
"-.	c #676767",
";.	c #B3B3B3",
">.	c #B4B4B4",
",.	c #D3D3D3",
"'.	c #050505",
").	c #242424",
"!.	c #1F1F1F",
"~.	c #797979",
"{.	c #191919",
"].	c #0F100E",
"^.	c #F6F9D4",
"/.	c #EDEDED",
"(.	c #020202",
"_.	c #2E2F28",
":.	c #D7DAB9",
"<.	c #3B3B3B",
"[.	c #FCFCFC",
"}.	c #4B4B4B",
"|.	c #949494",
"1.	c #C9C9C9",
"2.	c #0F100D",
"3.	c #DBDBDB",
"4.	c #C5C5C5",
"5.	c #484848",
"6.	c #474747",
"7.	c #AFAFAF",
"8.	c #B0B0B0",
"9.	c #B1B1B1",
"0.	c #CCCCCC",
"a.	c #0A0A0A",
"b.	c #121212",
"c.	c #E7E7E7",
"d.	c #171717",
"e.	c #B6B6B6",
"f.	c #CDCDCD",
"g.	c #E5E5E5",
"h.	c #444444",
"i.	c #BABABA",
"j.	c #B5B5B5",
"k.	c #BBBBBB",
"l.	c #FDFDFD",
"m.	c #575757",
"n.	c #8A8A8A",
"o.	c #5C5C5C",
"p.	c #040404",
"q.	c #131313",
"r.	c #272727",
"s.	c #F2F2F2",
"t.	c #F3F3F3",
"u.	c #ECECEC",
"v.	c #B9B9B9",
"w.	c #3E3E3E",
"x.	c #5A5A5A",
"y.	c #E9E9E9",
"z.	c #BEBEBE",
"A.	c #424242",
"B.	c #FEFEFE",
"C.	c #1A1A1A",
"D.	c #050504",
"E.	c #EBEECB",
"F.	c #4A4B40",
"G.	c #6E6E6E",
"H.	c #717171",
"I.	c #404037",
"J.	c #D3D6B6",
"K.	c #545454",
"L.	c #DADADA",
"M.	c #C3C3C3",
"N.	c #696969",
"O.	c #ADADAD",
"P.	c #969882",
"Q.	c #E4E6C4",
"R.	c #20201B",
"S.	c #151512",
"T.	c #878974",
"U.	c #DDDDDD",
"V.	c #B7B7B7",
"W.	c #B8B8B8",
"X.	c #E2E2E2",
"Y.	c #343434",
"Z.	c #D1D1D1",
"`.	c #B9BBA0",
" +	c #C9CBAD",
".+	c #0A0A08",
"++	c #090907",
"@+	c #C2C4A7",
"#+	c #B2B59A",
"$+	c #080807",
"%+	c #A9A9A9",
"&+	c #C4C4C4",
"*+	c #0E0F0C",
"=+	c #CACCAE",
"-+	c #A2A48C",
";+	c #A8AA91",
">+	c #0B0B09",
",+	c #868686",
"'+	c #BDBDBD",
")+	c #D7D7D7",
"!+	c #7C7C7C",
"~+	c #A0A0A0",
"{+	c #757575",
"]+	c #9B9B9B",
"^+	c #181815",
"/+	c #D2D5B5",
"(+	c #121310",
"_+	c #8B8B8B",
":+	c #353535",
"<+	c #414141",
"[+	c #616161",
"}+	c #555649",
"|+	c #909090",
"1+	c #D6D6D6",
"2+	c #737373",
"3+	c #818181",
"4+	c #323232",
"5+	c #E6E6E6",
"6+	c #828282",
"7+	c #929292",
"8+	c #EBEBEB",
"9+	c #383838",
"0+	c #4D4D4D",
"a+	c #E1E1E1",
"b+	c #848484",
"c+	c #C8C8C8",
"d+	c #666666",
"e+	c #303030",
"f+	c #7F7F7F",
"g+	c #1E1E1E",
"h+	c #767676",
"i+	c #1D1D1D",
"j+	c #232323",
"k+	c #979797",
"                                                                ",
"                    . + + + + + + + +                           ",
"                @ # $ $ # # # # # # $ # %                       ",
"              & # * = - ; > , ' ) ! ~ { ] ^   /                 ",
"              ( $ _ : < [ } | 1 2 3 3 4 5 # 6 # # -             ",
"              7 8 9 0 # # # # # # # # a b # c d e # f           ",
"              7 8 g h # i i j # # # # $ k l m n o # p           ",
"              7 q r s # t k # # u v w x y z y n A $ B           ",
"              7 q C D # # E F G H I J J K z y n L M # N         ",
"            O P q Q D R S T J U V # W X A Y A n Z ` #  .        ",
"        p 8 ] # ..+.@.#.x x $.%.&.*.=.-.;.>.,.Z m $.'.R         ",
"    ).$ E !.~.{.].^.@.^ T x /.(._.:.# <.>.: X Z m [.}.# |.      ",
"  7 E -.1.K T % 2.^.@.%.3.4.G (._.:.# 5.$.n Z Z m L U # 5.      ",
"  ] 6.J /././.% 2.^.@.!.7.8.9.(._.:.# F K X 0.,.L [.y a.E       ",
"  B b.J /./.c.d.2.^.@.!.e.f.g.(._.:.# h.i.j.e.k.m [.l.m.# n.    ",
"  o.p.i././.c.q.2.^.@.r.x s.t.(._.:.# <.j.k.,.u.L [.l.v.# w.    ",
"    $ x.$././.d.2.^.@.%.y.Y z.(._.:.# A.g.n m L [.l.B.L B ]     ",
"    C.R s././.* D.E.F.] G.9.H.(.I.J.# K.Z m $.L.M.J B.9 j # -   ",
"    N.E O././.m.'.P.Q.R.] x.] S.:.T.P ~.U.4.V.W.i.X.B.9 : # Y.  ",
"      # @ s./.Z.E b `. +.+# ++@+#+$+6 %+e.e.&+U.z B.9 9 B.{.$   ",
"      ( =.H /.H l p.*+=+-+(.;+@+>+] ,+'+)+x L [.l.B.9 9 9 !+(.~+",
"      {+E S T T x ]+] ^+/+^.=+(+] _+c.Z m L [.l.B.9 9 B.4.:+#   ",
"        $ <+J T x _ [+p..+}+D.'.|+n Z m m L [.l.B.1+2+% P ] 3+  ",
"        4+(.y.T x 5+9.~.{.$ % + y n Z m L l.X 6+c E (.{.-.      ",
"        - E 7+$.$.$.8+t.J $.z y n Z L H |.9+p.] u x.            ",
"          p.:+z $.s.t.J K K z Z J + 6.'.=.P 0+                  ",
"          M (.a+$.s.t.J y n V.m.6 E ] w._+                      ",
"          _+=.b+t.K Z c+d+b.E $ e+f+                            ",
"            R g+z.h+i+=.# j+2+                                  ",
"            O p.=.(.d.d+                                        ",
"                k+                                              ",
"                                                                "};
