/* XPM */
static char * mail_sign_xpm[] = {
"24 24 25 1",
" 	c None",
".	c #2C2C2C",
"+	c #4D4D4D",
"@	c #F7F7F7",
"#	c #FFFFFF",
"$	c #565656",
"%	c #FAFAFA",
"&	c #FBFBFB",
"*	c #FCFCFC",
"=	c #EEEEEE",
"-	c #B1B1B1",
";	c #F4F4F4",
">	c #FDFDFD",
",	c #F5F5F5",
"'	c #EAEAEA",
")	c #F8F8F8",
"!	c #B0B0B0",
"~	c #898989",
"{	c #8A8A8A",
"]	c #E6E6E6",
"^	c #F9F9F9",
"/	c #4C4C4C",
"(	c #2A2A2A",
"_	c #4A4A4A",
":	c #555555",
"                        ",
"                        ",
"                        ",
"                        ",
"                        ",
"   .                .   ",
"   +@##############@+   ",
"   $%##############%$   ",
"   $%##############%$   ",
"   $%##############%$   ",
"   $@&*#**#########%$   ",
"   $=--;-->########%$   ",
"   $,=','')%%%%%%*#%$   ",
"   $=!~~~~~{{{{{{->%$   ",
"   $,=]]]]')%%%%%*#%$   ",
"   $=!{{{{->#######%$   ",
"   $@&%%%%*########%$   ",
"   $^##############^$   ",
"   /'^%%%%%%%%%%%%^'/   ",
"   (_:$$$$$$$$$$$$:_(   ",
"                        ",
"                        ",
"                        ",
"                        "};
