/* XPM */
static char * queue_close_xpm[] = {
"16 12 40 1",
" 	c None",
".	c #000000",
"+	c #9A9A9A",
"@	c #949695",
"#	c #848486",
"$	c #C1C2C4",
"%	c #747980",
"&	c #63666A",
"*	c #6A6A6A",
"=	c #FDF6EA",
"-	c #B7B9B8",
";	c #C8C8C9",
">	c #FEFEFE",
",	c #949392",
"'	c #A9ACB1",
")	c #878787",
"!	c #E7D5B8",
"~	c #E3CBAC",
"{	c #E2C9A9",
"]	c #DCC09C",
"^	c #858684",
"/	c #908E8E",
"(	c #7C7C7C",
"_	c #BEBCB3",
":	c #8C8D8E",
"<	c #8D8B89",
"[	c #C4C2C0",
"}	c #A1A09E",
"|	c #6C6C6D",
"1	c #717376",
"2	c #969696",
"3	c #ACAAAA",
"4	c #A9A6A4",
"5	c #717274",
"6	c #C8C8C8",
"7	c #919191",
"8	c #807D74",
"9	c #A09E9C",
"0	c #727478",
"a	c #727273",
"   .....        ",
"  .     ....... ",
"  .            .",
"  .     ........",
"  ......+@#$%&*.",
"  .=====-;>,>').",
"  .=!~{]^>>/>>(.",
"  .=!~{]_>>:<[}.",
"  .=!~{]|>>>>>1.",
"  .=!~{]23>>>45.",
"  .=!~{]67890a+.",
"   ............ "};
