/* XPM */
static char * jpilot_xpm[] = {
"32 32 414 2",
"  	c None",
". 	c #CCCCCC",
"+ 	c #D3D3D3",
"@ 	c #CACACA",
"# 	c #CBCBCB",
"$ 	c #CECECE",
"% 	c #C4C4C4",
"& 	c #E4E4E4",
"* 	c #EDEDED",
"= 	c #EEEEEE",
"- 	c #E8E8E8",
"; 	c #C2C2C2",
"> 	c #C5C5C5",
", 	c #F1F1F1",
"' 	c #E7E8E6",
") 	c #E1E3E0",
"! 	c #E2E3E0",
"~ 	c #DADADA",
"{ 	c #B1B1B1",
"] 	c #C0C0C0",
"^ 	c #D4D4D4",
"/ 	c #ECEDEB",
"( 	c #C7D1BB",
"_ 	c #C4CFB6",
": 	c #C3CEB7",
"< 	c #C4CFB9",
"[ 	c #C9D2BF",
"} 	c #CAD3C1",
"| 	c #C9D3BF",
"1 	c #BECBB1",
"2 	c #DBE1D5",
"3 	c #E1E1E2",
"4 	c #9D9D9D",
"5 	c #D2D2D2",
"6 	c #E8EAE6",
"7 	c #C5D5B4",
"8 	c #C3D3B0",
"9 	c #C2D3AF",
"0 	c #C2D3B0",
"a 	c #C1D1B2",
"b 	c #C4D0B7",
"c 	c #C5D0B9",
"d 	c #C2D0B4",
"e 	c #ACC195",
"f 	c #C6D3B8",
"g 	c #DBDADC",
"h 	c #A4A4A4",
"i 	c #BFBFBF",
"j 	c #D0D0D0",
"k 	c #E5E7E2",
"l 	c #BBCDA7",
"m 	c #B8CAA1",
"n 	c #B7CAA1",
"o 	c #B8CBA2",
"p 	c #B9CCA4",
"q 	c #BACDA6",
"r 	c #BDCFA8",
"s 	c #BECFAA",
"t 	c #BED0AA",
"u 	c #BED0AB",
"v 	c #C0D1AE",
"w 	c #BFCFAF",
"x 	c #BBCAA9",
"y 	c #B6C6A4",
"z 	c #B1C59D",
"A 	c #9BB57E",
"B 	c #BDCCAD",
"C 	c #DCDBDD",
"D 	c #A5A5A5",
"E 	c #D1D1D1",
"F 	c #E0E3DD",
"G 	c #AFC497",
"H 	c #ACC394",
"I 	c #B1C69A",
"J 	c #B4C99E",
"K 	c #B5C99F",
"L 	c #B7CAA2",
"M 	c #BACDA5",
"N 	c #BBCCA6",
"O 	c #BBCEA7",
"P 	c #BCCEA9",
"Q 	c #BECFAC",
"R 	c #B4C6A1",
"S 	c #AAC094",
"T 	c #A3BB8C",
"U 	c #9FB985",
"V 	c #92AF74",
"W 	c #DEDDDF",
"X 	c #A7A7A7",
"Y 	c #C3C3C3",
"Z 	c #D2D2D3",
"` 	c #DDDFD9",
" .	c #A8BF8F",
"..	c #A9C090",
"+.	c #AFC597",
"@.	c #B2C89C",
"#.	c #B4C79D",
"$.	c #B5C89F",
"%.	c #B8CBA3",
"&.	c #BBCEA8",
"*.	c #B7C8A2",
"=.	c #A5BF8D",
"-.	c #9EBB84",
";.	c #98B77C",
">.	c #92B373",
",.	c #92B073",
"'.	c #BDCBAC",
").	c #A9A9A9",
"!.	c #BDBDBD",
"~.	c #B3B3B3",
"{.	c #D2D1D2",
"].	c #DADDD7",
"^.	c #A6BD8C",
"/.	c #A7BF8E",
"(.	c #ADC394",
"_.	c #B1C79A",
":.	c #B2C69B",
"<.	c #B3C79D",
"[.	c #B6CAA1",
"}.	c #B6CAA0",
"|.	c #B8CAA4",
"1.	c #BACCA7",
"2.	c #ACC295",
"3.	c #9DBC81",
"4.	c #98BB7A",
"5.	c #94B874",
"6.	c #90B46E",
"7.	c #92B072",
"8.	c #BCCAAB",
"9.	c #D9D8D9",
"0.	c #ABABAB",
"a.	c #B8B8B8",
"b.	c #D9DBD6",
"c.	c #A4BC8B",
"d.	c #A6BE8C",
"e.	c #ABC292",
"f.	c #B0C699",
"g.	c #B1C59A",
"h.	c #B1C69B",
"i.	c #B4C89F",
"j.	c #B5C9A1",
"k.	c #A3BE89",
"l.	c #99BC7C",
"m.	c #97BC76",
"n.	c #94BA73",
"o.	c #90B56D",
"p.	c #91B270",
"q.	c #D7D6D7",
"r.	c #B4B4B4",
"s.	c #D7D9D4",
"t.	c #A3BB89",
"u.	c #A5BD8A",
"v.	c #AAC191",
"w.	c #AFC598",
"x.	c #B0C499",
"y.	c #B0C599",
"z.	c #B4C89E",
"A.	c #B6C9A1",
"B.	c #B4C8A1",
"C.	c #ABC394",
"D.	c #9DBD80",
"E.	c #99BD78",
"F.	c #97BD76",
"G.	c #94BB73",
"H.	c #90B66E",
"I.	c #8FB16E",
"J.	c #BBC9AA",
"K.	c #D4D3D5",
"L.	c #CFCFCF",
"M.	c #D5D8D2",
"N.	c #A2BA88",
"O.	c #A3BC88",
"P.	c #A8C08F",
"Q.	c #AEC496",
"R.	c #AFC398",
"S.	c #AFC59A",
"T.	c #B4C7A0",
"U.	c #AAC394",
"V.	c #A2BF87",
"W.	c #9ABD7A",
"X.	c #98BE77",
"Y.	c #97BE76",
"Z.	c #95BC73",
"`.	c #91B76D",
" +	c #89AE67",
".+	c #BAC9AA",
"++	c #D2D1D3",
"@+	c #BBBBBB",
"#+	c #A3A3A3",
"$+	c #D4D7D1",
"%+	c #A2BB86",
"&+	c #A6BE8D",
"*+	c #AEC397",
"=+	c #B3C69D",
"-+	c #ABC492",
";+	c #A0C183",
">+	c #9CC07E",
",+	c #99BF78",
"'+	c #98C077",
")+	c #97BF75",
"!+	c #94BC72",
"~+	c #90B76C",
"{+	c #89AE66",
"]+	c #B9C8A9",
"^+	c #D0CFD1",
"/+	c #A0A0A1",
"(+	c #A2A2A2",
"_+	c #D2D5CF",
":+	c #A2BA89",
"<+	c #9FB883",
"[+	c #A3BB8A",
"}+	c #ACC194",
"|+	c #AEC498",
"1+	c #AEC398",
"2+	c #A6C08D",
"3+	c #9DC17E",
"4+	c #9CC27B",
"5+	c #9BC17A",
"6+	c #99C178",
"7+	c #99C177",
"8+	c #97C075",
"9+	c #95BE73",
"0+	c #8EB26C",
"a+	c #CDCCCE",
"b+	c #BCBCBC",
"c+	c #A1A1A1",
"d+	c #C7C7C7",
"e+	c #D1D3CE",
"f+	c #A3BA8C",
"g+	c #9DB681",
"h+	c #A5BC8B",
"i+	c #A4BF8A",
"j+	c #9EBF83",
"k+	c #9CC27C",
"l+	c #9CC37A",
"m+	c #9BC379",
"n+	c #9AC279",
"o+	c #9AC278",
"p+	c #98C176",
"q+	c #96BF74",
"r+	c #92B471",
"s+	c #BBC9AB",
"t+	c #CAC9CB",
"u+	c #9A9A9A",
"v+	c #B5B5B5",
"w+	c #A0A0A0",
"x+	c #D0D2CD",
"y+	c #A4BA8D",
"z+	c #A1BA88",
"A+	c #A7BF90",
"B+	c #A7C090",
"C+	c #A8C091",
"D+	c #9FC082",
"E+	c #9CC17C",
"F+	c #9CC37C",
"G+	c #9CC47B",
"H+	c #9CC47A",
"I+	c #96B777",
"J+	c #BBCBAC",
"K+	c #C8C7C9",
"L+	c #979797",
"M+	c #CED0CB",
"N+	c #A1B989",
"O+	c #A1BB87",
"P+	c #9FBE83",
"Q+	c #9CBF80",
"R+	c #9DC47C",
"S+	c #9DC57C",
"T+	c #9DC57B",
"U+	c #90B76D",
"V+	c #96B875",
"W+	c #BCCBAD",
"X+	c #C5C4C5",
"Y+	c #949494",
"Z+	c #9F9F9F",
"`+	c #CCCEC8",
" @	c #9DB884",
".@	c #9EB883",
"+@	c #9CBA7F",
"@@	c #9ABD7C",
"#@	c #9FC77E",
"$@	c #9EC67D",
"%@	c #9EC67C",
"&@	c #93BA70",
"*@	c #90B66B",
"=@	c #BDCDAE",
"-@	c #C3C2C3",
";@	c #919191",
">@	c #9E9E9E",
",@	c #C9CDC5",
"'@	c #9CB780",
")@	c #9AB97E",
"!@	c #99BB7B",
"~@	c #9ABF7A",
"{@	c #A0C87F",
"]@	c #9FC77D",
"^@	c #9AC378",
"/@	c #97BE74",
"(@	c #8FB76A",
"_@	c #BDCDAF",
":@	c #BEBDBF",
"<@	c #8D8D8D",
"[@	c #BABABA",
"}@	c #C9CCC5",
"|@	c #9CBC7E",
"1@	c #98BA78",
"2@	c #9CC37B",
"3@	c #A1C980",
"4@	c #A0C87E",
"5@	c #9BC479",
"6@	c #9AC177",
"7@	c #92BA6D",
"8@	c #BECEB0",
"9@	c #BBBBBC",
"0@	c #8B8B8B",
"a@	c #C8CBC5",
"b@	c #A2C385",
"c@	c #95B973",
"d@	c #99BF77",
"e@	c #9DC47B",
"f@	c #9FC87E",
"g@	c #A2CB80",
"h@	c #A3CC81",
"i@	c #A3CD82",
"j@	c #A3CC82",
"k@	c #A2CA81",
"l@	c #A0C97F",
"m@	c #A0C87D",
"n@	c #9DC67B",
"o@	c #9BC279",
"p@	c #95BD70",
"q@	c #BFCFB1",
"r@	c #B7B6B8",
"s@	c #888888",
"t@	c #ACACAC",
"u@	c #A8C98B",
"v@	c #95BE72",
"w@	c #98C076",
"x@	c #A5CA88",
"y@	c #A9CD8C",
"z@	c #A9CD8B",
"A@	c #A6CF86",
"B@	c #A5CF83",
"C@	c #A4CE82",
"D@	c #A2CC81",
"E@	c #A1CA7E",
"F@	c #9EC87C",
"G@	c #9BC579",
"H@	c #95C070",
"I@	c #C1D1B3",
"J@	c #B3B2B4",
"K@	c #878787",
"L@	c #B2B2B2",
"M@	c #BDBEBD",
"N@	c #C0CAB7",
"O@	c #B6C6A9",
"P@	c #B8C8AB",
"Q@	c #B9C9AC",
"R@	c #BACAAD",
"S@	c #BBCBAE",
"T@	c #BCCCAF",
"U@	c #BCCCB0",
"V@	c #BBCBAF",
"W@	c #BBCAAE",
"X@	c #BAC9AC",
"Y@	c #B9C8AC",
"Z@	c #C6C9C3",
"`@	c #838383",
" #	c #BEBEBE",
".#	c #B4B4B5",
"+#	c #B6B5B6",
"@#	c #B4B4B6",
"##	c #B5B4B5",
"$#	c #B4B3B5",
"%#	c #B5B5B6",
"&#	c #B5B4B6",
"*#	c #B5B5B7",
"=#	c #B3B3B4",
"-#	c #808080",
";#	c #B6B6B6",
">#	c #A6A6A6",
",#	c #A8A8A8",
"'#	c #9C9C9C",
")#	c #ADADAD",
"!#	c #B0B0B0",
"~#	c #9B9B9B",
"{#	c #7E7E7E",
"]#	c #E9E9E9",
"^#	c #E3E3E3",
"/#	c #DBDBDB",
"(#	c #E1E1E1",
"_#	c #DEDEDE",
":#	c #AFAFAF",
"<#	c #7F7F7F",
"[#	c #B9B9B9",
"}#	c #CDCDCD",
"|#	c #AAAAAA",
"1#	c #8A8A8A",
"2#	c #858585",
"3#	c #828282",
"4#	c #747474",
"5#	c #939393",
"6#	c #6A6A6A",
"7#	c #7D7D7D",
"8#	c #7C7C7C",
"9#	c #7B7B7B",
"0#	c #7A7A7A",
"a#	c #797979",
"b#	c #777777",
"c#	c #757575",
"d#	c #6E6E6E",
"e#	c #696969",
"f#	c #727272",
"g#	c #C6C6C6",
"            . + @ @ @ @ @ @ @ @ @ @ @ @ @ @ @ @ # .             ",
"          $ % & * = = = = = = = = = = = = = = = - ; +           ",
"          > + , ' ) ) ) ) ) ) ) ) ) ) ) ) ) ) ! , ~ {           ",
"          ] ^ / ( _ : : : : : : : : : < [ } | 1 2 3 4           ",
"          ] 5 6 7 8 9 9 9 9 9 9 9 0 0 a b c d e f g h 5         ",
"          i j k l m n o p q r s t u v w x y z A B C D #         ",
"          # E F G H I J K L M N O P Q R S T U V B W X Y         ",
"          i Z `  ...+.@.#.$.%.o p &.*.=.-.;.>.,.'.C ).!.        ",
"          ~.{.].^./.(._.:.<.[.}.|.1.2.3.4.5.6.7.8.9.0.a.        ",
"          0.E b.c.d.e.f.g.h.i.K |.j.k.l.m.n.o.p.8.q.0.r.        ",
"          D j s.t.u.v.w.x.y.z.A.B.C.D.E.F.G.H.I.J.K.X ~.        ",
"          h L.M.N.O.P.Q.R.S.<.T.U.V.W.X.Y.Z.`. +.+++h @+        ",
"          #+. $+N.%+&+(.*+S.=+-+;+>+,+'+)+!+~+{+]+^+/+]         ",
"          (+@ _+:+<+[+}+|+1+2+3+4+5+6+7+8+9+~+0+]+a+4 b+        ",
"          c+d+e+f+g+h+2.1+i+j+k+l+m+n+o+p+q+~+r+s+t+u+v+        ",
"          w+> x+y+z+A+B+C+D+E+F+G+H+m+m+7+8+~+I+J+K+L+v+        ",
"          w+; M+N+:+O+P+Q+E+R+S+S+T+H+m+m+8+U+V+W+X+Y+v+        ",
"          Z+] `+ @.@+@@@k+F+#@$@$@%@T+H+H+p+&@*@=@-@;@v+        ",
"          >@b+,@'@)@!@~@F+S+#@{@#@]@%@T+T+^@/@(@_@:@<@[@        ",
"          h a.}@|@1@~@2@S+$@{@3@{@4@]@]@%@5@6@7@8@9@0@!.        ",
"          D r.a@b@c@d@e@f@g@h@i@j@k@3@l@m@n@o@p@q@r@s@b+        ",
"          t@{ a@u@v@w@5@#@x@y@z@A@B@C@D@E@F@G@H@I@J@K@L@        ",
"          v+t@M@N@O@P@Q@R@S@T@U@U@U@T@V@W@X@P@Y@Z@t@`@L@        ",
"           #).L@.#+#@###$#$#.#%#&#.#$#$#.#v+.#*#=#X -#;#        ",
"          !.>#{ ,#'#;#X )#{ (+D t@D !#{ X L@)#~#{ c+{#b+        ",
"          v+>#!#'#~.]#d+c+D ~#^#/#h 0.).{ (#_#Z+:#L+<#;         ",
"          [#X 0.).>#> d+D #+>@}#@ |#).D ;#}#v+c+|#1#2##         ",
"          [@,#|#|#X >#,#X |#h #+).,#).).X ,#D ).>#3#0@E         ",
"          ] ,#X >#>#>#>#>#>#>#>#>#>#>#>#>#>#>#>#4 4#5#          ",
"          d+c+>#h h h h h h h h h h h h h h #+c+s@6#X           ",
"            |#2#3#-#<#{#7#7#8#9#0#a#a#b#b#c#4#d#e#f#g#          ",
"              v+c+4 4 4 4 4 4 4 '#'#'#'#'#'#'#~#h @+            "};
