/* XPM */
static char * drafts_close_hrm_xpm[] = {
"16 16 55 1",
" 	c None",
".	c #000000",
"+	c #E9DDDB",
"@	c #DBC9C5",
"#	c #AF948F",
"$	c #F6F0EE",
"%	c #B9968F",
"&	c #CAABA4",
"*	c #C8A5A0",
"=	c #BF9C95",
"-	c #7C5952",
";	c #ECDBD8",
">	c #F8F4F2",
",	c #EAD9D6",
"'	c #CF523E",
")	c #E9D7D3",
"!	c #E7D5D1",
"~	c #CEB3AE",
"{	c #F8F6F6",
"]	c #DFC4BD",
"^	c #DFC2BB",
"/	c #DDBDB9",
"(	c #DBBBB7",
"_	c #862F21",
":	c #D4AEA8",
"<	c #D4AFA6",
"[	c #A3756F",
"}	c #F3EAE9",
"|	c #AC8C3A",
"1	c #EACE79",
"2	c #D6B3AC",
"3	c #F4ECEA",
"4	c #D8A944",
"5	c #D2ABA4",
"6	c #D0A9A2",
"7	c #A2746A",
"8	c #F3EBE9",
"9	c #DBBAB3",
"0	c #B99569",
"a	c #CBB090",
"b	c #CEA7A0",
"c	c #CEA49C",
"d	c #9F6D67",
"e	c #F1E7E5",
"f	c #CBA099",
"g	c #CA9C96",
"h	c #9E6C64",
"i	c #F2E8E4",
"j	c #9E9182",
"k	c #C79993",
"l	c #ECDDDC",
"m	c #5B5956",
"n	c #D1B9B3",
"o	c #9E6E66",
"p	c #724C46",
"                ",
"                ",
"   ....         ",
"  .+@@#.        ",
" .$%&*=-....... ",
" .;>;;;,.''.)!~.",
" .{]^/(.__'.:<[.",
" .}]^/.|1_.2:<[.",
" .3/(.4|1.:<567.",
" .89.0a|.556bcd.",
" .e.000.6bbcfgh.",
" .i.j0.bcffgkkh.",
" .l.m.cfgkkkkkh.",
" .n..dohhhhhhhp.",
"  ............. ",
"                "};
