/* XPM */
static char * mail_attach_xpm[] = {
"23 18 249 2",
"  	c None",
". 	c #D98906",
"+ 	c #D28405",
"@ 	c #AF730D",
"# 	c #866E33",
"$ 	c #617369",
"% 	c #4C6B74",
"& 	c #576C66",
"* 	c #57665B",
"= 	c #7F6931",
"- 	c #CC8106",
"; 	c #DA8E10",
"> 	c #FFFFFD",
", 	c #F3F3F1",
"' 	c #C1C7CA",
") 	c #7599B4",
"! 	c #4891CB",
"~ 	c #488FC8",
"{ 	c #4D88B9",
"] 	c #7796B0",
"^ 	c #D9E1E7",
"/ 	c #C2D4E0",
"( 	c #7496AF",
"_ 	c #CDD5B1",
": 	c #3B3139",
"< 	c #894904",
"[ 	c #DC8F10",
"} 	c #FFFFD0",
"| 	c #FFFFFC",
"1 	c #FBFBF5",
"2 	c #F3F5EC",
"3 	c #D0D7DC",
"4 	c #91A7B9",
"5 	c #558BB1",
"6 	c #4092CD",
"7 	c #4A95C9",
"8 	c #5B8EA4",
"9 	c #52859C",
"0 	c #4086B5",
"a 	c #7199A4",
"b 	c #F1F3C4",
"c 	c #F6F7C6",
"d 	c #9DB5A9",
"e 	c #6A4E35",
"f 	c #CFB035",
"g 	c #DC9116",
"h 	c #F8F2A5",
"i 	c #E7EBDF",
"j 	c #A3BBCC",
"k 	c #6594B7",
"l 	c #3985C6",
"m 	c #4799DB",
"n 	c #5497C8",
"o 	c #5C90AF",
"p 	c #518BAC",
"q 	c #498DBA",
"r 	c #71ABC7",
"s 	c #B4C9B7",
"t 	c #F1F3C3",
"u 	c #FFFFCB",
"v 	c #FCFCC8",
"w 	c #655342",
"x 	c #828347",
"y 	c #B98803",
"z 	c #8D4B02",
"A 	c #DC9114",
"B 	c #E3D471",
"C 	c #96B08C",
"D 	c #388ACA",
"E 	c #5BA4DE",
"F 	c #70A6D3",
"G 	c #6290AF",
"H 	c #4C8EBC",
"I 	c #4A93C7",
"J 	c #74B3D1",
"K 	c #BAD1BF",
"L 	c #EDEFC0",
"M 	c #FDFDC9",
"N 	c #8C542A",
"O 	c #516852",
"P 	c #89792D",
"Q 	c #F1C80B",
"R 	c #D98E0E",
"S 	c #FEFDF2",
"T 	c #ECF0EB",
"U 	c #6F9EA9",
"V 	c #6D9D98",
"W 	c #C6CC92",
"X 	c #7BA5B8",
"Y 	c #4896D1",
"Z 	c #7DAEC9",
"` 	c #BDD5C4",
" .	c #E6EAB3",
"..	c #F4F4C2",
"+.	c #795036",
"@.	c #426C77",
"#.	c #6C8057",
"$.	c #CDBB3B",
"%.	c #DDBC1D",
"&.	c #723C01",
"*.	c #DA8F11",
"=.	c #FEF9E4",
"-.	c #E6E7CE",
";.	c #7195A6",
">.	c #ACBEB4",
",.	c #F1DC5F",
"'.	c #61938A",
").	c #839B7F",
"!.	c #EFF2E0",
"~.	c #FCFCC9",
"{.	c #FFFFBD",
"].	c #DDDFB5",
"^.	c #535D6B",
"/.	c #2E7BB5",
"(.	c #607354",
"_.	c #7A7B3E",
":.	c #BCAA3B",
"<.	c #C5AC28",
"[.	c #6C3901",
"}.	c #DB9013",
"|.	c #FFFDF1",
"1.	c #EAE8C9",
"2.	c #869B94",
"3.	c #B1C0BA",
"4.	c #FAF7CC",
"5.	c #7D986D",
"6.	c #898627",
"7.	c #F3E152",
"8.	c #F3EBAD",
"9.	c #FEFECA",
"0.	c #E6EBC0",
"a.	c #A3BCB1",
"b.	c #3A6793",
"c.	c #376D8C",
"d.	c #617453",
"e.	c #3D6A78",
"f.	c #597A71",
"g.	c #ABA043",
"h.	c #DA8F0F",
"i.	c #FFFDED",
"j.	c #F6F2C9",
"k.	c #A5B9A5",
"l.	c #A0B4B2",
"m.	c #EEE074",
"n.	c #ACAD55",
"o.	c #749990",
"p.	c #E8CD33",
"q.	c #DFC435",
"r.	c #858B50",
"s.	c #6BA1BB",
"t.	c #3571A0",
"u.	c #446568",
"v.	c #46635F",
"w.	c #3C758B",
"x.	c #769575",
"y.	c #C7BE56",
"z.	c #D8CC59",
"A.	c #E3C72C",
"B.	c #7F4201",
"C.	c #D98D0B",
"D.	c #FDFBED",
"E.	c #FEFBD4",
"F.	c #C3D5D6",
"G.	c #8C9F7D",
"H.	c #D8C032",
"I.	c #E6E3B2",
"J.	c #78A2AF",
"K.	c #97AD92",
"L.	c #7DA38D",
"M.	c #3F8CB7",
"N.	c #619494",
"O.	c #849A6B",
"P.	c #55909C",
"Q.	c #548C9D",
"R.	c #9A8832",
"S.	c #F1D93E",
"T.	c #FFF266",
"U.	c #FFEB60",
"V.	c #FFDF2D",
"W.	c #D98C08",
"X.	c #FFFFF9",
"Y.	c #FFFFF4",
"Z.	c #DADB92",
"`.	c #79864C",
" +	c #CBCFA1",
".+	c #FBFBC9",
"++	c #BDD2AA",
"@+	c #579EC7",
"#+	c #4B97C6",
"$+	c #87AB9A",
"%+	c #7D9880",
"&+	c #4690B8",
"*+	c #6EA1A2",
"=+	c #CFDA7E",
"-+	c #EEDB5A",
";+	c #D29B09",
">+	c #F8DF40",
",+	c #DA8C0A",
"'+	c #FCF48C",
")+	c #E3C724",
"!+	c #A1BCB4",
"~+	c #8DA38E",
"{+	c #F3F4A8",
"]+	c #F8F8A0",
"^+	c #D1DB9A",
"/+	c #A6B682",
"(+	c #588F9D",
"_+	c #3F98D6",
":+	c #97B28B",
"<+	c #ECE87C",
"[+	c #FDF472",
"}+	c #FFF56A",
"|+	c #F7E86B",
"1+	c #D29708",
"2+	c #F8DB36",
"3+	c #DA8C09",
"4+	c #FFFFFA",
"5+	c #E3C518",
"6+	c #FFFED2",
"7+	c #E1E6AF",
"8+	c #6A9CA8",
"9+	c #AAB98F",
"0+	c #DFE296",
"a+	c #A5BE9A",
"b+	c #3D8EBF",
"c+	c #4899CC",
"d+	c #C3C775",
"e+	c #FFF77E",
"f+	c #FFF673",
"g+	c #C98F07",
"h+	c #DE8E06",
"i+	c #FFFED9",
"j+	c #FFFFB9",
"k+	c #FFF672",
"l+	c #FFF571",
"m+	c #BACA80",
"n+	c #6194A0",
"o+	c #6A9EA4",
"p+	c #3D8AB4",
"q+	c #6CA19E",
"r+	c #CEC84F",
"s+	c #FFEA47",
"t+	c #FFE43A",
"u+	c #8A4902",
"v+	c #6D5A3E",
"w+	c #506977",
"x+	c #58564C",
"y+	c #7E4A0E",
"z+	c #8B4A02",
"                                              ",
"                                              ",
"  . . . . . . . . . . + @ # $ % & * = - . .   ",
"  ; > > > > > > > , ' ) ! ~ { ] ^ / ( _ : <   ",
"  [ } > | 1 2 3 4 5 6 7 8 9 0 a b c d e f <   ",
"  g } h i j k l m n o p q r s t u v w x y z   ",
"  A > B C D E F G H I J K L u u M N O P Q z   ",
"  R S T U V W X Y Z `  .u u u ..+.@.#.$.%.&.  ",
"  *.=.-.;.>.,.'.).!.~.{.u u ].^./.(._.:.<.[.  ",
"  }.|.1.2.3.4.5.6.7.8.9.0.a.b.c.d.e.f.g.<.&.  ",
"  h.i.j.k.l.m.n.o.p.q.r.s.t.u.v.w.x.y.z.A.B.  ",
"  C.D.E.F.G.H.I.J.K.L.M.N.O.P.Q.R.S.T.U.V.z   ",
"  W.X.Y.Z.`. +.+++@+#+$+%+&+*+=+-+;+>+T.V.z   ",
"  ,+X.'+)+!+~+{+]+^+/+(+_+:+<+[+}+|+1+2+V.z   ",
"  3+4+5+6+7+8+9+0+a+b+c+d+e+f+}+T.T.U.g+V.z   ",
"  h+i+j+k+l+m+n+o+p+q+r+s+s+t+t+t+V.V.s+1+z   ",
"  z z < z z u+v+w+x+y+z+z z z z z z z z < <   ",
"                                              "};
