/* XPM */
static char * mail_send_xpm[] = {
"52 33 30 1",
" 	c None",
".	c #C3CCD6",
"+	c #81919F",
"@	c #4F5F6D",
"#	c #1C212C",
"$	c #D4DCE4",
"%	c #8B9AA6",
"&	c #2A313B",
"*	c #728491",
"=	c #C1C2C4",
"-	c #FEFEFE",
";	c #A3B0BE",
">	c #384759",
",	c #CCD4DD",
"'	c #ECF4FD",
")	c #97A5B0",
"!	c #B2BDC8",
"~	c #E6EDF4",
"{	c #E6E8EB",
"]	c #DCE3EB",
"^	c #647883",
"/	c #BCC7D1",
"(	c #B7C2CD",
"_	c #85B265",
":	c #68963E",
"<	c #517B36",
"[	c #EEF9E3",
"}	c #CEEFBC",
"|	c #A7CE88",
"1	c #366423",
"                                                    ",
"                                                    ",
"                                                    ",
"                                                    ",
"                      .+@##@$                       ",
"                    %@&*=-;@>,                      ",
"                 .@&*,--''.)+&!                     ",
"               .@&;~---~~~{+$%#!                    ",
"             ;>&;---~~~~~{{%;{%#!                   ",
"           $@#+{-'~~~~{{{]]!*$$%&;                  ",
"          +#@$-~~~~~{{]]$$$,@+$,)&;                 ",
"         >#;-~~~~{{{]]$$$,,)@>@*;+&;                ",
"         #.]{~~{{]]$$$,,,,*@**;%^^@#!               ",
"        $#%));!/,$$$,,,.;^^**))%++^&^               ",
"         &>]!+***+%;(.!*@***+)%+**+#+               ",
"         !#*]](%***@@@@^***+)__:::<<;               ",
"          *#!$$,/)*^&^*+*%))___::<<<<%              ",
"          ,@&,$,./!;@%;!(!;___[-[}|_1<%             ",
"           .>>$,./!;^;,/(;%___------[_^%            ",
"            (#@,./!;^+.(!)___:___[---_<+;           ",
"             )#+./!;*+/!;%___:::}----_1+%           ",
"              *#+/!;+^(;)+___:_----[-_1*+           ",
"               @#)!;+@;;)*__:|----}_-_1^+           ",
"                @#%;+@;)%^:::[---}<|-_1++           ",
"                 @#%+>)%@&@::_--|11}-:1++           ",
"                  @#@>*&#@+::<__111--<^%%           ",
"                   @###&% %+<<<111111<++            ",
"                          ;%+:1<1111<+%%            ",
"                           ;++*<<<<^++%             ",
"                             %+%+++%+)              ",
"                               ))%))                ",
"                                                    ",
"                                                    "};
