/* XPM */
static char * mail_attach_xpm[] = {
"28 28 23 1",
" 	c None",
".	c #99B0D0",
"+	c #7095DE",
"@	c #3D79F1",
"#	c #83909C",
"$	c #71859A",
"%	c #657683",
"&	c #DAE3EB",
"*	c #F3F7FB",
"=	c #FFFFFF",
"-	c #8B9AA7",
";	c #6487B3",
">	c #4D5A68",
",	c #E4EDF5",
"'	c #98A7B4",
")	c #C9D2DA",
"!	c #2D50A2",
"~	c #D0D9E4",
"{	c #A3B1BC",
"]	c #AEBBC6",
"^	c #5E69C3",
"/	c #C0C0C0",
"(	c #B9C3CE",
"                            ",
"                            ",
"        .+@@++    #$$$      ",
"       +@@@@@@+  %&**=-#    ",
"      ;@@@==@@@;%*->>%,''   ",
"     +@@@@==@@@@)-$'#%%=%   ",
"     ;@@@@==@@@@;#   #>)$   ",
"     @@========@@    ->)%   ",
"     !!========!!-#  #>*>   ",
"     ;!!!!==!!!!;&-  >~{>   ",
"     -!!!!==!!!!-%,>>~]>'   ",
"      ;!!!==!!!;#>&>)]>#    ",
"       ^!!!!!!^/%-~(.>#     ",
"      {%$!!!!$/%$)).>#      ",
"     {%##$>#  %#((.>#       ",
"     %##%>-  %$]]'>$        ",
"    '-#$>-  ->-]'>#         ",
"    >$$>'   #>'->$          ",
"   {%#%    {>-->#           ",
"   {%##   {>-->$            ",
"   '%$-  {>-#>#             ",
"   {%'%{'>-->$              ",
"    >#'$%'#>$               ",
"    {>>-#>>#                ",
"     '$%%$#                 ",
"       '''                  ",
"                            ",
"                            "};
