/* XPM */
static char * offline_xpm[] = {
"26 11 7 1",
" 	c None",
".	c #4D4D4D",
"+	c #FFFFFF",
"@	c #E6E6E6",
"#	c #666666",
"$	c #CCCCCC",
"%	c #999999",
"       .....              ",
"      .+@#@#    ....      ",
"      .@$.%#     .+$.     ",
"     ..$$.@#    .#@$..    ",
".....@.$$.%#     #$$.@....",
"$$$$.$.$$.@#    .#$$.$.%%%",
".....%.$$.%#     #$$.%....",
"     ..$$.@#    .#$$..    ",
"      .$$..#     .%%.     ",
"      .%%.%.    ....      ",
"       .....              "};
