/* XPM */
static char *ignorethread[]={
"13 10 7 1",
". c None",
"a c #002149",
"e c #00306a",
"d c #859cab",
"b c #b3d3e7",
"# c #ff0000",
"c c #ffffff",
"..........#..",
"....aaaaa##..",
"..aabbbb##a..",
".acbbde##bca.",
"accbde##dbcca",
"accbd##edbcca",
".acb##edbbca.",
"..a##bbbbaa..",
"..##aaaaa....",
"..#.........."};
