/* XPM */
static char * mime_text_enriched_xpm[] = {
"14 18 85 1",
" 	c None",
".	c #7A8491",
"+	c #030E1F",
"@	c #EBEBEB",
"#	c #95A2AE",
"$	c #ACB3B5",
"%	c #ADB4B7",
"&	c #AEB6B8",
"*	c #AFB7BA",
"=	c #B1B8BB",
"-	c #B2B9BC",
";	c #B3BABE",
">	c #B4BBC0",
",	c #B6BDC1",
"'	c #B6BEC2",
")	c #AEB5B7",
"!	c #76838F",
"~	c #B8C0C5",
"{	c #B0B7B9",
"]	c #B2B9BD",
"^	c #B4BCC0",
"/	c #B5BDC1",
"(	c #B7BEC2",
"_	c #B7BFC5",
":	c #B9C0C6",
"<	c #BAC2C8",
"[	c #B1B9BC",
"}	c #BCC4CA",
"|	c #B3BBBE",
"1	c #B5BCC0",
"2	c #B5BDC2",
"3	c #B7BEC3",
"4	c #B8C0C4",
"5	c #B9C1C6",
"6	c #BAC2C7",
"7	c #BBC3C9",
"8	c #BDC5CA",
"9	c #BEC6CC",
"0	c #B5BCC1",
"a	c #D54141",
"b	c #C0C8CF",
"c	c #B7BFC4",
"d	c #B9C1C7",
"e	c #BAC3C7",
"f	c #BBC4CA",
"g	c #BDC4CB",
"h	c #BFC7CE",
"i	c #C0C8D0",
"j	c #C1C9D1",
"k	c #C3CBD3",
"l	c #BBC2C8",
"m	c #BDC5CB",
"n	c #BFC6CC",
"o	c #C2C9D1",
"p	c #C3CBD2",
"q	c #C4CCD5",
"r	c #C5CED6",
"s	c #BCC5CA",
"t	c #C7CFD9",
"u	c #BEC6CD",
"v	c #C1CAD1",
"w	c #C4CDD4",
"x	c #C5CDD6",
"y	c #C7CED7",
"z	c #C7D0D9",
"A	c #C9D2DB",
"B	c #C0C9CF",
"C	c #CAD3DD",
"D	c #C2CAD1",
"E	c #C3CCD3",
"F	c #C5CDD5",
"G	c #C7CFD7",
"H	c #C8D1D9",
"I	c #C8D2DB",
"J	c #CAD3DC",
"K	c #CCD4DE",
"L	c #CCD5DF",
"M	c #C4CCD4",
"N	c #C5CED5",
"O	c #C6CED7",
"P	c #C9D1DA",
"Q	c #C9D2DC",
"R	c #CBD3DD",
"S	c #CDD6E0",
"T	c #CFD7E1",
".............+",
".@@@@@@@@@@@#+",
".@$%&*=-;>,'#+",
".@)!!!!!!!!~#+",
".@{=];^/(_:<#+",
".@[!!!!!!!!}#+",
".@|123456789#+",
".@0aaaaaaaab#+",
".@c~defg9hij#+",
".@:aaaaaaaak#+",
".@l}mnhbopqr#+",
".@s!!!!!!!!t#+",
".@ubivkwxyzA#+",
".@B!!!!!!!!C#+",
".@DEFrGHIJKL#+",
".@MNOtPQRLST#+",
".############+",
".+++++++++++++"};
