/* XPM */ 
static char * draft_close_xpm[] = {
"16 16 119 2",
"  	c None",
"! 	c black",
"# 	c #0A82F6",
"$ 	c #007FFF",
"% 	c #E6BC00",
"& 	c #4993AF",
"' 	c #248FF7",
"( 	c #BBDDFF",
") 	c #C1E0FF",
"* 	c #B6DAFF",
"+ 	c #A8D4FF",
", 	c #7BBDFF",
"- 	c #E6BB01",
". 	c #F4E089",
"/ 	c #F4EDC4",
"0 	c #0380FE",
"1 	c #9BCDFF",
"2 	c #FDFEFF",
"3 	c #F5FAFF",
"4 	c #E7F3FF",
"5 	c #D4EAFF",
"6 	c #9CCDFF",
"7 	c #FBF1C4",
"8 	c #D8EAF7",
"9 	c #BFDFFF",
": 	c #F2F9FF",
"; 	c #EEF7FF",
"< 	c #E3F1FF",
"= 	c #D1E8FF",
"> 	c #99CCFF",
"? 	c #BDB12D",
"@ 	c #FBF0C2",
"A 	c #D2E7F5",
"B 	c #B7DBFF",
"C 	c #E5F2FF",
"D 	c #E2F1FF",
"E 	c #D8EBFF",
"F 	c #CDDDD5",
"G 	c #A3C6CC",
"H 	c #2E8BCC",
"I 	c #D3CD7C",
"J 	c #F1D143",
"K 	c #FBEFBE",
"L 	c #D2E5ED",
"M 	c #B6D0CC",
"N 	c #D7E0CC",
"O 	c #D5DFCC",
"P 	c #DFC63D",
"Q 	c #F2D866",
"R 	c #DAC649",
"S 	c #C2C266",
"T 	c #94AA66",
"U 	c #E8CE45",
"V 	c #F8D02C",
"W 	c #EBBF00",
"X 	c #E8C00D",
"Y 	c #E7C72F",
"Z 	c #C8C466",
"[ 	c #D5CA66",
"\ 	c #D4CA66",
"] 	c #D1C966",
"^ 	c #C5C679",
"_ 	c #A4B87F",
"` 	c #80A67F",
"a 	c #F8D74C",
"b 	c #FDD532",
"c 	c #EABE00",
"d 	c #E8BD00",
"e 	c #E8D053",
"f 	c #A8BA7F",
"g 	c #B3BF7F",
"h 	c #B2BF7F",
"i 	c #ADBD7F",
"j 	c #A3B87F",
"k 	c #87A97E",
"l 	c #A2B472",
"m 	c #FFD943",
"n 	c #FDD32D",
"o 	c #E7BC00",
"p 	c #E5BB00",
"q 	c #E7BD04",
"r 	c #E9D464",
"s 	c #95AF77",
"t 	c #F0D44C",
"u 	c #FFD83B",
"v 	c #F9CF20",
"w 	c #EBC311",
"x 	c #FBDC5A",
"y 	c #E6D261",
"z 	c #E6D260",
"{ 	c #E6D25E",
"| 	c #E6D15A",
"} 	c #ECD354",
"~ 	c #FFDA45",
" !	c #FFD83C",
"!!	c #FFD631",
"#!	c #F4C812",
"$!	c #F1C81D",
"%!	c #FFDC4F",
"&!	c #FFDC50",
"'!	c #FFDB4E",
"(!	c #FFDB4C",
")!	c #FFDA47",
"*!	c #FFD941",
"+!	c #FFD73A",
",!	c #FFD324",
"-!	c #EEC206",
".!	c #EEC40D",
"/!	c #F8D02B",
"0!	c #F8D029",
"1!	c #F8CF26",
"2!	c #F8CE22",
"3!	c #F8CD1C",
"4!	c #F8CC16",
"5!	c #F7C90C",
"6!	c #E7BD00",
"7!	c #E5BC00",
"8!	c #E5BD00",
"9!	c #E4BD00",
"                                "
"        # $ $ $ $ $ $           "
"  % % & ' ( ) * + , $           "
"- . / 0 1 2 3 4 5 6 $           "
"% 7 8 $ 9 : ; < = > $ ? %       "
"% @ A $ B C D E F G H I J %     "
"% K L H M N O P % % % % % % %   "
"% Q % % % % % % R S T U V W %   "
"% X Y T Z [ \ ] ^ _ ` a b c d   "
"% % e ` f g h i j k l m n o p   "
"% q r ` ` ` ` ` ` s t u v % d   "
"% w x y y z { | } ~  !!!#!%     "
"% $!%!&!&!'!(!)!*!+!!!,!-!%     "
"% .!/!V V /!0!1!2!3!4!5!6!o     "
"7!% % % % % % % % % % % % %     "
"  % 8!% % % % % % % % 9!        "};