/* XPM */
static char * error_xpm[] = {
"28 28 9 1",
" 	c None",
".	c #D04F52",
"+	c #C72C2F",
"@	c #D99988",
"#	c #F8BFAD",
"$	c #EED5D3",
"%	c #ECECEC",
"&	c #892422",
"*	c #E9D0C8",
"                            ",
"                            ",
"                            ",
"                            ",
"                            ",
"                            ",
"                            ",
"                            ",
"                            ",
"              ...           ",
"            .......         ",
"           .........        ",
"          ..+....@#..       ",
"         .+@$@@.@%#.+.      ",
"         .+.$%%@%$.+++      ",
"         .+++@%%%%%@++      ",
"         .+&.%%..@*#&+      ",
"         .&+%%@&&&@*&.      ",
"         .&&..&&&&&.&       ",
"          .&&&&&&&&&+       ",
"           .&&&&&&&&        ",
"            .+&&&+          ",
"                            ",
"                            ",
"                            ",
"                            ",
"                            ",
"                            "};
