/* XPM */
static char * mime_gpg_passed_xpm[] = {
"14 18 96 2",
"  	c None",
". 	c #8E8E8E",
"+ 	c #FDFDFB",
"@ 	c #FDFCF9",
"# 	c #FDFAF8",
"$ 	c #FCF9F6",
"% 	c #FCF8F4",
"& 	c #FBF7F2",
"* 	c #FAF6F1",
"= 	c #F9F5EF",
"- 	c #F9F4EE",
"; 	c #F8F3EB",
"> 	c #F8F2EA",
", 	c #F6F1E8",
"' 	c #FDFBF9",
") 	c #FDFAF7",
"! 	c #FCF9F5",
"~ 	c #FBF8F4",
"{ 	c #FAF7F2",
"] 	c #FAF5F0",
"^ 	c #FAF5EE",
"/ 	c #F9F4EC",
"( 	c #F8F2EB",
"_ 	c #F7F1E9",
": 	c #F7F0E7",
"< 	c #F6F0E6",
"[ 	c #FCF9F7",
"} 	c #FBF7F3",
"| 	c #FAF6F0",
"1 	c #F9F3EC",
"2 	c #00FF00",
"3 	c #F7F2E9",
"4 	c #F6EFE6",
"5 	c #F5EEE3",
"6 	c #FCF8F5",
"7 	c #FBF8F3",
"8 	c #F9F4ED",
"9 	c #F8F3EC",
"0 	c #07461F",
"a 	c #F5EFE5",
"b 	c #F5EDE3",
"c 	c #F5EDE2",
"d 	c #F7F3EB",
"e 	c #F5EEE5",
"f 	c #F4ECE1",
"g 	c #F4ECDF",
"h 	c #F6EEE4",
"i 	c #FBB881",
"j 	c #6D3910",
"k 	c #F6EFE5",
"l 	c #F5EDE4",
"m 	c #F4EBE0",
"n 	c #C97734",
"o 	c #F8F1EA",
"p 	c #F7F0E8",
"q 	c #F4EDE2",
"r 	c #F3EBDF",
"s 	c #F1E7D8",
"t 	c #F5EEE4",
"u 	c #F3EADE",
"v 	c #F1E6D8",
"w 	c #EFE5D4",
"x 	c #F6EEE5",
"y 	c #F4ECE2",
"z 	c #F4ECE0",
"A 	c #F3EBDE",
"B 	c #EFE4D4",
"C 	c #EEE3D2",
"D 	c #F0E6D7",
"E 	c #F0E4D3",
"F 	c #EFE3D1",
"G 	c #EEE2CF",
"H 	c #F3E9DE",
"I 	c #F0E6D6",
"J 	c #EFE3D2",
"K 	c #EEE2D1",
"L 	c #EEE1CF",
"M 	c #EDE0CD",
"N 	c #F2E9DD",
"O 	c #F0E5D6",
"P 	c #ECDFCC",
"Q 	c #F2E9DC",
"R 	c #F1E8DA",
"S 	c #EFE4D3",
"T 	c #EFE2D2",
"U 	c #EEE1D0",
"V 	c #EDE1CF",
"W 	c #EDE0CC",
"X 	c #ECDFCB",
"Y 	c #ECDDCA",
"Z 	c #F1E7DA",
"` 	c #F0E5D5",
" .	c #EDE1CE",
"..	c #ECDECB",
"+.	c #ECDDC9",
"@.	c #EBDCC7",
". . . . . . . . . . . . . . ",
". + @ # $ % & * = - ; > , . ",
". ' ) ! ~ { ] ^ / ( _ : < . ",
". [ ! } * | - 1 2 3 : 4 5 . ",
". 6 7 * ] 8 9 2 0 < a b c . ",
". { 2 ^ 8 d 2 0 4 e 5 f g . ",
". | 0 2 > 2 0 4 h c f i j . ",
". - 9 0 2 0 k l c m i n j . ",
". 9 > , 0 k b f m i n j j . ",
". o p 4 e q f r i n j s j . ",
". : k t c m u i n j v j w . ",
". x b y z A i n j v j B C . ",
". 5 f r u i n j D j E F G . ",
". z r H i n j I j J K L M . ",
". A N j n j O B C K L M P . ",
". Q R n j O S T U V W X Y . ",
". Z j I ` S K L  .P ..+.@.. ",
". . . . . . . . . . . . . . "};
