/* XPM */
static char * mail_send_queue_xpm[] = {
"24 24 130 2",
"  	c None",
". 	c #000000",
"+ 	c #F6CBC3",
"@ 	c #F8D4CD",
"# 	c #F0A293",
"$ 	c #BA3319",
"% 	c #ED9280",
"& 	c #C1351A",
"* 	c #BC3419",
"= 	c #F8D6CF",
"- 	c #B33118",
"; 	c #F7CEC6",
"> 	c #F0A597",
", 	c #A92F16",
"' 	c #DD3D1E",
") 	c #E86F57",
"! 	c #EC8A77",
"~ 	c #EF9C8C",
"{ 	c #CF391C",
"] 	c #A12D16",
"^ 	c #852512",
"/ 	c #F3B3A6",
"( 	c #BCBCBC",
"_ 	c #F3F3F3",
": 	c #BDBDBD",
"< 	c #A6A6A6",
"[ 	c #F3B8AC",
"} 	c #939393",
"| 	c #A0A0A0",
"1 	c #3D3D3D",
"2 	c #EEEEEE",
"3 	c #4E4E4E",
"4 	c #E6E6E6",
"5 	c #E9E9E9",
"6 	c #F5C2B8",
"7 	c #9C9C9C",
"8 	c #D4D4D4",
"9 	c #494949",
"0 	c #A3A3A3",
"a 	c #FFFFFF",
"b 	c #E4E4E4",
"c 	c #434343",
"d 	c #F5F5F5",
"e 	c #F5C4BA",
"f 	c #525252",
"g 	c #141414",
"h 	c #111111",
"i 	c #383838",
"j 	c #C8C8C8",
"k 	c #4F4F4F",
"l 	c #E66349",
"m 	c #E66147",
"n 	c #BA8D31",
"o 	c #EAB23D",
"p 	c #403011",
"q 	c #E5E5E5",
"r 	c #B4B4B4",
"s 	c #FBFBFB",
"t 	c #EFB63E",
"u 	c #F6D591",
"v 	c #F3B840",
"w 	c #916D26",
"x 	c #F8F8F8",
"y 	c #E7E7E7",
"z 	c #D6D6D6",
"A 	c #2B2B2B",
"B 	c #EEB53E",
"C 	c #FAE7BC",
"D 	c #FCD584",
"E 	c #FEC142",
"F 	c #FFC243",
"G 	c #CECECE",
"H 	c #0B0B0B",
"I 	c #B9B9B9",
"J 	c #F2F2F2",
"K 	c #636363",
"L 	c #3E3E3E",
"M 	c #B88B30",
"N 	c #F9E2B2",
"O 	c #FDD789",
"P 	c #D0D0D0",
"Q 	c #373737",
"R 	c #898989",
"S 	c #F1F1F1",
"T 	c #ABABAB",
"U 	c #33332D",
"V 	c #E7AF3C",
"W 	c #F9DDA4",
"X 	c #FECA5E",
"Y 	c #D09E36",
"Z 	c #8B8B8B",
"` 	c #FEFEFE",
" .	c #F6F6F6",
"..	c #DADADA",
"+.	c #131313",
"@.	c #C6C6C6",
"#.	c #3A2B0F",
"$.	c #8F6C25",
"%.	c #FDC042",
"&.	c #2D220C",
"*.	c #6F6F6F",
"=.	c #8F8F8F",
"-.	c #353535",
";.	c #737373",
">.	c #DFDFDF",
",.	c #F0F0F0",
"'.	c #FCFCFC",
").	c #363636",
"!.	c #AAAAAA",
"~.	c #FDFDFD",
"{.	c #7C7C7C",
"].	c #A9A9A9",
"^.	c #E1E1E1",
"/.	c #4A4A4A",
"(.	c #FAFAFA",
"_.	c #C4C4C4",
":.	c #A1A1A1",
"<.	c #CCCCCC",
"[.	c #F4F4F4",
"}.	c #F7F7F7",
"|.	c #BABABA",
"1.	c #BFBFBF",
"2.	c #C9C9C9",
"3.	c #767676",
"4.	c #CBCBCB",
"5.	c #ACACAC",
"6.	c #B3B3B3",
"7.	c #444444",
"8.	c #A7A7A7",
"9.	c #989898",
"                      .                         ",
"                    . + .                       ",
"                  . @ # $ .                     ",
"                . @ % # & * .                   ",
"              . = % % # & & - .                 ",
"            . ; % % % > & & & , .               ",
"          . ; ' ) ! % ~ & { ] ^ ^ .             ",
"      . . . . . / % % > & & ] . . . . .         ",
"    . ( _ : < . [ % % # & & ] . } | < 1 .       ",
"    . 2 3 4 5 . 6 % % # & & ] . 7 8 9 0 .       ",
"    . a b c d . e % % # & . f g . h i j .       ",
"    . a d b k . % l l m . . n o p q r . .       ",
"    . a s d b . . . . . . t u v w x _ y .       ",
"    . a d d d z A 7 7 . B C D E F a G H I .     ",
"    . a s d d J K L . M N O F F F P Q R S T U   ",
"    . a d d d K I I . V W X F F Y Q Z `  ...+.  ",
"    . a s d K @.d b . #.$.%.F F &.*.a ` =.-..   ",
"    . a d ;.8 d d d . >.,.'.a a P ).!.~.,.j +.  ",
"    . a {.8 b b b b . ].^. .` ` a P /.(._.:.    ",
"    . ;.( ( ( ( ( ( ( . <.z [.(.'.s }.<.|..     ",
"      . . . . . . . . . . 1.|.2.3.4.5.6..       ",
"                        . . | 5.7.8.9..         ",
"                            . . . . .           ",
"                                                "};
