/* XPM */
static char * outbox_open_xpm[] = {
"16 16 68 1",
" 	c None",
".	c #000000",
"+	c #A59E92",
"@	c #DDDBD6",
"#	c #F6F6F5",
"$	c #AAA499",
"%	c #E3E1DE",
"&	c #847C6D",
"*	c #2B2924",
"=	c #AEA89D",
"-	c #F4F3F2",
";	c #393630",
">	c #B7B2A8",
",	c #CECAC3",
"'	c #0D0C0A",
")	c #292722",
"!	c #716B5E",
"~	c #D9D7D2",
"{	c #FAFAF9",
"]	c #C8C4BD",
"^	c #0A0A09",
"/	c #181613",
"(	c #464139",
"_	c #787163",
":	c #908879",
"<	c #E1DEDA",
"[	c #FFFFFF",
"}	c #E5E3E0",
"|	c #48433B",
"1	c #635D52",
"2	c #877F70",
"3	c #948C7D",
"4	c #9C9587",
"5	c #9E988B",
"6	c #282621",
"7	c #7A7365",
"8	c #8F8778",
"9	c #9D9688",
"0	c #A09A8D",
"a	c #A19B8E",
"b	c #A49D91",
"c	c #F6F5F4",
"d	c #8A847A",
"e	c #A8A195",
"f	c #F2F1EF",
"g	c #716C63",
"h	c #88837B",
"i	c #AFA99E",
"j	c #B1ACA1",
"k	c #C4C0B9",
"l	c #686868",
"m	c #EFEFEF",
"n	c #D1940C",
"o	c #CCCCCC",
"p	c #68645C",
"q	c #8A857C",
"r	c #BAB6AC",
"s	c #D3D1CC",
"t	c #888581",
"u	c #575248",
"v	c #645F56",
"w	c #B8B5AE",
"x	c #93908B",
"y	c #58554E",
"z	c #75726B",
"A	c #5E5A54",
"B	c #181818",
"C	c #090909",
"       ..       ",
"     .+@#.      ",
"   .$%&*=-.     ",
" ;>%,'')!~-.    ",
".{].^/(_&:<-.   ",
".[}(|1_2345<-.  ",
".[[}617890ab~c. ",
".........d+e$<f.",
".[[[[[[[.ghijk~l",
".[mnmmmo.pqrstu.",
".[nnnmno.vwxy.. ",
".[mnnnno.zA..   ",
".[mmnnno...     ",
".[mnnnno.       ",
".[ooooooB       ",
"..C......       "};
