/* XPM */
static char * outbox_close_xpm[] = {
"16 12 27 1",
" 	c None",
".	c #5F6975",
"+	c #0F3300",
"@	c #6AB316",
"#	c #EBEBEB",
"$	c #00081C",
"%	c #4D5A68",
"&	c #4B5055",
"*	c #31375E",
"=	c #303338",
"-	c #7ED849",
";	c #B7BEC6",
">	c #B9C3CE",
",	c #C6CAD6",
"'	c #C9D2DA",
")	c #D0D9E4",
"!	c #161B25",
"~	c #A3D1A0",
"{	c #1B2228",
"]	c #606019",
"^	c #DAE3EB",
"/	c #95A2AE",
"(	c #FFFFFF",
"_	c #8B9AA7",
":	c #83909C",
"<	c #98A7B4",
"[	c #7D8997",
"   .+...        ",
"  .+@+##$.%&*== ",
"  +--@+;>>,''))!",
" +~~-@@+.%&*={{$",
"]]]~-@+++#####^$",
"  ]~-@+#''')^^/$",
"  ](~-+,'')^^^_$",
"  ]]]]+'')^^^#_$",
"  .#>,'')^^^##:$",
"  .#,'')^^^###:$",
"  .#<<//___:::[$",
"   $$$$$$$$$$$$ "};
