/* XPM */
/* Brand Huntsman */
static char * inbox_close[] = {
"16 16 2 1",
"  c None",
"# c #000000",
"                ",
"                ",
"                ",
"                ",
"    ##    ##    ",
"     ##  ##     ",
"      ####      ",
"       ##       ",
"                ",
"##            ##",
"##            ##",
"##            ##",
"################",
"################",
"                ",
"                "};
