/* XPM */
/* Brand Huntsman */
static char * dir_close[] = {
"16 16 2 1",
"  c None",
"# c #000000",
"                ",
"                ",
"    #####       ",
"   #######      ",
"  ###    ###### ",
"  ##      ######",
"  ########    ##",
"  ##          ##",
"  ##          ##",
"  ##          ##",
"  ##          ##",
"  ##          ##",
"  ##############",
"   ############ ",
"                ",
"                ",};
