/* XPM */
static char * mail_sign_xpm[] = {
"24 24 117 2",
"  	c None",
". 	c #E6E6E6",
"+ 	c #DADADA",
"@ 	c #E1E1E1",
"# 	c #C3C3C3",
"$ 	c #B8B8B8",
"% 	c #AEAEAE",
"& 	c #A6A6A6",
"* 	c #A0A0A0",
"= 	c #979797",
"- 	c #878787",
"; 	c #7D7D7D",
"> 	c #777777",
", 	c #797979",
"' 	c #828282",
") 	c #939393",
"! 	c #9D9D9D",
"~ 	c #6D6D6D",
"{ 	c #F6F6F6",
"] 	c #F4F4F4",
"^ 	c #BEBEBE",
"/ 	c #9E9E9E",
"( 	c #767676",
"_ 	c #565656",
": 	c #4B4B4B",
"< 	c #414141",
"[ 	c #363636",
"} 	c #292929",
"| 	c #1C1C1C",
"1 	c #151515",
"2 	c #111111",
"3 	c #0D0D0D",
"4 	c #080808",
"5 	c #060606",
"6 	c #030303",
"7 	c #010101",
"8 	c #191919",
"9 	c #DCDCDC",
"0 	c #B6B6B6",
"a 	c #9C9C9C",
"b 	c #B1B1B1",
"c 	c #C1C1C1",
"d 	c #C4C4C4",
"e 	c #C2C2C2",
"f 	c #BDBDBD",
"g 	c #A3A3A3",
"h 	c #787878",
"i 	c #656565",
"j 	c #3E3E3E",
"k 	c #D2D2D2",
"l 	c #FFFFFF",
"m 	c #AAAAAA",
"n 	c #595959",
"o 	c #D4D4D4",
"p 	c #858585",
"q 	c #868686",
"r 	c #D8D8D8",
"s 	c #676767",
"t 	c #B3B3B3",
"u 	c #CFCFCF",
"v 	c #8E8E8E",
"w 	c #E5E5E5",
"x 	c #7E7E7E",
"y 	c #BABABA",
"z 	c #CECECE",
"A 	c #5E5E5E",
"B 	c #C7C7C7",
"C 	c #949494",
"D 	c #D9D9D9",
"E 	c #7F7F7F",
"F 	c #B2B2B2",
"G 	c #989898",
"H 	c #DDDDDD",
"I 	c #EDEDED",
"J 	c #ADADAD",
"K 	c #B0B0B0",
"L 	c #9F9F9F",
"M 	c #969696",
"N 	c #929292",
"O 	c #8F8F8F",
"P 	c #959595",
"Q 	c #9B9B9B",
"R 	c #A4A4A4",
"S 	c #ACACAC",
"T 	c #B4B4B4",
"U 	c #BCBCBC",
"V 	c #CCCCCC",
"W 	c #E0E0E0",
"X 	c #121212",
"Y 	c #020202",
"Z 	c #090909",
"` 	c #0E0E0E",
" .	c #141414",
"..	c #212121",
"+.	c #303030",
"@.	c #383838",
"#.	c #474747",
"$.	c #555555",
"%.	c #636363",
"&.	c #717171",
"*.	c #808080",
"=.	c #CBCBCB",
"-.	c #EFEFEF",
";.	c #575757",
">.	c #0C0C0C",
",.	c #424242",
"'.	c #919191",
").	c #9A9A9A",
"!.	c #BBBBBB",
"~.	c #C9C9C9",
"{.	c #CDCDCD",
"].	c #DFDFDF",
"^.	c #E4E4E4",
"/.	c #E7E7E7",
"(.	c #EEEEEE",
"_.	c #F2F2F2",
":.	c #B7B7B7",
"                                                ",
"                                                ",
"                                                ",
"                                            . + ",
"            @ # $ % & * = - ; > > , ' ) ! * ~ { ",
"    ] ^ / ( _ _ : < [ } | 1 2 3 4 4 5 6 7 7 8 9 ",
"    0 a * b c d d e ^ f c d c $ 0 g h 1 i j k l ",
"                                  m n o         ",
"                                p q             ",
"                            r s t               ",
"                          m : u                 ",
"                        = v                     ",
"                    w x y                       ",
"                  z A B                         ",
"                b C                             ",
"            D E %                               ",
"          F G H                                 ",
"      I J b K L M C N v O P P Q R S T U V W I   ",
"    O [ X Y 5 Z `  .8 ..+.@.#.$.%.&.*.O m =.-.  ",
"  ;.>.,.> '.).g J T !.~.{.+ ].D ^././.w (._.    ",
"k :.]                                           ",
"                                                ",
"                                                ",
"                                                "};
