/* XPM */
static char *magick[] = {
/* columns rows colors chars-per-pixel */
"16 16 36 1",
"  c #000000",
". c #090808",
"X c #222221",
"o c #2f2f2f",
"O c #5d5b57",
"+ c #63615d",
"@ c #6a6764",
"# c #6e6b68",
"$ c #706e6a",
"% c #7b7975",
"& c #8e6407",
"* c #ac7a09",
"= c #817f7c",
"- c #d1940c",
"; c #969490",
": c #989590",
"> c #a19f9b",
", c #a3a19c",
"< c #a7a4a0",
"1 c #b0afab",
"2 c #b6b3ad",
"3 c #bdbbb5",
"4 c #bebcb9",
"5 c #c0bdb8",
"6 c #c5c2bc",
"7 c #eed680",
"8 c #c7c6c3",
"9 c #d2d0cd",
"0 c #dcdad6",
"q c #dddcdb",
"w c #e4e2dd",
"e c #e5e5e2",
"r c #ebe9e5",
"t c #ececea",
"y c #fdfdfd",
"u c None",
/* pixels */
"uuuuuuuu  uuuuuu",
"uuuuuuu -& uuuuu",
"uuuuuu -7-& uuuu",
"uuuuu -77*-& uuu",
"uuuu -777-*-& uu",
"uuu    77*-    u",
"uuuuuu 77-* uuuu",
"uuu o  77*-   uu",
"uu <yy 77-* y+ u",
"uu yOe      #: u",
"uu ye4$tqt#=>3 u",
"uu yqw,$e##>06 u",
"uu y0%t8@;2$23 u",
"uu y=tre49rw#2 u",
"uu .654535556X u",
"uuu           uu"
};
