/* XPM */
static char * close_xpm[] = {
"32 32 316 2",
"  	c None",
". 	c #BBBBBB",
"+ 	c #BABABA",
"@ 	c #BCBCBC",
"# 	c #BDBDBD",
"$ 	c #B9B9B9",
"% 	c #AAAAAA",
"& 	c #9E9E9E",
"* 	c #979797",
"= 	c #6F6F6F",
"- 	c #B1B1B1",
"; 	c #A6A6A6",
"> 	c #A0A0A0",
", 	c #C2C2C2",
"' 	c #C3C3C3",
") 	c #C6C6C6",
"! 	c #C9C9C9",
"~ 	c #D2D2D2",
"{ 	c #D6D6D6",
"] 	c #D9D9D9",
"^ 	c #DCDCDC",
"/ 	c #DEDEDE",
"( 	c #DFDFDF",
"_ 	c #E7E7E7",
": 	c #EAEAEA",
"< 	c #EFEFEF",
"[ 	c #F2F2F2",
"} 	c #F5F5F5",
"| 	c #F6F6F6",
"1 	c #F8F8F8",
"2 	c #FAFAFA",
"3 	c #7B7B7B",
"4 	c #A7A7A7",
"5 	c #9A9A9A",
"6 	c #FDFDFD",
"7 	c #FFFFFF",
"8 	c #FEFEFE",
"9 	c #FCFCFC",
"0 	c #F7F7F7",
"a 	c #F4F4F4",
"b 	c #F0F0F0",
"c 	c #EEEEEE",
"d 	c #EBEBEB",
"e 	c #A8A8A8",
"f 	c #5C5C5C",
"g 	c #909090",
"h 	c #B3B3B3",
"i 	c #E4E4E4",
"j 	c #FBFBFB",
"k 	c #F9F9F9",
"l 	c #F3F3F3",
"m 	c #ECECEC",
"n 	c #E6E6E6",
"o 	c #E0E0E0",
"p 	c #989898",
"q 	c #575757",
"r 	c #555555",
"s 	c #848484",
"t 	c #B7B7B7",
"u 	c #858585",
"v 	c #F1F1F1",
"w 	c #E8E8E8",
"x 	c #CECECE",
"y 	c #757575",
"z 	c #3D3D3D",
"A 	c #515151",
"B 	c #3E3E3E",
"C 	c #7E7E7E",
"D 	c #7A7A7A",
"E 	c #A4A4A4",
"F 	c #A1A1A1",
"G 	c #B2B2B2",
"H 	c #D1D1D1",
"I 	c #E9E9E9",
"J 	c #E5E5E5",
"K 	c #E2E2E2",
"L 	c #DBDBDB",
"M 	c #636363",
"N 	c #2B2B2B",
"O 	c #6D6D6D",
"P 	c #7C7C7C",
"Q 	c #444444",
"R 	c #777777",
"S 	c #E1E1E1",
"T 	c #919191",
"U 	c #888888",
"V 	c #AEAEAE",
"W 	c #DDDDDD",
"X 	c #D3D3D3",
"Y 	c #BEBEBE",
"Z 	c #2E2E2E",
"` 	c #797979",
" .	c #939393",
"..	c #949494",
"+.	c #727272",
"@.	c #8F8F8F",
"#.	c #9C9C9C",
"$.	c #C7C7C7",
"%.	c #707070",
"&.	c #838383",
"*.	c #B4B4B4",
"=.	c #D5D5D5",
"-.	c #CFCFCF",
";.	c #A9A9A9",
">.	c #414141",
",.	c #434343",
"'.	c #646464",
").	c #A3A3A3",
"!.	c #6A6A6A",
"~.	c #676767",
"{.	c #8C8C8C",
"].	c #DADADA",
"^.	c #C8C8C8",
"/.	c #878787",
"(.	c #717171",
"_.	c #5F5F5F",
":.	c #898989",
"<.	c #CCCCCC",
"[.	c #D8D8D8",
"}.	c #4A4A4A",
"|.	c #6C6C6C",
"1.	c #7D7D7D",
"2.	c #A5A5A5",
"3.	c #ACACAC",
"4.	c #737373",
"5.	c #4B4B4B",
"6.	c #868686",
"7.	c #B6B6B6",
"8.	c #8B8B8B",
"9.	c #B0B0B0",
"0.	c #CBCBCB",
"a.	c #595959",
"b.	c #808080",
"c.	c #EDEDED",
"d.	c #C4C4C4",
"e.	c #BFBFBF",
"f.	c #D0D0D0",
"g.	c #B5B5B5",
"h.	c #626262",
"i.	c #9F9F9F",
"j.	c #ABABAB",
"k.	c #C1C1C1",
"l.	c #454545",
"m.	c #C5C5C5",
"n.	c #CACACA",
"o.	c #4D4D4D",
"p.	c #3F3F3F",
"q.	c #929292",
"r.	c #999999",
"s.	c #736F6D",
"t.	c #4B2F21",
"u.	c #672909",
"v.	c #84340B",
"w.	c #82320A",
"x.	c #632508",
"y.	c #371B0C",
"z.	c #48423E",
"A.	c #969696",
"B.	c #4E4E4E",
"C.	c #5D5A58",
"D.	c #7C3610",
"E.	c #CE5615",
"F.	c #F16318",
"G.	c #F26115",
"H.	c #E75A13",
"I.	c #DA5312",
"J.	c #B3430E",
"K.	c #6F2909",
"L.	c #3A3533",
"M.	c #959595",
"N.	c #585858",
"O.	c #8A8A8A",
"P.	c #CDCDCD",
"Q.	c #5C524D",
"R.	c #8E3B0F",
"S.	c #F57027",
"T.	c #F17E3F",
"U.	c #F67D3A",
"V.	c #F87027",
"W.	c #F16014",
"X.	c #E25A15",
"Y.	c #D2561A",
"Z.	c #C8490F",
"`.	c #7C2C0A",
" +	c #352924",
".+	c #8D8D8D",
"++	c #656565",
"@+	c #9B9B9B",
"#+	c #D4D4D4",
"$+	c #A2A2A2",
"%+	c #5C290E",
"&+	c #E45E17",
"*+	c #EC8D58",
"=+	c #F0CEBC",
"-+	c #F7B48F",
";+	c #F77F3E",
">+	c #F0681F",
",+	c #E0946B",
"'+	c #E8BEA8",
")+	c #D16B3A",
"!+	c #B3400D",
"~+	c #521D07",
"{+	c #3C3C3C",
"]+	c #525252",
"^+	c #D7D7D7",
"/+	c #54514F",
"(+	c #B9490F",
"_+	c #F56519",
":+	c #F1A377",
"<+	c #FDF9F6",
"[+	c #FDF8F5",
"}+	c #F8BB9A",
"|+	c #E6AE8E",
"1+	c #F4F0ED",
"2+	c #F6F4F2",
"3+	c #DB916D",
"4+	c #BA430E",
"5+	c #9A350B",
"6+	c #2C2623",
"7+	c #8E8E8E",
"8+	c #423631",
"9+	c #DC5612",
"0+	c #F16015",
"a+	c #F87B38",
"b+	c #FBCAAF",
"c+	c #FDFCFC",
"d+	c #FAF4F1",
"e+	c #F5F0EE",
"f+	c #EBC7B3",
"g+	c #CD612E",
"h+	c #B8410E",
"i+	c #AB3A0C",
"j+	c #37231C",
"k+	c #392319",
"l+	c #DC5412",
"m+	c #F06C25",
"n+	c #F2DED3",
"o+	c #F1E2D9",
"p+	c #D15C24",
"q+	c #C2470E",
"r+	c #B33F0D",
"s+	c #A9390C",
"t+	c #432418",
"u+	c #5B5B5B",
"v+	c #696969",
"w+	c #2B1C14",
"x+	c #D04E10",
"y+	c #E15C19",
"z+	c #DF9770",
"A+	c #F1ECE9",
"B+	c #D68C69",
"C+	c #BD4714",
"D+	c #AE3C0D",
"E+	c #A4370B",
"F+	c #40271F",
"G+	c #5A5A5A",
"H+	c #373231",
"I+	c #A63C0C",
"J+	c #CE4D10",
"K+	c #D4835C",
"L+	c #F2EEEC",
"M+	c #F5F3F2",
"N+	c #E4B8A3",
"O+	c #EFEBE9",
"P+	c #ECE6E4",
"Q+	c #C77B5B",
"R+	c #A6380C",
"S+	c #902F09",
"T+	c #413936",
"U+	c #612307",
"V+	c #BF460E",
"W+	c #D17A52",
"X+	c #F2EAE5",
"Y+	c #E8C4B1",
"Z+	c #CE6533",
"`+	c #C75928",
" @	c #DCB09D",
".@	c #EBE7E3",
"+@	c #C27B5C",
"@@	c #9E340B",
"#@	c #5F1E06",
"$@	c #443834",
"%@	c #782B0A",
"&@	c #BD4E1C",
"*@	c #BB4612",
"=@	c #B43F0D",
"-@	c #AF3E0E",
";@	c #AC451A",
">@	c #A0360C",
",@	c #712508",
"'@	c #3B2C27",
")@	c #36231C",
"!@	c #7F2C09",
"~@	c #AB3B0C",
"{@	c #AD3C0C",
"]@	c #AC3B0C",
"^@	c #A8390C",
"/@	c #A3370B",
"(@	c #9C330A",
"_@	c #7A2707",
":@	c #3B261E",
"<@	c #46403A",
"[@	c #3E321E",
"}@	c #4D2B16",
"|@	c #662308",
"1@	c #762708",
"2@	c #752607",
"3@	c #652106",
"4@	c #482518",
"5@	c #4B4340",
"6@	c #1F1B11",
"7@	c #201D15",
"8@	c #494544",
"9@	c #4A423E",
"0@	c #574E4B",
"a@	c #6F6B69",
"                                                                ",
"                                                                ",
"                                                                ",
"                                                                ",
"                                . . . + . @ # $ % & * =         ",
"  - ; > , ' ) ! ~ ~ { ] ^ / ( ( _ : < [ } | 1 1 2 2 [ 3 4       ",
"  5 6 7 7 7 7 7 7 7 7 7 8 6 6 9 2 2 0 a [ b < c d _ e f g       ",
"  h i 7 7 7 7 7 7 8 9 j k 1 0 } l [ b c m d : n o p q r s       ",
"  t u ' _ 2 6 9 2 k 0 | l l v < c m : w n i / x y z A B C       ",
"  ' D E F G H [ k } [ v c c m d I _ J K o L ! M N O P Q R       ",
"    ; S d # T U V H w < m w n i K o W L X Y A Z `  ...q +.@.    ",
"    #.~ 2 a L $.g %.&.*.i m i / L ] =.-.;.>.,.'.T ; ).!.~.{.    ",
"    #.@ k 0 v m ].^./.(._.:.<.{ ^ [.! ).}.A |.1.2.G 3.4.5.6.    ",
"    7.% 1 1 b c w / , #.8./.` R 9.0.p a.= y b.T e @ t ..,.b.    ",
"      {.1 | c c.d w o d.e.i f.g./.O h.3 i.*.- > j.# k.E l.D     ",
"      D l | c d I _ W m.n _ ].~ n.h 3 h.o.p.q.G r.% e.E A (.    ",
"      2.0.| < I _ J =.] I ( ].^.s.t.u.v.w.x.y.z.r.r.A.* B._.    ",
"      h h | c n J W -.: o L ' C.D.E.F.G.H.I.J.K.L.T M.|.f N.    ",
"        O.v b n o P.J i ] X Q.R.S.T.U.V.W.X.Y.Z.`. +.+++N.M     ",
"        @+K [ J #+=.I L { $+%+&+*+=+-+;+>+,+'+)+!+~+{+]+f 4.    ",
"        #.=.v S <.w ^ ^+P./+(+_+:+<+[+}+|+1+2+3+4+5+6+3 7+      ",
"        A.! m f./ K ^+~ h 8+9+0+a+b+c+d+e+0 f+g+h+i+j+          ",
"          2.^+H ^ $.Y G y k+l+H.0+m+n+1 | o+p+q+r+s+t+          ",
"          5 n.k.j..+u+v+r w+x+l+y+z+1+0 a A+B+C+D+E+F+          ",
"          %...h.G+(.3 &.u H+I+J+K+L+M+f+N+O+P+Q+R+S+T+          ",
"            E #.g g         U+V+W+X+Y+Z+`+ @.@+@@@#@            ",
"                            $@%@h+&@*@h+=@-@;@>@,@'@            ",
"                              )@!@~@{@]@^@/@(@_@:@              ",
"                              <@[@}@|@1@2@3@4@5@                ",
"                                6@7@8@9@0@a@                    ",
"                                                                ",
"                                                                "};
