/* XPM */
static char * online_xpm[] = {
"26 11 8 1",
" 	c None",
".	c #999999",
"+	c #4D4D4D",
"@	c #FFFFFF",
"#	c #E6E6E6",
"$	c #CCCCCC",
"%	c #808080",
"&	c #000000",
"           .++            ",
"          .@#+..+         ",
"          .$#%#@#+        ",
"         ++$#%$$$++       ",
".........#+$#%$$$+#&++++++",
"##$#$$$$+$+$#%$$$+$+$$$$$$",
"+++++++++.+$#%$$$+.+++++++",
"         ++$#%...++       ",
"          +$.%...+        ",
"          &..++++         ",
"           +++            "};
