/* XPM */
static char * mail_send[] = {
"24 24 121 2",
"  	c None",
". 	c #E4F5E8",
"+ 	c #E4F0E8",
"@ 	c #E4F4E4",
"# 	c #E0F3E8",
"$ 	c #E0EFE4",
"% 	c #E0EFE0",
"& 	c #DCEFE0",
"* 	c #DCEBE0",
"= 	c #E0EADC",
"- 	c #D8ECDC",
"; 	c #D8E6DC",
"> 	c #D4E5E4",
", 	c #C7BEC4",
"' 	c #BBACBC",
") 	c #A78C9C",
"! 	c #DFE4DC",
"~ 	c #D8E8E0",
"{ 	c #D8E7DC",
"] 	c #D4E3D4",
"^ 	c #D4DFD0",
"/ 	c #D0E3D4",
"( 	c #D0DFD0",
"_ 	c #D3D6CC",
": 	c #C7DCC8",
"< 	c #988884",
"[ 	c #B88884",
"} 	c #9CACA8",
"| 	c #708078",
"1 	c #505354",
"2 	c #C7B8C4",
"3 	c #A788A0",
"4 	c #C3B4C0",
"5 	c #C3B8BC",
"6 	c #C7D8C8",
"7 	c #AC965F",
"8 	c #805C4F",
"9 	c #988E7B",
"0 	c #283330",
"a 	c #C3BAC0",
"b 	c #C4BCB8",
"c 	c #C0BCBC",
"d 	c #CFDAC8",
"e 	c #CFD6C8",
"f 	c #403C2C",
"g 	c #28362B",
"h 	c #9C9080",
"i 	c #E3E4E4",
"j 	c #DFE0E0",
"k 	c #D8E4DC",
"l 	c #D8E3D8",
"m 	c #D0DBD0",
"n 	c #D3D2CC",
"o 	c #C4D0C4",
"p 	c #C4D2D0",
"q 	c #C0CEC0",
"r 	c #C4CAC4",
"s 	c #94A498",
"t 	c #949D9B",
"u 	c #BFD0CC",
"v 	c #878D84",
"w 	c #6C8274",
"x 	c #B4BFB8",
"y 	c #8C9794",
"z 	c #C0D6CC",
"A 	c #C0D0CC",
"B 	c #C0CACC",
"C 	c #C8D4C8",
"D 	c #B8C9BF",
"E 	c #B4CBB4",
"F 	c #ACB7B0",
"G 	c #B8C5B8",
"H 	c #A8B7AC",
"I 	c #ACBBA0",
"J 	c #C4CDC0",
"K 	c #AFAEA8",
"L 	c #C3D8D0",
"M 	c #C0C8C0",
"N 	c #C8D0C8",
"O 	c #B8C5BC",
"P 	c #B0BFB4",
"Q 	c #A0A6A4",
"R 	c #9CA898",
"S 	c #808D84",
"T 	c #888984",
"U 	c #B4C7B0",
"V 	c #94968C",
"W 	c #A8B9AC",
"X 	c #B7C8BC",
"Y 	c #B8CEBC",
"Z 	c #C8DAC8",
"` 	c #98A7A0",
" .	c #788884",
"..	c #93B094",
"+.	c #707E6F",
"@.	c #808A80",
"#.	c #707C78",
"$.	c #B3B8B0",
"%.	c #748667",
"&.	c #979A98",
"*.	c #444233",
"=.	c #74826C",
"-.	c #676854",
";.	c #C0C6C4",
">.	c #CBD8CC",
",.	c #242F2F",
"'.	c #DCE8DC",
").	c #C4C8B7",
"!.	c #202C2F",
"~.	c #C7D2C8",
"{.	c #BBD6C0",
"].	c #BCD0C0",
"^.	c #DCF3E8",
"/.	c #D8F3E4",
"(.	c #D8EFE0",
"_.	c #D8EBE0",
":.	c #303234",
"<.	c #101408",
"[.	c #0C120C",
"}.	c #081010",
"|.	c #283237",
"                                                ",
"                                                ",
"                                                ",
"                                                ",
"                                                ",
"  . . + + + @ @ # $ % & % & * * = = - ; >       ",
"  , ' ' ) ! ! ~ ~ { ] ^ / ( ( _ _ : < [ } | 1   ",
"  2 3 4 5 5 ~ ~ { ] ^ / ( ( _ _ : 6 7 8 9 | 0   ",
"  a ) 5 b ) c { ] ] / ( ( _ _ d e 6 f g h | 0   ",
"  i j j ! ! ~ k l / ( ( m m _ n 6 o p q r | 0   ",
"  j j ! ! s t u v w x y ( _ _ : 6 z A B C | 0   ",
"  j ! ! ~ D E F G H I J _ K : 6 L q B M N | 0   ",
"  ! ! ~ ~ O P Q R S T U V W X L A A q Y Z | 0   ",
"  ! ~ ~ { `  ...+.@.#.$.%.&.*.=.-.q ;.M >.| ,.  ",
"  '.'.{ ] ] / ( ( _ _ d e L A A q M M ).Z | !.  ",
"  ! ~ k l / ( ( m m >.n 6 ~.p q M r {.].>.| !.  ",
"  ^.^.^./.(./._.(._.(._.(._.(._.(._.(._.(.| !.  ",
"  :.<.<.<.<.<.[.}.}.}.}.}.}.}.}.}.}.}.}.}.}.|.  ",
"                                                ",
"                                                ",
"                                                ",
"                                                ",
"                                                ",
"                                                "};
