/* XPM */
static char * gpg_signed_xpm[] = {
"11 6 4 1",
" 	c None",
".	c #000000",
"+	c #EED680",
"@	c #8E804C",
" ....      ",
".++++......",
".+@+++++++.",
".++++...+. ",
".++++.  .  ",
" ....      "};
