/* XPM */
static char * messageview_text_xpm[] = {
"24 24 119 2",
"  	c None",
". 	c #979797",
"+ 	c #8F8F8F",
"@ 	c #8E8E8E",
"# 	c #A0A0A0",
"$ 	c #656565",
"% 	c #000000",
"& 	c #6F6F6F",
"* 	c #767676",
"= 	c #323232",
"- 	c #ECECEC",
"; 	c #FAFAFA",
"> 	c #F9F9F9",
", 	c #F8F8F8",
"' 	c #F7F7F7",
") 	c #F6F6F6",
"! 	c #F5F5F5",
"~ 	c #F4F4F4",
"{ 	c #959595",
"] 	c #1A1A1A",
"^ 	c #888888",
"/ 	c #757575",
"( 	c #F1F1F1",
"_ 	c #EEEEEE",
": 	c #E9E9E9",
"< 	c #E7E7E7",
"[ 	c #E6E6E6",
"} 	c #E5E5E5",
"| 	c #E4E4E4",
"1 	c #E3E3E3",
"2 	c #E2E2E2",
"3 	c #C4C4C4",
"4 	c #737373",
"5 	c #616161",
"6 	c #7E7E7E",
"7 	c #F0F0F0",
"8 	c #CCCCCC",
"9 	c #C7C7C7",
"0 	c #C6C6C6",
"a 	c #C5C5C5",
"b 	c #D3D3D3",
"c 	c #DDDDDD",
"d 	c #C3C3C3",
"e 	c #D5D5D5",
"f 	c #353535",
"g 	c #707070",
"h 	c #F3F3F3",
"i 	c #C2C2C2",
"j 	c #BCBCBC",
"k 	c #BBBBBB",
"l 	c #BABABA",
"m 	c #CACACA",
"n 	c #D8D8D8",
"o 	c #B8B8B8",
"p 	c #CFCFCF",
"q 	c #EDEDED",
"r 	c #E0E0E0",
"s 	c #C1C1C1",
"t 	c #C9C9C9",
"u 	c #D7D7D7",
"v 	c #B7B7B7",
"w 	c #CECECE",
"x 	c #343434",
"y 	c #EBEBEB",
"z 	c #EAEAEA",
"A 	c #C0C0C0",
"B 	c #B9B9B9",
"C 	c #C8C8C8",
"D 	c #B6B6B6",
"E 	c #CDCDCD",
"F 	c #7F7F7F",
"G 	c #DEDEDE",
"H 	c #BFBFBF",
"I 	c #B5B5B5",
"J 	c #BEBEBE",
"K 	c #D4D4D4",
"L 	c #B4B4B4",
"M 	c #CBCBCB",
"N 	c #E8E8E8",
"O 	c #DCDCDC",
"P 	c #BDBDBD",
"Q 	c #B3B3B3",
"R 	c #D2D2D2",
"S 	c #B2B2B2",
"T 	c #333333",
"U 	c #E1E1E1",
"V 	c #D6D6D6",
"W 	c #D0D0D0",
"X 	c #B1B1B1",
"Y 	c #DFDFDF",
"Z 	c #DBDBDB",
"` 	c #B0B0B0",
" .	c #626262",
"..	c #DADADA",
"+.	c #7D7D7D",
"@.	c #AEAEAE",
"#.	c #AFAFAF",
"$.	c #7C7C7C",
"%.	c #ADADAD",
"&.	c #7B7B7B",
"*.	c #636363",
"=.	c #777777",
"-.	c #D1D1D1",
";.	c #303030",
">.	c #717171",
",.	c #6D6D6D",
"'.	c #434343",
").	c #D9D9D9",
"!.	c #989898",
"~.	c #1F1F1F",
"{.	c #808080",
"].	c #4D4D4D",
"^.	c #141414",
"/.	c #2D2D2D",
"(.	c #2C2C2C",
"_.	c #2B2B2B",
":.	c #050505",
"<.	c #575757",
"[.	c #727272",
"                                                ",
"      . + @ @ @ @ @ @ @ @ @ @ @ @ @ #           ",
"    $ % % % % % % % % % % % % % % % % &         ",
"  * = - ; > , ' ' ) ! ! ! ! ~ ~ ~ ~ { ] ^       ",
"  $ / ' ( ( _ : < [ } < : | 1 2 2 } 3 = 4       ",
"  5 6 ~ 7 7 } 8 9 0 a b c 0 3 d d e 0 f g       ",
"  5 6 h _ _ 2 i j k l m n l o o o p a f g       ",
"  5 6 ( q q r s l l o t u l o v v w 3 x &       ",
"  5 6 y z - r A l B v C u l D D D E i x g       ",
"  5 F w c y G H o o v 9 e o D I I 8 s x &       ",
"  5 F - z z c J o o D 0 K v L L I M A x &       ",
"  5 F y : N O P v D I a b D L Q Q m H x g       ",
"  5 F N < < O s k l B 9 R I Q S S C j T g       ",
"  5 6 N [ } U V b R R u W L S X X 9 j T g       ",
"  5 6 Y r | Z a A A H m W L ` ` X 9 k T &       ",
"   .6 p ..| u B L Q X s p S ` ` ` 0 B T g       ",
"  5 +.| 2 2 V o S S ` A w S ` @.#.3 B T &       ",
"  5 $.1 U U V o X ` #.A E X @.%.%.d o T &       ",
"   .&.U r r e l I I L s E Q ` #.` 3 v T &       ",
"  *.=.2 Y Y Z b R -.W K e 8 M m m -.S ;.>.      ",
"  ,.'.- N N < [ } 2 r G Z ..).V e K !.~.{.      ",
"    ].^./.;./.(._._._._.(.(.(.(.(.(.:.<.        ",
"      $.[.>.>.>.>.>.>.>.>.>.>.>.>.>.^           ",
"                                                "};
