/* XPM */
static char * mail_compose_xpm[] = {
"26 22 14 1",
" 	c None",
".	c #000000",
"+	c #808080",
"@	c #FFFF00",
"#	c #008080",
"$	c #FFFFFF",
"%	c #E0DADE",
"&	c #C0C0C0",
"*	c #9999FF",
"=	c #6666CC",
"-	c #000080",
";	c #808000",
">	c #800000",
",	c #333366",
"                          ",
"  ..+            @        ",
" #...+     $$   $%        ",
" +#...+    $$@ $@%%       ",
" .+#...+  $$$$@$$+$%      ",
"  .+#...+$$&$$$@+++@      ",
"   .+#*..+$$$@&++@++  @   ",
"    .*=...+&$$$@+++@$     ",
"     .+#...+&&$$@+$&$=    ",
"      ++#...+$&&@&@$&=    ",
"       ++#.-;>$*$&@&=     ",
"       $#+#;;;-+$$&$=     ",
"      $$&##$>;>&@&$=      ",
"      $&$&;@@&>$&$&=+     ",
"     @&@$&+++&+>$&=,=++   ",
"    +*@&&$&$&++>&@=,=+    ",
"     +=*@&@&$&@&@=,,=     ",
"       +=*&@&@&@&=,=      ",
"         +=**&@&=,=       ",
"           +=**@,=        ",
"             +=;+         ",
"                          "};
