/* XPM */
static char * queue_close_hrm_xpm[] = {
"16 16 11 1",
" 	c None",
".	c #006A02",
"+	c #CDFEC5",
"@	c #00BF04",
"#	c #B1FEA7",
"$	c #004701",
"%	c #5E00BF",
"&	c #7D00FE",
"*	c #05FE00",
"=	c #DEBFFE",
"-	c #57FE57",
"  ...    ..     ",
" .+@+.  .##.    ",
".+++.+..####.   ",
".@..+@.######.  ",
".+++++...##..   ",
" .+@+.  .##.    ",
"  ...   .##.    ",
"  $     .##. $  ",
"  $%%%%@....@$  ",
"  $&&&&******$  ",
"  $====------$  ",
"  $$$$$$$$$$$$  ",
"                ",
"                ",
"                ",
"                "};
