/* XPM */
static char * complete_xpm[] = {
"20 20 4 1",
" 	c None",
".	c #A680BB",
"+	c #C189ED",
"@	c #C7A2E8",
"                    ",
"                    ",
"                    ",
"                    ",
"                    ",
"                    ",
"       .........    ",
"       .+++++++@    ",
"       .+++++++@    ",
"       .+++++++@    ",
"       .+++++++@    ",
"       .+++++++@    ",
"       .+++++++@    ",
"       .+++++++@    ",
"       @@@@@@@@@    ",
"                    ",
"                    ",
"                    ",
"                    ",
"                    "};
