/* XPM */
static char * watchthread_xpm[] = {
"13 10 3 1",
" 	c None",
".	c #008000",
"+	c #8DE58D",
"             ",
".............",
".+++++++++++.",
".++++++++..+.",
".++.....+..+.",
".+++++++++++.",
".++.....++++.",
".+++++++++++.",
".+++++++++++.",
"............."};
