/* XPM */
static char * replied_xpm[] = {
"11 9 30 1",
" 	c None",
".	c #000000",
"+	c #DADAD7",
"@	c #D6D6D3",
"#	c #CCCECA",
"$	c #C5C5C2",
"%	c #CACAC8",
"&	c #C1C2BE",
"*	c #B9BAB5",
"=	c #BEBFBB",
"-	c #B6B6B2",
";	c #AEAEA9",
">	c #30312D",
",	c #B2B3AE",
"'	c #AAAAA5",
")	c #A2A39C",
"!	c #32332F",
"~	c #ACADA7",
"{	c #9F9F99",
"]	c #A7A7A2",
"^	c #9D9F99",
"/	c #969791",
"(	c #343431",
"_	c #CCCBC7",
":	c #BCBCB8",
"<	c #070706",
"[	c #92938C",
"}	c #898A83",
"|	c #81827A",
"1	c #CBCBC7",
"   .       ",
"  .+.      ",
" .@#$.     ",
"..%&*..    ",
" .=-;.  >> ",
" .,'). !~{>",
" .]^/.(_:~>",
"  <[}|.+1> ",
"   ......  "};
