/* XPM */
static char * ignorethread_xpm[] = {
"13 10 7 1",
" 	c None",
".	c #7D00FE",
"+	c #004701",
"@	c #BAE6B3",
"#	c #FFFFFF",
"$	c #89AA85",
"%	c #006A02",
"          .  ",
"    +++++..  ",
"  ++@@@@..+  ",
" +#@@$%..@#+ ",
"+##@$%..$@##+",
"+##@$..%$@##+",
" +#@..%$@@#+ ",
"  +..@@@@++  ",
"  ..+++++    ",
"  .          "};
