/* XPM */
static char * queue_close_xpm[] = {
"16 16 8 1",
" 	c None",
".	c #006A02",
"+	c #CDFEC5",
"@	c #00BF04",
"#	c #B1FEA7",
"$	c #004701",
"%	c #05FE00",
"&	c #57FE57",
"  ...    ..     ",
" .+@+.  .##.    ",
".+++.+..####.   ",
".@..+@.######.  ",
".+++++...##..   ",
" .+@+.  .##.    ",
"  ...   .##.    ",
"  $     .##. $  ",
"  $@@@@@....@$  ",
"  $%%%%%%%%%%$  ",
"  $&&&&&&&&&&$  ",
"  $$$$$$$$$$$$  ",
"                ",
"                ",
"                ",
"                "};
