/* XPM */
static char * work_offline_xpm[] = {
"12 12 6 1",
" 	c None",
".	c #000000",
"+	c #FFFFFF",
"@	c #FFFF00",
"#	c #708090",
"$	c #FFA500",
"            ",
"    ....    ",
"  ..$$$$..  ",
"  .@+$$$$.  ",
" .$+@$$$$$. ",
" .$$$$$$$$. ",
" .$$$$$$@$. ",
" .$$$$$@@$. ",
"  .$$$@@$.  ",
"  ..$$$$..  ",
"    ....    ",
"            "};
