/* XPM */
static char * mime_unknown_xpm[] = {
"14 18 54 1",
" 	c None",
".	c #7A8491",
"+	c #030E1F",
"@	c #EBEBEB",
"#	c #95A2AE",
"$	c #ACB3B5",
"%	c #ADB4B7",
"&	c #AEB6B8",
"*	c #AFB7BA",
"=	c #B1B8BB",
"-	c #B2B9BC",
";	c #B3BABE",
">	c #B4BBC0",
",	c #B6BDC1",
"'	c #B6BEC2",
")	c #68888A",
"!	c #B8C0C5",
"~	c #FFFFFF",
"{	c #D0D9E4",
"]	c #303338",
"^	c #98A7B4",
"/	c #A3B1BC",
"(	c #BEC6CD",
"_	c #C0C8CF",
":	c #C0C8D0",
"<	c #C1CAD1",
"[	c #C3CBD3",
"}	c #C4CDD4",
"|	c #C9D2DB",
"1	c #C0C9CF",
"2	c #C1C9D0",
"3	c #C2CBD2",
"4	c #C4CCD4",
"5	c #C4CDD5",
"6	c #C5CED7",
"7	c #C7CFD8",
"8	c #CAD3DD",
"9	c #C2CAD1",
"0	c #C3CCD3",
"a	c #C5CDD5",
"b	c #C5CED6",
"c	c #C7CFD7",
"d	c #C8D1D9",
"e	c #C8D2DB",
"f	c #CAD3DC",
"g	c #CCD5DF",
"h	c #C5CED5",
"i	c #C6CED7",
"j	c #C7CFD9",
"k	c #C9D1DA",
"l	c #C9D2DC",
"m	c #CBD3DD",
"n	c #CDD6E0",
"o	c #CFD7E1",
".............+",
".@@@@@@@@@@@#+",
".@$%&*=-;>,'#+",
".@)))))))))!#+",
".)~~~~~~~~{]#+",
".)~{{{{{{{^]#+",
".)~{)/))){^]#+",
".)~{{{{{{{^]#+",
".)~{)))/){^]#+",
".)~{{{{{{{^]#+",
".){^^^^{{{^]#+",
".@]]]]]]{^])#+",
".@(_:<[})^]|#+",
".@1234567)]8#+",
".@90abcdef]g#+",
".@4hijklmgno#+",
".############+",
".+++++++++++++"};
