/* XPM */
static char *error[]={
"24 24 3 1",
". c None",
"a c #000000",
"# c #ff0000",
".######################.",
"########################",
"########################",
"####................####",
"###..................###",
"###..................###",
"###..................###",
"###.....a......a.....###",
"###....aaa....aaa....###",
"###.....aaa..aaa.....###",
"###......aaaaaa......###",
"###.......aaaa.......###",
"###.......aaaa.......###",
"###......aaaaaa......###",
"###.....aaa..aaa.....###",
"###....aaa....aaa....###",
"###.....a......a.....###",
"###..................###",
"###..................###",
"###..................###",
"####................####",
"########################",
"########################",
".######################."};
