/* XPM */
static char * notice_warn_xpm[] = {
"16 16 124 2",
"  	c None",
". 	c #959595",
"+ 	c #222222",
"@ 	c #383838",
"# 	c #A9A9A9",
"$ 	c #0F0E0E",
"% 	c #151515",
"& 	c #010101",
"* 	c #161515",
"= 	c #404040",
"- 	c #1A1A1A",
"; 	c #534107",
"> 	c #3A2E05",
", 	c #040404",
"' 	c #636363",
") 	c #9A9A9A",
"! 	c #131313",
"~ 	c #0E0D09",
"{ 	c #D6A913",
"] 	c #C49A0E",
"^ 	c #0E0E0D",
"/ 	c #030202",
"( 	c #B1B1B1",
"_ 	c #2B2B2B",
": 	c #181818",
"< 	c #735D16",
"[ 	c #E1B00E",
"} 	c #DDAD0D",
"| 	c #665311",
"1 	c #101010",
"2 	c #414141",
"3 	c #838383",
"4 	c #171717",
"5 	c #19170E",
"6 	c #E5B71B",
"7 	c #9A7809",
"8 	c #896C08",
"9 	c #D9AA11",
"0 	c #29261D",
"a 	c #090909",
"b 	c #1C1B1B",
"c 	c #191919",
"d 	c #917826",
"e 	c #F6C00F",
"f 	c #A17E0A",
"g 	c #91710A",
"h 	c #F2BD10",
"i 	c #8A6F19",
"j 	c #6C6C6C",
"k 	c #1C1C1C",
"l 	c #2D2917",
"m 	c #EDBE1F",
"n 	c #F4BF10",
"o 	c #B18B0C",
"p 	c #A17D0B",
"q 	c #F0BB11",
"r 	c #E2B011",
"s 	c #47402A",
"t 	c #161616",
"u 	c #737373",
"v 	c #141414",
"w 	c #A98D32",
"x 	c #F3BE10",
"y 	c #CB9F0E",
"z 	c #BE950E",
"A 	c #EEBA12",
"B 	c #ECB812",
"C 	c #A5841B",
"D 	c #383737",
"E 	c #555555",
"F 	c #202020",
"G 	c #463F26",
"H 	c #F1C123",
"I 	c #F1BC10",
"J 	c #B68E0D",
"K 	c #AA850D",
"L 	c #EAB713",
"M 	c #E4B213",
"N 	c #675932",
"O 	c #282828",
"P 	c #515151",
"Q 	c #AFAFAF",
"R 	c #121212",
"S 	c #1B1B1B",
"T 	c #BEA03F",
"U 	c #F1BC11",
"V 	c #EFBB11",
"W 	c #EBB712",
"X 	c #EAB613",
"Y 	c #E8B513",
"Z 	c #E7B414",
"` 	c #B8921A",
" .	c #4D4C4A",
"..	c #0D0D0D",
"+.	c #A3A3A3",
"@.	c #909090",
"#.	c #423C27",
"$.	c #BF9A27",
"%.	c #B79115",
"&.	c #B48F16",
"*.	c #B38E18",
"=.	c #B08D19",
"-.	c #AE8B1A",
";.	c #AD891B",
">.	c #AA881D",
",.	c #A8861D",
"'.	c #A3831E",
").	c #6F633E",
"!.	c #262626",
"~.	c #848484",
"{.	c #9D9D9D",
"].	c #1E1E1E",
"^.	c #2A2A2A",
"/.	c #2E2E2E",
"(.	c #323232",
"_.	c #363636",
":.	c #3A3A3A",
"<.	c #3D3D3D",
"[.	c #424242",
"}.	c #151414",
"|.	c #4E4E4E",
"1.	c #464646",
"2.	c #454545",
"3.	c #A8A8A8",
"                                ",
"            . + @ #             ",
"            $ % & *             ",
"          = - ; > , '           ",
"        ) ! ~ { ] ^ / (         ",
"        _ : < [ } | 1 2         ",
"      3 4 5 6 7 8 9 0 a .       ",
"      b c d e f g h i + +       ",
"    j k l m n o p q r s t u     ",
"    v - w x h y z A B C D $     ",
"  E F G H I q J K B L M N O P   ",
"Q R S T U V A B W X Y Z `  ...+.",
"@.- #.$.%.&.*.=.-.;.>.,.'.).!.~.",
"{.a ! - ].+ !.^./.(._.:.<.[.}.{.",
"  # |.1.1.1.1.1.1.1.1.1.2.|.3.  ",
"                                "};
