/* XPM */
static char * address_xpm[] = {
"16 16 3 1",
" 	c None",
".	c #8C8CF2",
"+	c #4B4B63",
"                ",
"                ",
"                ",
"  ............. ",
"  ............. ",
"  .+..+.+...... ",
"  ............. ",
"  .+..++....... ",
"  ............. ",
"  .+..+++.++++. ",
"  ............. ",
"  .+..+.+++.... ",
"  ............. ",
"  ............. ",
"                ",
"                "};
