/* XPM */
/* Brand Huntsman */
static char * clipkey[] = {
"11 12 4 1",
"  c None",
"# c #000000",
"@ c #3f3f3f",
"- c #fcfe04",
"  ###      ",
" #   #     ",
" #   #     ",
"##  ##     ",
"##  ##     ",
"##  ## @@@ ",
"##  ##@---@",
"#@@@@@----@",
"@-------@-@",
"#@-@-@----@",
"  @ @ @---@",
"       @@@ "};
