/* XPM */
static char * outbox_open_hrm_xpm[] = {
"16 16 87 1",
" 	c None",
".	c #3F3F3F",
"+	c #585858",
"@	c #525252",
"#	c #373737",
"$	c #575757",
"%	c #B1B1B1",
"&	c #5E5E5E",
"*	c #7D7D7D",
"=	c #D2D2D2",
"-	c #B5B5B5",
";	c #656565",
">	c #B7B7B7",
",	c #D8D8D8",
"'	c #BABABA",
")	c #555555",
"!	c #4D4D4D",
"~	c #BCBCBC",
"{	c #C7C7C7",
"]	c #686868",
"^	c #909090",
"/	c #B6B6B6",
"(	c #8A8A8A",
"_	c #333333",
":	c #2E2E2E",
"<	c #383838",
"[	c #4F4F4F",
"}	c #696969",
"|	c #4C4C4C",
"1	c #5A5A5A",
"2	c #535353",
"3	c #484848",
"4	c #2A2A2A",
"5	c #323232",
"6	c #4E4E4E",
"7	c #3B3B3B",
"8	c #E3E3E3",
"9	c #EEEEEE",
"0	c #EAE5E5",
"a	c #E5D3D3",
"b	c #DCD6D6",
"c	c #D3D2D2",
"d	c #C9C9C9",
"e	c #BDBDBD",
"f	c #9B9B9B",
"g	c #3C3C3C",
"h	c #3A3A3A",
"i	c #E5E5E5",
"j	c #F9F7F7",
"k	c #FADFDF",
"l	c #FC8C8C",
"m	c #F2CCCC",
"n	c #E5E1E1",
"o	c #DBDBDB",
"p	c #D0D0D0",
"q	c #717171",
"r	c #EEDEDE",
"s	c #FC9292",
"t	c #FE3F3F",
"u	c #F97C7C",
"v	c #E4D2D2",
"w	c #D6D5D5",
"x	c #CBCBCB",
"y	c #878787",
"z	c #353535",
"A	c #E4E0E0",
"B	c #F6D5D5",
"C	c #FA8181",
"D	c #ECC1C1",
"E	c #C4C4C4",
"F	c #8F8F8F",
"G	c #464646",
"H	c #CDCCCC",
"I	c #DBD6D6",
"J	c #D7BFBF",
"K	c #C9C3C3",
"L	c #A3A3A3",
"M	c #959595",
"N	c #727272",
"O	c #303030",
"P	c #313131",
"Q	c #454545",
"R	c #434343",
"S	c #414141",
"T	c #2F2F2F",
"U	c #242424",
"V	c #232323",
"                ",
"                ",
"                ",
"        .       ",
"    +@#$%&      ",
"   *=-;>,')     ",
"  !~{]^/~/(_:<  ",
"  [};|$1$234567 ",
" 6890abcdefg@$h ",
" 6ijklmnop%|[!< ",
"  qrstuvwx'yg.z ",
"  3ABCDbpE-Fzz_ ",
"  GHIJKe%LMNO:P ",
"   QRS.gh#_TUV  ",
"                ",
"                "};
