/* XPM */
static char * mail_receive_all_xpm[] = {
"16 16 33 1",
" 	c None",
".	c #010101",
"+	c #090808",
"@	c #C7C4BF",
"#	c #BFBDB7",
"$	c #BEBBB5",
"%	c #C0BDB8",
"&	c #C1BEB9",
"*	c #C6C2BC",
"=	c #222221",
"-	c #FFFFFF",
";	c #7D7A77",
">	c #EFEFEC",
",	c #000000",
"'	c #706E6A",
")	c #B6B3AD",
"!	c #DCDAD7",
"~	c #797873",
"{	c #069952",
"]	c #0D3F23",
"^	c #116B3C",
"/	c #B6B4AD",
"(	c #BBB8B1",
"_	c #DCDBD8",
":	c #E4E3DF",
"<	c #DDDBD5",
"[	c #C3C0B9",
"}	c #E7E6E3",
"|	c #BEBDBA",
"1	c #A19F9B",
"2	c #BBB9B3",
"3	c #A7A4A0",
"4	c #2F2F2F",
"   ...........  ",
"  .+@###$%%&*=. ",
"  .-;>,,,,,,'). ",
"  .-!~,{{]^,/(. ",
"  .-_:,{{^],<[. ",
"  .-}|,{{]^,12. ",
"  .-,,,{{^],,,. ",
"  .3,^{{{]^]^,. ",
"   .4,^{{^]^,.  ",
"      ,^{]^,    ",
"   ,,,,,^^,,,,, ",
"    ,^{{,,^]^,  ",
"     ,^{{^]^,   ",
"      ,^{]^,    ",
"       ,^^,     ",
"        ,,      "};
