/* XPM */
static char * quicksearch_xpm[] = {
"15 15 12 1",
" 	c None",
".	c #3B4751",
"+	c #31375E",
"@	c #5E69C3",
"#	c #FFFFFF",
"$	c #D0D9E4",
"%	c #9999FF",
"&	c #000000",
"*	c #566268",
"=	c #682522",
"-	c #9A6A21",
";	c #E4D49C",
"               ",
"   .++.        ",
"  +@@@@+       ",
" .@@#$%@.      ",
" +@$%%%$+      ",
" +@%%%$#+      ",
" .@%%$#%+      ",
"  +@$$%&&      ",
"   *&&&&&==    ",
"        &-;=   ",
"        &=-;=  ",
"         &=-;= ",
"          &=-= ",
"           &&  ",
"               "};
