/* XPM */
static char * queue_close_xpm[] = {
"16 16 72 1",
" 	c None",
".	c #4A4A4A",
"+	c #4C4C4C",
"@	c #484848",
"#	c #454545",
"$	c #7A7A7A",
"%	c #E2E2E2",
"&	c #EAEAEA",
"*	c #E5E5E5",
"=	c #CECECE",
"-	c #3D3D3D",
";	c #4F4F4F",
">	c #535353",
",	c #4D4D4D",
"'	c #E3E3E3",
")	c #F9F9F9",
"!	c #F8F8F8",
"~	c #F2F2F2",
"{	c #D9D9D9",
"]	c #7D7D7D",
"^	c #B5B5B5",
"/	c #E8E8E8",
"(	c #E9E9E9",
"_	c #B9B9B9",
":	c #525252",
"<	c #ECECEC",
"[	c #F5F5F5",
"}	c #ACACAC",
"|	c #BFBFBF",
"1	c #AEAEAE",
"2	c #B7B7B7",
"3	c #F6F6F6",
"4	c #F1F1F1",
"5	c #DCDCDC",
"6	c #858585",
"7	c #EDEDED",
"8	c #FFFFFF",
"9	c #FAFAFA",
"0	c #818181",
"a	c #EBEBEB",
"b	c #E7E7E7",
"c	c #474747",
"d	c #494949",
"e	c #E4E4E4",
"f	c #D3D3D3",
"g	c #777777",
"h	c #F7F7F7",
"i	c #FBFBFB",
"j	c #8A8A8A",
"k	c #7F7F7F",
"l	c #DFDFDF",
"m	c #EEEEEE",
"n	c #D0D0D0",
"o	c #7C7C7C",
"p	c #464646",
"q	c #909090",
"r	c #BABABA",
"s	c #B4B4B4",
"t	c #414141",
"u	c #CDCDCD",
"v	c #C6C6C6",
"w	c #969696",
"x	c #626262",
"y	c #ABABAB",
"z	c #404040",
"A	c #3F3F3F",
"B	c #3B3B3B",
"C	c #353535",
"D	c #2A2A2A",
"E	c #343434",
"F	c #515151",
"G	c #363636",
"                ",
"                ",
"                ",
"                ",
"    .+@#        ",
"   $%&*=+-;>;   ",
"  ,')!~{]^/(/_: ",
"  ,<![/}|))1))2-",
"  +(34567890a)bc",
"  de~7fgh8ijk1(d",
"  clm/no<88i9)bc",
"  p{(%nqr)888)s-",
"  t|uv_wxy&3&y@ ",
"   zzABCDE@F@G  ",
"                ",
"                "};
