/* XPM */
static char * error_xpm[] = {
"16 16 191 2",
"  	c None",
". 	c #919191",
"+ 	c #5B5B5B",
"@ 	c #3D3C3C",
"# 	c #3A3A3A",
"$ 	c #555555",
"% 	c #888888",
"& 	c #9D9C9C",
"* 	c #262423",
"= 	c #512007",
"- 	c #9D3E0D",
"; 	c #BF4A0F",
"> 	c #BB490F",
", 	c #95380C",
"' 	c #521E06",
") 	c #1E1A18",
"! 	c #8A8A8A",
"~ 	c #868685",
"{ 	c #291408",
"] 	c #C75213",
"^ 	c #F8691C",
"/ 	c #F6671A",
"( 	c #F46114",
"_ 	c #E95C13",
": 	c #DE5612",
"< 	c #D34F10",
"[ 	c #B0400D",
"} 	c #2C1104",
"| 	c #6B6B6B",
"1 	c #A1A1A1",
"2 	c #27140A",
"3 	c #E45E16",
"4 	c #F8742D",
"5 	c #F67E3B",
"6 	c #F77C39",
"7 	c #F86E24",
"8 	c #F36114",
"9 	c #E65A13",
"0 	c #D8500F",
"a 	c #CB4B0F",
"b 	c #B9420E",
"c 	c #2B1004",
"d 	c #8A8989",
"e 	c #2E2D2D",
"f 	c #BC4B0F",
"g 	c #F86C22",
"h 	c #E09A72",
"i 	c #EFDCD2",
"j 	c #F6A87E",
"k 	c #F77C37",
"l 	c #F76619",
"m 	c #D68052",
"n 	c #E5CEC2",
"o 	c #D87E53",
"p 	c #C0450E",
"q 	c #A0380B",
"r 	c #1C1817",
"s 	c #3C1705",
"t 	c #F26014",
"u 	c #F86D22",
"v 	c #EED3C4",
"w 	c #FEFEFE",
"x 	c #FEFAF8",
"y 	c #F89C6A",
"z 	c #DD895A",
"A 	c #F5F3F1",
"B 	c #F7F7F7",
"C 	c #EDD4C5",
"D 	c #C0430B",
"E 	c #B43E0D",
"F 	c #461805",
"G 	c #858484",
"H 	c #6D6D6D",
"I 	c #82320B",
"J 	c #EB5C13",
"K 	c #F7661A",
"L 	c #F88F56",
"M 	c #FEF6F2",
"N 	c #FDFDFD",
"O 	c #F9F6F4",
"P 	c #F6F3F1",
"Q 	c #D88155",
"R 	c #BF450E",
"S 	c #B23E0D",
"T 	c #772808",
"U 	c #515151",
"V 	c #9B3B0C",
"W 	c #E45913",
"X 	c #F05F14",
"Y 	c #F8874B",
"Z 	c #F7F2EE",
"` 	c #F9F9F9",
" .	c #F4F2F0",
"..	c #DE8659",
"+.	c #C8480E",
"@.	c #BB420E",
"#.	c #AF3C0C",
"$.	c #8D2F0A",
"%.	c #363535",
"&.	c #565656",
"*.	c #94370B",
"=.	c #DB5411",
"-.	c #EC5C13",
";.	c #D88455",
">.	c #F5F2F0",
",.	c #F5F5F5",
"'.	c #F2EFED",
").	c #D5784B",
"!.	c #C2460F",
"~.	c #B6400E",
"{.	c #AA3A0C",
"].	c #892D09",
"^.	c #363636",
"/.	c #707070",
"(.	c #712908",
"_.	c #D04D10",
":.	c #D85212",
"<.	c #CF7B4F",
"[.	c #F5F2F1",
"}.	c #F2EDEA",
"|.	c #F1F1F1",
"1.	c #EEEBEA",
"2.	c #C76F48",
"3.	c #B03D0D",
"4.	c #A4380C",
"5.	c #6C2307",
"6.	c #A7A7A7",
"7.	c #2C1003",
"8.	c #C7480E",
"9.	c #CC4A0D",
"0.	c #E0C6B8",
"a.	c #F7F6F6",
"b.	c #DA8558",
"c.	c #D26D3E",
"d.	c #EEE8E6",
"e.	c #EDEDED",
"f.	c #E1C9BE",
"g.	c #A73609",
"h.	c #9E340A",
"i.	c #391203",
"j.	c #8B8B8B",
"k.	c #353535",
"l.	c #89310A",
"m.	c #BF450F",
"n.	c #CD6E44",
"o.	c #E8C9BA",
"p.	c #D37D52",
"q.	c #C1460E",
"r.	c #BD440E",
"s.	c #C2643C",
"t.	c #DEC0B2",
"u.	c #C07756",
"v.	c #9F340A",
"w.	c #822A08",
"x.	c #201D1C",
"y.	c #A9A9A9",
"z.	c #1B100B",
"A.	c #9F370C",
"B.	c #B5400E",
"C.	c #B63E0B",
"D.	c #B53F0D",
"E.	c #AC3B0D",
"F.	c #A5360A",
"G.	c #902E09",
"H.	c #1F0C05",
"I.	c #959595",
"J.	c #9D9896",
"K.	c #21120C",
"L.	c #7E2B09",
"M.	c #AC3A0C",
"N.	c #A8390C",
"O.	c #A5380C",
"P.	c #A0350A",
"Q.	c #9D330A",
"R.	c #7C2808",
"S.	c #1E0B05",
"T.	c #857F7C",
"U.	c #B3ADAB",
"V.	c #413F3E",
"W.	c #270D03",
"X.	c #5C1F07",
"Y.	c #742708",
"Z.	c #732607",
"`.	c #5D1E07",
" +	c #2D0F03",
".+	c #302F2E",
"++	c #A59E9B",
"@+	c #B2B1B1",
"#+	c #7D7D7D",
"$+	c #5D5D5D",
"%+	c #777777",
"          . + @ # $ %           ",
"      & * = - ; > , ' ) !       ",
"    ~ { ] ^ / ( _ : < [ } |     ",
"  1 2 3 4 5 6 7 8 9 0 a b c d   ",
"  e f g h i j k l m n o p q r   ",
"1 s t u v w x y z A B C D E F G ",
"H I J K L M N O P B A Q R S T U ",
"$ V W X l Y Z ` B  ...+.@.#.$.%.",
"&.*.=.W -.;.>.B ,.'.).!.~.{.].^.",
"/.(._.:.<.[.B  .}.|.1.2.3.4.5.$ ",
"6.7.8.9.0.a. .b.c.d.e.f.g.h.i.j.",
"  k.l.m.n.o.p.q.r.s.t.u.v.w.x.  ",
"  y.z.A.B.C.~.D.S E.F.h.G.H.I.  ",
"    J.K.L.M.{.N.O.P.Q.R.S.T.    ",
"      U.V.W.X.Y.Z.`. +.+++      ",
"          @+#+$++ %+6.          "};
