/* XPM */
static char * insert_file_xpm[] = {
"20 26 148 2",
"  	c None",
". 	c #6A6969",
"+ 	c #343434",
"@ 	c #F6F5F6",
"# 	c #F3F3F2",
"$ 	c #F0EFEF",
"% 	c #EDEDEC",
"& 	c #EAE9EA",
"* 	c #E7E7E6",
"= 	c #E4E4E4",
"- 	c #E1E0E1",
"; 	c #DFDEDE",
"> 	c #DBDBDB",
", 	c #D9D8D8",
"' 	c #D5D5D6",
") 	c #F2F2F2",
"! 	c #EDECEC",
"~ 	c #EAE9E9",
"{ 	c #E6E6E6",
"] 	c #E4E3E3",
"^ 	c #DEDDDD",
"/ 	c #DADADA",
"( 	c #D8D7D8",
"_ 	c #D5D5D5",
": 	c #D2D1D1",
"< 	c #EFEEEF",
"[ 	c #ECEBEB",
"} 	c #E9E9E9",
"| 	c #E5E5E6",
"1 	c #E3E2E3",
"2 	c #E0E0DF",
"3 	c #DDDDDC",
"4 	c #D7D6D6",
"5 	c #D4D4D4",
"6 	c #D1D0D1",
"7 	c #CFCECE",
"8 	c #0C0C0C",
"9 	c #333333",
"0 	c #313131",
"a 	c #2D2D2D",
"b 	c #2B2B2B",
"c 	c #3D3C3D",
"d 	c #DDDCDC",
"e 	c #D9DAD9",
"f 	c #D4D3D3",
"g 	c #CECDCE",
"h 	c #CBCACB",
"i 	c #000000",
"j 	c #BF957D",
"k 	c #8D6650",
"l 	c #412414",
"m 	c #6C3C22",
"n 	c #121212",
"o 	c #D9D8D9",
"p 	c #D6D5D5",
"q 	c #D3D3D2",
"r 	c #D0D0D0",
"s 	c #CDCDCD",
"t 	c #CAC9CA",
"u 	c #C8C7C7",
"v 	c #E8AA84",
"w 	c #A2775C",
"x 	c #9A5630",
"y 	c #D5D4D4",
"z 	c #D2D2D2",
"A 	c #CFCFCF",
"B 	c #CDCCCC",
"C 	c #C7C6C6",
"D 	c #C4C3C3",
"E 	c #060606",
"F 	c #CFCECF",
"G 	c #CCCCCB",
"H 	c #CAC9C9",
"I 	c #C6C5C6",
"J 	c #C4C3C2",
"K 	c #C1C0C0",
"L 	c #0E0E0E",
"M 	c #2C2C2C",
"N 	c #C5C5C5",
"O 	c #C2C2C2",
"P 	c #C0BFBF",
"Q 	c #BCBCBC",
"R 	c #A78A79",
"S 	c #7C4321",
"T 	c #46240B",
"U 	c #101010",
"V 	c #C5C4C5",
"W 	c #C2C1C1",
"X 	c #BFBFBF",
"Y 	c #B9B9B9",
"Z 	c #141414",
"` 	c #C4C4C3",
" .	c #C1C1C1",
"..	c #BFBDBD",
"+.	c #BCBBBB",
"@.	c #B9B7B8",
"#.	c #B6B4B4",
"$.	c #010101",
"%.	c #0A0A0A",
"&.	c #BDBDBD",
"*.	c #BEBDBD",
"=.	c #BBBABA",
"-.	c #B8B8B8",
";.	c #B5B4B4",
">.	c #B2B1B2",
",.	c #3C3C3C",
"'.	c #040404",
").	c #111011",
"!.	c #C3C3C2",
"~.	c #BAB9BA",
"{.	c #B7B6B6",
"].	c #B4B3B3",
"^.	c #B1B0B1",
"/.	c #AEAEAE",
"(.	c #0F0F0F",
"_.	c #BDBCBC",
":.	c #BAB9B9",
"<.	c #B1B0B0",
"[.	c #AEADAE",
"}.	c #ABAAAA",
"|.	c #C7C7C7",
"1.	c #C6C5C5",
"2.	c #BFBFBE",
"3.	c #B9B8B8",
"4.	c #B6B5B5",
"5.	c #B4B2B2",
"6.	c #B1B0AF",
"7.	c #AEADAC",
"8.	c #AAA9A9",
"9.	c #A8A6A7",
"0.	c #BBBBBA",
"a.	c #B5B5B5",
"b.	c #B3B2B2",
"c.	c #B0AEAE",
"d.	c #ADACAC",
"e.	c #A6A6A6",
"f.	c #A4A3A3",
"g.	c #C1BFC0",
"h.	c #BEBDBC",
"i.	c #BBBAB9",
"j.	c #B7B7B7",
"k.	c #B2B1B1",
"l.	c #ADABAB",
"m.	c #A9A9A8",
"n.	c #A6A5A5",
"o.	c #A4A3A2",
"p.	c #A1A0A0",
"q.	c #3B3B3B",
"                                        ",
"                                        ",
"                                        ",
"        . + + + + + + + + + + + + .     ",
"        + @ # $ % & * = - ; > , ' +     ",
"        + ) $ ! ~ { ] - ^ / ( _ : +     ",
"        + < [ } | 1 2 3 / 4 5 6 7 +     ",
"        8 9 0 a b c d e 4 f 6 g h +     ",
"        i j k l m n o p q r s t u +     ",
"        i v w m x 8 y z A B t C D +     ",
"        i w v x m E : F G H I J K +     ",
"  i i i i v w m x i L n M N O P Q +     ",
"    i R v w v x m S T U V W X Q Y +     ",
"      i R v w m x T Z `  ...+.@.#.+     ",
"        $.R v x T %.&.K *.=.-.;.>.+     ",
"        ,.'.R T ).!.P *.~.{.].^./.+     ",
"        + u i (.J X _.:.{.].<.[.}.+     ",
"        + |.1.P 2.+.3.4.5.6.7.8.9.+     ",
"        + ` K *.0.3.a.b.c.d.8.e.f.+     ",
"        + g.h.i.j.;.k.c.l.m.n.o.p.+     ",
"        . + + + + + q.+ + + + + + .     ",
"                                        ",
"                                        ",
"                                        ",
"                                        ",
"                                        "};
