/* XPM */
static char * address_search_xpm[] = {
"16 16 206 2",
"  	c None",
". 	c #BBCAD1",
"+ 	c #81A3B3",
"@ 	c #4C788A",
"# 	c #003F68",
"$ 	c #002441",
"% 	c #00223E",
"& 	c #003A61",
"* 	c #477388",
"= 	c #7F9FAE",
"- 	c #55859E",
"; 	c #0E2B3D",
"> 	c #004066",
", 	c #0267A1",
"' 	c #0172B2",
") 	c #0069AA",
"! 	c #005990",
"~ 	c #002F4F",
"{ 	c #0D2431",
"] 	c #507E96",
"^ 	c #284D62",
"/ 	c #023250",
"( 	c #1096DF",
"_ 	c #1FB0F9",
": 	c #29B5FB",
"< 	c #22B3FC",
"[ 	c #0BA7F8",
"} 	c #019AF0",
"| 	c #008DDE",
"1 	c #006EB3",
"2 	c #001E34",
"3 	c #224354",
"4 	c #02314F",
"5 	c #118DCF",
"6 	c #3ABBF8",
"7 	c #8AD8F9",
"8 	c #B6EAFD",
"9 	c #B0E9FD",
"0 	c #79D3F9",
"a 	c #25AEF4",
"b 	c #0091E4",
"c 	c #0087D8",
"d 	c #005D9B",
"e 	c #001C30",
"f 	c #4F7B93",
"g 	c #81A4B3",
"h 	c #0E2A3C",
"i 	c #0992DE",
"j 	c #33B9FA",
"k 	c #DFF9FE",
"l 	c #F8FFFF",
"m 	c #E7FAFE",
"n 	c #DEF8FE",
"o 	c #E4FCFE",
"p 	c #CCF4FD",
"q 	c #27A8ED",
"r 	c #018BDC",
"s 	c #007BC9",
"t 	c #005C9A",
"u 	c #0C1E29",
"v 	c #7C9CAA",
"w 	c #4D798A",
"x 	c #003C62",
"y 	c #11ADFC",
"z 	c #88D9FB",
"A 	c #F2FEFF",
"B 	c #DAF6FD",
"C 	c #8DDBF6",
"D 	c #74D2F7",
"E 	c #B4EAFC",
"F 	c #DCFAFE",
"G 	c #7CD1F4",
"H 	c #0D92DE",
"I 	c #0072BB",
"J 	c #3D6F85",
"K 	c #00406A",
"L 	c #01619A",
"M 	c #26B0F7",
"N 	c #BDEBFC",
"O 	c #D7F6FE",
"P 	c #72D1F7",
"Q 	c #3FBDF5",
"R 	c #27B4F8",
"S 	c #3AB9F8",
"T 	c #BCEDFC",
"U 	c #ADE8FB",
"V 	c #229CE2",
"W 	c #007AC8",
"X 	c #0070BA",
"Y 	c #003962",
"Z 	c #002A47",
"` 	c #0069A9",
" .	c #26ADF5",
"..	c #BBEBFC",
"+.	c #C9F1FD",
"@.	c #4EC3F8",
"#.	c #1FB1F9",
"$.	c #11ACFB",
"%.	c #26B2F9",
"&.	c #B2EAFC",
"*.	c #ADE9FB",
"=.	c #239CE2",
"-.	c #0078C3",
";.	c #006EB6",
">.	c #003F6D",
",.	c #000F1C",
"'.	c #0063A0",
").	c #129EED",
"!.	c #8EDAF8",
"~.	c #D6F9FE",
"{.	c #8DDCFB",
"].	c #20B1FB",
"^.	c #1FACF5",
"/.	c #81D2F4",
"(.	c #C9F5FD",
"_.	c #95DAF5",
":.	c #188DD3",
"<.	c #0073BC",
"[.	c #0069B1",
"}.	c #003C68",
"|.	c #000D19",
"1.	c #003C64",
"2.	c #005287",
"3.	c #0291E3",
"4.	c #3AB3F1",
"5.	c #D2F8FE",
"6.	c #CEF6FD",
"7.	c #A3E6FC",
"8.	c #A3E3FA",
"9.	c #C7F4FD",
"0.	c #CAF6FE",
"a.	c #A5E5F8",
"b.	c #339FDB",
"c.	c #006EB7",
"d.	c #0065AC",
"e.	c #003357",
"f.	c #002642",
"g.	c #4A7688",
"h.	c #002B49",
"i.	c #0081D1",
"j.	c #0088D8",
"k.	c #3DB1ED",
"l.	c #92DAF6",
"m.	c #B2ECFD",
"n.	c #B0ECFD",
"o.	c #93DBF5",
"p.	c #81D2F3",
"q.	c #B9F0FC",
"r.	c #ACEBFB",
"s.	c #248AC8",
"t.	c #005FA2",
"u.	c #001628",
"v.	c #396C83",
"w.	c #80A1B0",
"x.	c #0E2432",
"y.	c #0064A7",
"z.	c #007DCB",
"A.	c #0383D2",
"B.	c #1790D9",
"C.	c #31A5E3",
"D.	c #31A5E1",
"E.	c #188DD2",
"F.	c #0F85CC",
"G.	c #78CBED",
"H.	c #AFEDFC",
"I.	c #55AFDC",
"J.	c #004B7F",
"K.	c #0B1B24",
"L.	c #7998A7",
"M.	c #51819A",
"N.	c #005790",
"O.	c #0074BF",
"P.	c #0075C0",
"Q.	c #0074BD",
"R.	c #006FB8",
"S.	c #006AB3",
"T.	c #076EB2",
"U.	c #2D8FC4",
"V.	c #015387",
"W.	c #00111F",
"X.	c #4D748C",
"Y.	c #244455",
"Z.	c #001A2D",
"`.	c #005490",
" +	c #0069B0",
".+	c #0062A7",
"++	c #005C9D",
"@+	c #004577",
"#+	c #1E3C4B",
"$+	c #507D96",
"%+	c #0D1F29",
"&+	c #001C32",
"*+	c #00365C",
"=+	c #003B67",
"-+	c #003A65",
";+	c #003255",
">+	c #001528",
",+	c #0C1B24",
"'+	c #4D768C",
")+	c #7E99A7",
"!+	c #42697C",
"~+	c #002B4A",
"{+	c #00101F",
"]+	c #002744",
"^+	c #3D6579",
"/+	c #7B95A2",
"      . + @ # $ % & * =         ",
"      - ; > , ' ) ! ~ { ]       ",
"    ^ / ( _ : < [ } | 1 2 3     ",
"  - 4 5 6 7 8 9 0 a b c d e f   ",
"g h i j k l m n o p q r s t u v ",
"w x y z A B C D E F G H s I 2 J ",
"K L M N O P Q R S T U V W X Y Z ",
"$ `  ...+.@.#.$.%.&.*.=.-.;.>.,.",
"% '.).!.~.{.].^./.(._.:.<.[.}.|.",
"1.2.3.4.5.6.7.8.9.0.a.b.c.d.e.f.",
"g.h.i.j.k.l.m.n.o.p.q.r.s.t.u.v.",
"w.x.y.z.A.B.C.D.E.F.G.H.I.J.K.L.",
"  M.e N.O.P.P.Q.R.S.T.U.V.W.X.  ",
"    Y.Z.`.[.S. +d..+++@+W.#+    ",
"      $+%+&+*+=+-+;+>+,+'+      ",
"        )+!+~+{+,.]+^+/+        "};
