/* XPM */
static char * mime_text_enriched_xpm[] = {
"24 24 137 2",
"  	c None",
". 	c #979797",
"+ 	c #8F8F8F",
"@ 	c #8E8E8E",
"# 	c #A0A0A0",
"$ 	c #656565",
"% 	c #000000",
"& 	c #6F6F6F",
"* 	c #767676",
"= 	c #323232",
"- 	c #ECECEC",
"; 	c #FAFAFA",
"> 	c #F9F9F9",
", 	c #F8F8F8",
"' 	c #F7F7F7",
") 	c #F6F6F6",
"! 	c #F5F5F5",
"~ 	c #F4F4F4",
"{ 	c #959595",
"] 	c #1A1A1A",
"^ 	c #888888",
"/ 	c #757575",
"( 	c #F1F1F1",
"_ 	c #EEEEEE",
": 	c #E9E9E9",
"< 	c #E7E7E7",
"[ 	c #E6E6E6",
"} 	c #E5E5E5",
"| 	c #E4E4E4",
"1 	c #E3E3E3",
"2 	c #E2E2E2",
"3 	c #C4C4C4",
"4 	c #737373",
"5 	c #616161",
"6 	c #7E7E7E",
"7 	c #F0F0F0",
"8 	c #CCCCCC",
"9 	c #C7C7C7",
"0 	c #C6C6C6",
"a 	c #C5C5C5",
"b 	c #D3D3D3",
"c 	c #DDDDDD",
"d 	c #C3C3C3",
"e 	c #D5D5D5",
"f 	c #353535",
"g 	c #707070",
"h 	c #F3F3F3",
"i 	c #C2C2C2",
"j 	c #BCBCBC",
"k 	c #BBBBBB",
"l 	c #BABABA",
"m 	c #CACACA",
"n 	c #D8D8D8",
"o 	c #B8B8B8",
"p 	c #CFCFCF",
"q 	c #EDEDED",
"r 	c #E0E0E0",
"s 	c #C1C1C1",
"t 	c #C9C9C9",
"u 	c #D7D7D7",
"v 	c #B7B7B7",
"w 	c #CECECE",
"x 	c #343434",
"y 	c #EBEBEB",
"z 	c #EAEAEA",
"A 	c #C0C0C0",
"B 	c #B9B9B9",
"C 	c #C8C8C8",
"D 	c #B6B6B6",
"E 	c #CDCDCD",
"F 	c #7F7F7F",
"G 	c #D4CDCD",
"H 	c #BAAAAA",
"I 	c #B8A8A8",
"J 	c #B7A7A7",
"K 	c #CCC4C4",
"L 	c #D3C3C3",
"M 	c #CF2D2D",
"N 	c #CBBBBB",
"O 	c #E8E8E8",
"P 	c #D2C2C2",
"Q 	c #CABABA",
"R 	c #BFBFBF",
"S 	c #D1C1C1",
"T 	c #C8B8B8",
"U 	c #C26D6D",
"V 	c #C16C6C",
"W 	c #C26565",
"X 	c #333333",
"Y 	c #E1E1E1",
"Z 	c #D6D6D6",
"` 	c #D2D2D2",
" .	c #CFC0C0",
"..	c #C7B7B7",
"+.	c #DFDFDF",
"@.	c #DBDBDB",
"#.	c #626262",
"$.	c #DADADA",
"%.	c #B4B4B4",
"&.	c #B3B3B3",
"*.	c #B1B1B1",
"=.	c #CFC7C7",
"-.	c #B4A4A4",
";.	c #B3A3A3",
">.	c #C6BEBE",
",.	c #7D7D7D",
"'.	c #B2B2B2",
").	c #B0B0B0",
"!.	c #AEAEAE",
"~.	c #AFAFAF",
"{.	c #7C7C7C",
"].	c #ADADAD",
"^.	c #7B7B7B",
"/.	c #B5B5B5",
"(.	c #636363",
"_.	c #777777",
":.	c #D1D1D1",
"<.	c #D0D0D0",
"[.	c #D4D4D4",
"}.	c #CBCBCB",
"|.	c #303030",
"1.	c #717171",
"2.	c #6D6D6D",
"3.	c #434343",
"4.	c #DEDEDE",
"5.	c #D9D9D9",
"6.	c #989898",
"7.	c #1F1F1F",
"8.	c #808080",
"9.	c #4D4D4D",
"0.	c #141414",
"a.	c #2D2D2D",
"b.	c #2C2C2C",
"c.	c #2B2B2B",
"d.	c #050505",
"e.	c #575757",
"f.	c #727272",
"                                                ",
"      . + @ @ @ @ @ @ @ @ @ @ @ @ @ #           ",
"    $ % % % % % % % % % % % % % % % % &         ",
"  * = - ; > , ' ' ) ! ! ! ! ~ ~ ~ ~ { ] ^       ",
"  $ / ' ( ( _ : < [ } < : | 1 2 2 } 3 = 4       ",
"  5 6 ~ 7 7 } 8 9 0 a b c 0 3 d d e 0 f g       ",
"  5 6 h _ _ 2 i j k l m n l o o o p a f g       ",
"  5 6 ( q q r s l l o t u l o v v w 3 x &       ",
"  5 6 y z - r A l B v C u l D D D E i x g       ",
"  5 F w c y G H I J J K G H I J J K s x &       ",
"  5 F - z z L M M M M N L M M M M N A x &       ",
"  5 F y : O P M M M M Q P M M M M Q R x g       ",
"  5 F O < < S J J J J T S U V V W T j X g       ",
"  5 6 O [ } Y Z b ` ` u  .M M M M ..j X g       ",
"  5 6 +.r | @.a A A R m  .M M M M ..k X &       ",
"  #.6 p $.| u B %.&.*.s =.-.;.;.;.>.B X g       ",
"  5 ,.| 2 2 Z o '.'.).A w '.).!.~.3 B X &       ",
"  5 {.1 Y Y Z o *.).~.A E *.!.].].d o X &       ",
"  #.^.Y r r e l /./.%.s E &.).~.).3 v X &       ",
"  (._.2 +.+.@.b ` :.<.[.e 8 }.m m :.'.|.1.      ",
"  2.3.- O O < [ } 2 r 4.@.$.5.Z e [.6.7.8.      ",
"    9.0.a.|.a.b.c.c.c.c.b.b.b.b.b.b.d.e.        ",
"      {.f.1.1.1.1.1.1.1.1.1.1.1.1.1.^           ",
"                                                "};
