/* XPM */
static char * mail_xpm[] = {
"28 28 33 1",
" 	c None",
".	c #DBA35E",
"+	c #D98C2F",
"@	c #1B2228",
"#	c #4B5055",
"$	c #566268",
"%	c #696D6E",
"&	c #828485",
"*	c #8B8F94",
"=	c #ACB3B5",
"-	c #FFFFFF",
";	c #D3D7DA",
">	c #B9C3CE",
",	c #9A9B9D",
"'	c #303338",
")	c #D16212",
"!	c #FDF4CC",
"~	c #FAF6EF",
"{	c #C6CAD6",
"]	c #F3F7FB",
"^	c #9A6A21",
"/	c #D79190",
"(	c #C0C0C0",
"_	c #E4D49C",
":	c #A4A6A9",
"<	c #AEBBC6",
"[	c #E7D5C9",
"}	c #FDFDFA",
"|	c #F5F2E2",
"1	c #EFEEEE",
"2	c #C1C2C2",
"3	c #DFE0E1",
"4	c #E8E7E8",
"                            ",
"                            ",
"                            ",
"       ...                  ",
"     .+.....@#$##%&*=       ",
"    .+++.+...----;>,'@''*   ",
"   .+)+!~.+...{]]]]]##$$'&  ",
"  .+)^+!-/++.+.(;;;;'$*%#@& ",
"  .+)^)_-_+.++)'@@#''&:,#@% ",
"  .++.^_-__~+++<(:**=&:&#@% ",
"  .+[-__-!~!+^+*****&%:&#@% ",
"  .^+!-}---.+^.&&&&&%%:%#@% ",
"  .^^)_---_+^^%$$%%%%%:$'@% ",
"   +^^).}|.)^_;{=*$%%%:$'@% ",
"   @+^^).+)^/1----(%$&,#'@* ",
"   @,&^^^^.2------3%%&,''@, ",
"  %$=$#$$;--------(*$&*''@* ",
"  '%:%%*:---------=*$&%'@@  ",
" =@,*&&,,:({4-----:*$*$'@@  ",
" :@%&&&&&*,:::=(;4:%$&$'@'  ",
"  #@@@'#%%%$%&*,===%#$'@@$  ",
"   =%#'@@@'##$$$#$%$##'@@%  ",
"       ,%#@@@@@''#'#''@@@*  ",
"           ,%$'@@@@@@@@@@   ",
"               :,%$#@@@@%   ",
"                     =,:    ",
"                            ",
"                            "};
