/* XPM */
static char * mail_send_queue_xpm[] = {
"28 28 42 1",
" 	c None",
".	c #A3D1A0",
"+	c #55AE53",
"@	c #73BB73",
"#	c #3F8943",
"$	c #FBFDFB",
"%	c #E3F2E3",
"&	c #C9D1CA",
"*	c #FFFFFF",
"=	c #8B9AA7",
"-	c #758995",
";	c #3B4751",
">	c #161B25",
",	c #83909C",
"'	c #566268",
")	c #A3B1BC",
"!	c #B9C3CE",
"~	c #C9D2DA",
"{	c #FAFAFA",
"]	c #D4EAD2",
"^	c #F4F9F3",
"/	c #AEBBC6",
"(	c #F3F7FB",
"_	c #E4EDF5",
":	c #303338",
"<	c #657683",
"[	c #C6CAD6",
"}	c #E8E7E8",
"|	c #DAE3EB",
"1	c #98A7B4",
"2	c #DFE0E1",
"3	c #F2F3F3",
"4	c #D0D9E4",
"5	c #9AA5B0",
"6	c #77828E",
"7	c #BDC6CE",
"8	c #35404C",
"9	c #9EA9B4",
"0	c #00031A",
"a	c #EBEBEB",
"b	c #CED5DE",
"c	c #E4E9EB",
"                            ",
"                            ",
"                 ...        ",
"               .++@@@.      ",
"              @+#.$%@@@     ",
"             @++&***.@@@    ",
"    =-;;>>>>.+@%*$***@@+@   ",
"  ,>',)!~{{{.+]*&.*%^]+++   ",
"  ;'/{{{{(__.+@.#.*..^+++   ",
"  :<'[{_____@+###.*.+@+#+   ",
"  >,<'}____|.###+]*.+++#@   ",
"  >1,<){_||22###+23.+###>   ",
"  >!11<1_|||4.###+++###+>   ",
"  >!!1<<~44444@########1>   ",
"  >5666654444~~.+###+-!1>   ",
"  65555578-,==,-<'':<!!1>   ",
" 55990a7776------,-;'4!1>   ",
" 65aa0777a8----,-,-=-1!1>   ",
" 65a707bba0=-----,)44<)1>   ",
" 6577000ba0[!///![[[[!',:   ",
" 657bbbbca8///////////=;:   ",
" 57bbbccca61111111,-<':>-   ",
"  8aaaaaa0>>>>>>>>:;;<,1    ",
"   680086                   ",
"                            ",
"                            ",
"                            ",
"                            "};
