/* XPM */ 
static char * deleted_xpm[] = {
"16 16 90 1",
" 	c None",
"!	c black",
"#	c #FF4113",
"$	c #FF3808",
"%	c #FF3502",
"&	c #FF4718",
"'	c #FF3300",
"(	c #FF9074",
")	c #FF3E0E",
"*	c #FF3704",
"+	c #FF896C",
",	c #FFFDFC",
"-	c #FFDAD2",
".	c #FF4010",
"/	c #FF3604",
"0	c #FF3503",
"1	c #FF3E0D",
"2	c #FFD6CB",
"3	c #FFF8F6",
"4	c #FFD5CA",
"5	c #FF3D0D",
"6	c #FF9277",
"7	c #FF6F4B",
"8	c #FF3401",
"9	c #FFD1C6",
":	c #FFF1EE",
";	c #FFCFC3",
"<	c #FF3F0F",
"=	c #FFA58E",
">	c #FFAE99",
"?	c #FF5327",
"@	c #FFCEC2",
"A	c #FFE9E4",
"B	c #FFC8B9",
"C	c #FF3F0E",
"D	c #FFAA95",
"E	c #FFB6A4",
"F	c #FF5E35",
"G	c #FF3402",
"H	c #FFC7B9",
"I	c #FFE0D9",
"J	c #FFBFAF",
"K	c #FFAE9A",
"L	c #FFBCAB",
"M	c #FF6139",
"N	c #FFB09C",
"O	c #FFBFB0",
"P	c #FF633B",
"Q	c #FFB5A3",
"R	c #FFCABC",
"S	c #FFC2B3",
"T	c #FF6E4A",
"U	c #FFB19E",
"V	c #FFC2B2",
"W	c #FFBBAA",
"X	c #FF9D85",
"Y	c #FF3B0A",
"Z	c #FF3603",
"[	c #FFAB96",
"\	c #FFBCAC",
"]	c #FF6D49",
"^	c #FF9B82",
"_	c #FFA993",
"`	c #FF8D71",
"a	c #FF3908",
"b	c #FFA690",
"c	c #FFB7A6",
"d	c #FF623A",
"e	c #FF8B6E",
"f	c #FF9479",
"g	c #FF7857",
"h	c #FF3806",
"i	c #FF3501",
"j	c #FF3D0C",
"k	c #FF9F86",
"l	c #FF5F37",
"m	c #FF7755",
"n	c #FF7856",
"o	c #FF5E36",
"p	c #FF3400",
"q	c #FF8D70",
"r	c #FFA68F",
"s	c #FF5C32",
"t	c #FF3805",
"u	c #FF5328",
"v	c #FF7452",
"w	c #FF5024",
"x	c #FF3301",
"y	c #FF3705",
"z	c #FF3200",
" #$%            "
"&'()*           "
"$+,-./      0'' "
"%1234./    /5678"
" /.9:;</  /)=>?%"
"  /<@ABC//)DEFG "
"   /<HIJ1<KLMG  "
"    /)J2ENOPG   "
"     /1QRST'    "
"     /<UVWXYZ   "
"    /)[\]^_`a0  "
"   /1bcd'Yefghi "
"  0jkNlG 0amno%p"
"  'qrsG   itouh'"
"  'vw8     x%y'z"
"   'G       ''' "};