/* XPM */
static char *outbox_close_hrm[]={
"16 16 3 1",
". c None",
"a c #0000c0",
"# c #c00000",
"................",
"................",
".......##.......",
"......####......",
".....######.....",
"....########....",
".......##.......",
".......##.......",
"..###..##..aaa..",
"..###......aaa..",
"..###......aaa..",
"..######aaaaaa..",
"..######aaaaaa..",
"...#####aaaaa...",
"................",
"................"};
