/* XPM */
static char * mime_gpg_expired_xpm[] = {
"24 24 347 2",
"  	c None",
". 	c #848484",
"+ 	c #4E4E4E",
"@ 	c #545454",
"# 	c #8B8B8B",
"$ 	c #939393",
"% 	c #272727",
"& 	c #0F0F0F",
"* 	c #040302",
"= 	c #261B02",
"- 	c #1A1201",
"; 	c #030303",
"> 	c #101010",
", 	c #313131",
"' 	c #929292",
") 	c #9A9A9A",
"! 	c #A7A7A7",
"~ 	c #4F4F4F",
"{ 	c #000000",
"] 	c #281C02",
"^ 	c #AE7A0A",
"/ 	c #E9A30D",
"( 	c #F0A80E",
"_ 	c #E8A40D",
": 	c #CB8F0B",
"< 	c #7A5606",
"[ 	c #0C0901",
"} 	c #757575",
"| 	c #747474",
"1 	c #040404",
"2 	c #624505",
"3 	c #F2AA0F",
"4 	c #FEB414",
"5 	c #FEB51A",
"6 	c #FEB20F",
"7 	c #F5AC0E",
"8 	c #E9A40D",
"9 	c #DC9B0B",
"0 	c #BB8309",
"a 	c #2B1F02",
"b 	c #242424",
"c 	c #D1D1D1",
"d 	c #D8D8D8",
"e 	c #D6D6D6",
"f 	c #D3D3D3",
"g 	c #7F7F7F",
"h 	c #1B1B1B",
"i 	c #181818",
"j 	c #291D02",
"k 	c #F1AA0E",
"l 	c #E3B044",
"m 	c #D9CAAD",
"n 	c #EDBF64",
"o 	c #FEBC33",
"p 	c #FEB310",
"q 	c #C3A565",
"r 	c #C7B793",
"s 	c #D39815",
"t 	c #A97808",
"u 	c #0A0803",
"v 	c #5A5A5A",
"w 	c #E9E9E9",
"x 	c #E8E8E8",
"y 	c #BFBFBF",
"z 	c #373737",
"A 	c #6C6C6C",
"B 	c #070707",
"C 	c #B17D0A",
"D 	c #FAAF0F",
"E 	c #DBD3C1",
"F 	c #FCF9F2",
"G 	c #FAF9F5",
"H 	c #E7BD6A",
"I 	c #C8B68D",
"J 	c #F7F0DE",
"K 	c #F5EBD3",
"L 	c #D3B676",
"M 	c #C58C09",
"N 	c #5C4104",
"O 	c #212121",
"P 	c #E2E2E2",
"Q 	c #E6E6E6",
"R 	c #C4C4C4",
"S 	c #3B3B3B",
"T 	c #676767",
"U 	c #808080",
"V 	c #070500",
"W 	c #E5A10D",
"X 	c #F9AF0F",
"Y 	c #E1BF79",
"Z 	c #FCF9F3",
"` 	c #FEFDFA",
" .	c #FAF7F1",
"..	c #FAF5E9",
"+.	c #F3EBD8",
"@.	c #D79E21",
"#.	c #8A6305",
"$.	c #B8B8B8",
"%.	c #E5E5E5",
"&.	c #C2C2C2",
"*.	c #3A3A3A",
"=.	c #494949",
"-.	c #2D2002",
";.	c #E5A10C",
">.	c #F3AA0E",
",.	c #FEB311",
"'.	c #D9C08A",
").	c #FBF8EF",
"!.	c #FAF6EC",
"~.	c #F9F3E4",
"{.	c #F3ECDB",
"].	c #E4AC32",
"^.	c #D1940A",
"/.	c #C28A08",
"(.	c #AB7907",
"_.	c #010100",
":.	c #7D7D7D",
"<.	c #E4E4E4",
"[.	c #C0C0C0",
"}.	c #2A1D02",
"|.	c #DD9C0C",
"1.	c #F3AB0E",
"2.	c #D0B77F",
"3.	c #F9F3E6",
"4.	c #F8F2E3",
"5.	c #F7EFDD",
"6.	c #F2EAD6",
"7.	c #C99E3D",
"8.	c #CB9009",
"9.	c #BD8608",
"0.	c #A47506",
"a.	c #E3E3E3",
"b.	c #393939",
"c.	c #878787",
"d.	c #040301",
"e.	c #CB8F0A",
"f.	c #C7AA6D",
"g.	c #F6EDDA",
"h.	c #F6EEDA",
"i.	c #F1EAD8",
"j.	c #F5EBD6",
"k.	c #F3E8CE",
"l.	c #F1E5C9",
"m.	c #C19329",
"n.	c #B58107",
"o.	c #7B5804",
"p.	c #BABABA",
"q.	c #D9D9D9",
"r.	c #9A9A99",
"s.	c #4C4B45",
"t.	c #22211C",
"u.	c #0A0A0A",
"v.	c #7E5A06",
"w.	c #D0930A",
"x.	c #D8CDB3",
"y.	c #F4E9CE",
"z.	c #F1E8D1",
"A.	c #D4A130",
"B.	c #C1A66A",
"C.	c #F2E5C7",
"D.	c #F0E2BF",
"E.	c #C5AE77",
"F.	c #AD7B06",
"G.	c #3D2C02",
"H.	c #1E1E1E",
"I.	c #DFDFDF",
"J.	c #D5D5D5",
"K.	c #7D7D7A",
"L.	c #625D40",
"M.	c #9A915A",
"N.	c #7B7145",
"O.	c #302C1C",
"P.	c #A0A0A0",
"Q.	c #222222",
"R.	c #0F0A01",
"S.	c #B17E07",
"T.	c #BD9332",
"U.	c #CBBA92",
"V.	c #C99A33",
"W.	c #C78D09",
"X.	c #B89B58",
"Y.	c #C6B58B",
"Z.	c #B18213",
"`.	c #785604",
" +	c #C7C7C7",
".+	c #61605D",
"++	c #827B4B",
"@+	c #D5C774",
"#+	c #DBC86F",
"$+	c #C7B05A",
"%+	c #8E804C",
"&+	c #221F16",
"*+	c #646464",
"=+	c #121212",
"-+	c #2C1F02",
";+	c #AA7906",
">+	c #BC8608",
",+	c #BC8508",
"'+	c #B88307",
")+	c #B27F07",
"!+	c #AB7A06",
"~+	c #805B04",
"{+	c #100C00",
"]+	c #2E2E2E",
"^+	c #A7A7A6",
"/+	c #4D4B40",
"(+	c #ABA15F",
"_+	c #E4D377",
":+	c #D5C06A",
"<+	c #C9B055",
"[+	c #C8B15D",
"}+	c #AD9F65",
"|+	c #2A271B",
"1+	c #696969",
"2+	c #575757",
"3+	c #282828",
"4+	c #120D01",
"5+	c #7B5704",
"6+	c #A67706",
"7+	c #AC7B06",
"8+	c #A97905",
"9+	c #956A05",
"0+	c #563E02",
"a+	c #080704",
"b+	c #2B2B2B",
"c+	c #7A7A77",
"d+	c #625D3E",
"e+	c #C4B768",
"f+	c #E6D479",
"g+	c #CEB760",
"h+	c #C9B056",
"i+	c #C3AD5B",
"j+	c #AA9A5B",
"k+	c #6D633D",
"l+	c #1E1C14",
"m+	c #6D6D6D",
"n+	c #4B4B4B",
"o+	c #050403",
"p+	c #1A1301",
"q+	c #120D00",
"r+	c #141414",
"s+	c #525252",
"t+	c #696866",
"u+	c #837B4B",
"v+	c #D7C971",
"w+	c #E1CE76",
"x+	c #CCB45B",
"y+	c #C9B158",
"z+	c #C0AB5D",
"A+	c #A89757",
"B+	c #5F5635",
"C+	c #A2A2A2",
"D+	c #DBDBDB",
"E+	c #B0B0B0",
"F+	c #6F6F6F",
"G+	c #777777",
"H+	c #B6B6B6",
"I+	c #545349",
"J+	c #9C9253",
"K+	c #E8D97B",
"L+	c #D9C56E",
"M+	c #CAB258",
"N+	c #C8B056",
"O+	c #C0AC66",
"P+	c #A39152",
"Q+	c #534B2E",
"R+	c #21211E",
"S+	c #AEAEAE",
"T+	c #E1E1E1",
"U+	c #E0E0E0",
"V+	c #DADADA",
"W+	c #4C4B49",
"X+	c #9E9C85",
"Y+	c #F4F0CC",
"Z+	c #E3D6A1",
"`+	c #CBB35C",
" @	c #C6B05A",
".@	c #B7A664",
"+@	c #8A7C45",
"@@	c #4C4734",
"#@	c #2B2B2A",
"$@	c #DEDEDE",
"%@	c #A1A1A1",
"&@	c #52524C",
"*@	c #EAEADB",
"=@	c #FAFAF1",
"-@	c #F9F8EE",
";@	c #D7CA96",
">@	c #AF9D5A",
",@	c #827543",
"'@	c #535041",
")@	c #7C7C7C",
"!@	c #3F3F3F",
"~@	c #4B4B4A",
"{@	c #B8B9AE",
"]@	c #FBFBF4",
"^@	c #FCFDF9",
"/@	c #FAF9F1",
"(@	c #D2CAA7",
"_@	c #786D40",
":@	c #49473A",
"<@	c #B4B4B4",
"[@	c #6B6B6B",
"}@	c #666666",
"|@	c #8E8E8E",
"1@	c #434340",
"2@	c #C3C4BF",
"3@	c #FAFAF7",
"4@	c #F1F1E8",
"5@	c #D8D8C8",
"6@	c #797764",
"7@	c #4A4942",
"8@	c #B9B9B9",
"9@	c #343434",
"0@	c #787878",
"a@	c #D2D2D2",
"b@	c #C3C3C3",
"c@	c #505050",
"d@	c #111111",
"e@	c #3A3A39",
"f@	c #A7A8A1",
"g@	c #75756D",
"h@	c #484845",
"i@	c #CBCBCB",
"j@	c #C9C9C9",
"k@	c #8A8A8A",
"l@	c #202020",
"m@	c #7B7B7B",
"n@	c #5D5D5D",
"o@	c #0D0D0D",
"p@	c #171717",
"q@	c #5C5C5C",
"r@	c #2D2D2D",
"s@	c #222221",
"t@	c #30302F",
"u@	c #565655",
"v@	c #323231",
"w@	c #474747",
"x@	c #161616",
"y@	c #050505",
"z@	c #5E5E5E",
"A@	c #8C8C8C",
"B@	c #818181",
"C@	c #A3A3A3",
"D@	c #1F1F1E",
"E@	c #555555",
"F@	c #7E7E7E",
"            . + @ #                             ",
"      $ % & * = - ; > , ' ) ) ) ) ) !           ",
"    ~ { ] ^ / ( _ : < [ { { { { { { { }         ",
"  | 1 2 3 4 5 6 7 8 9 0 a b c d e f g h .       ",
"  i j k l m n o p q r s t u v w x x y z A       ",
"  B C D E F G H I J K L M N O P x Q R S T       ",
"U V W X Y Z `  ...J +.@.M #.> $.Q %.&.*.T       ",
"=.-.;.>.,.'.).!.~.{.].^./.(._.:.%.<.[.*.T       ",
"+ }.|.8 1.2.3.4.5.6.7.8.9.0._.U <.a.y b.T       ",
"c.d.e.|.f.g.h.i.j.k.l.m.n.o.> p.P q.r.s.t.!     ",
"  u.v.w.x.y.z.A.B.C.D.E.F.G.H.I.J.K.L.M.N.O.P.  ",
"  Q.R.S.T.U.V.8.W.X.Y.Z.`.B T  +.+++@+#+$+%+&+  ",
"  *+=+-+;+>+9.,+'+)+!+~+{+]+^+/+(+_+:+<+[+}+|+  ",
"  1+2+3+4+5+6+7+8+9+0+a+b+c+d+e+f+g+h+i+j+k+l+  ",
"  1+m+e n+=+o+p+q+1 r+s+t+u+v+w+x+y+z+A+B+&+C+  ",
"  1+m+J.D+I.E+F+G+H+y I+J+K+L+M+N+O+P+Q+R+S+    ",
"  1+m+a.a.a.T+T+U+V+W+X+Y+Z+`+ @.@+@@@#@T       ",
"  1+m+a.P P U+I.$@%@&@*@=@-@;@>@,@'@)@!@T       ",
"  1+A T+U+T+I.$@c ~@{@]@^@/@(@_@:@! <@z T       ",
"  [@}@U+U+U+$@D+|@1@2@3@4@5@6@7@8@J.S+9@1+      ",
"  0@z a@$@I.D+b@c@d@e@f@g@h@*+<@i@j@k@l@m@      ",
"    n@o@p@i p@q@r@s@t@u@v@w@~ x@x@x@y@z@        ",
"      A@B@U U C@D@E@m@F@. U U U U U $           ",
"                                                "};
