/* XPM */
static char * quicksearch_xpm[] = {
"12 12 41 1",
" 	c None",
".	c #000000",
"+	c #797979",
"@	c #96A4B2",
"#	c #A4B3C1",
"$	c #8EA2B5",
"%	c #B2BDC8",
"&	c #E8EBEE",
"*	c #E9EDF2",
"=	c #D0DBE5",
"-	c #88A1BB",
";	c #97A7B6",
">	c #E9ECF0",
",	c #ECF1F6",
"'	c #D8E1EB",
")	c #B1C3D6",
"!	c #88A2BE",
"~	c #839BB6",
"{	c #A4B2BF",
"]	c #EAEEF2",
"^	c #D7E0EA",
"/	c #B3C5D8",
"(	c #90A9C3",
"_	c #8AA3BF",
":	c #90A6BF",
"<	c #8496A8",
"[	c #C7D2DE",
"}	c #B3C4D6",
"|	c #88A3BF",
"1	c #97ADC5",
"2	c #90A6BC",
"3	c #788DA3",
"4	c #849CB6",
"5	c #8AA2BC",
"6	c #99AEC5",
"7	c #A5B7CA",
"8	c #75889C",
"9	c #8195AB",
"0	c #899DB3",
"a	c #343434",
"b	c #171717",
"   ...      ",
" +.@#$.+    ",
" .%&*=-.    ",
".;>,')!~.   ",
".{]^/(_:.   ",
".<[}(|12.   ",
" .34567.    ",
" +.890....  ",
"   ... .ab. ",
"       .+ab.",
"        .+a.",
"         .. "};
