/* XPM */
static char * adressen_xpm[] = {
"27 24 10 1",
" 	c None",
".	c #CC9A64",
"+	c #6666CC",
"@	c #FFFFFF",
"#	c #FCFECC",
"$	c #999999",
"%	c #9999FF",
"&	c #333366",
"*	c #CCCCCC",
"=	c #CCCCFF",
"                           ",
"                           ",
"                    ...    ",
"          .........++++    ",
"         .@############$   ",
"         .@######%&+###$   ",
"         .@######&&&###$   ",
"         .@&&&&##+&+###$   ",
"         .@#####&*@*&##$   ",
"         .@&&&#&&&%&&&#$   ",
"         .*****&&&&&&&#$   ",
"  .............$&&&&&&#$   ",
"  .#*#*#*#*#*#*&**#####$   ",
"  $*@*@*@*@*&+%*&$$$$$$$   ",
"   $*=++++==%&+#*&$+&&&    ",
"    $*=*=*=%&&&&#$+&&&&    ",
"  &+++++++++++++++&&&&&$   ",
"  +%%%%%%%%%%%%%%+&&&&&$$  ",
"  +======%%%%%%%%+&&&&$$   ",
"  +=%%%%%%%%%%%%%+&&&$$    ",
"  ++++++++++++++++&&$      ",
"  +&&&&&&&&&&&&&&&&        ",
"                           ",
"                           "};
