/* XPM */
static char *mail_forward[]={
"52 33 219 2",
"Qt c None",
"aR c #000000",
"#8 c #101010",
"aG c #151515",
"aq c #171717",
"aN c #181818",
"aW c #1b1b1b",
"#Q c #1d1d1d",
"a0 c #1e1e1e",
"#k c #1f1f1f",
"a4 c #212121",
"#I c #222222",
".W c #232323",
"#Z c #252525",
"ac c #2a2a2a",
"#v c #2b2b2b",
".S c #2d2d2d",
"aH c #2e2e2e",
"aX c #303030",
".A c #313131",
"a1 c #333333",
".G c #343434",
".9 c #363636",
"#w c #373737",
".3 c #383838",
"#R c #393939",
"aV c #3a3a3a",
".x c #3b3b3b",
"#9 c #3e3e3e",
"aS c #414141",
"#B c #424242",
"#e c #434343",
".L c #444444",
"aY c #454545",
"aM c #474747",
".K c #484848",
"#n c #494949",
"ar c #4b4b4b",
"aI c #4c4c4c",
"a5 c #4d4d4d",
"#o c #4e4e4e",
"#l c #4f4f4f",
"#d c #505050",
"#J c #525252",
".p c #535353",
".X c #555555",
"bt c #557c3b",
"#0 c #565656",
".2 c #575757",
"bh c #585858",
"bx c #58833c",
"az c #5a5a5a",
"#C c #5b5b5b",
"#S c #5d5d5d",
".R c #5e5e5e",
"bv c #5e8a41",
"ad c #606060",
"aO c #616161",
"br c #639144",
"a2 c #646464",
".y c #656565",
"bu c #65894c",
"by c #668154",
"bp c #669447",
"#N c #686868",
"a9 c #6a6a6a",
"#M c #6b6b6b",
".q c #6c6c6c",
"#x c #6d6d6d",
"bq c #6e9952",
"bg c #6f6f6f",
"bs c #6f9059",
".o c #707070",
".H c #717171",
"#A c #727272",
"#T c #737373",
"bw c #748c64",
"aJ c #757575",
"a. c #767676",
"av c #787878",
"#m c #797979",
".T c #7a7a7a",
".M c #7b7b7b",
"bo c #7d9a69",
"aA c #7e7e7e",
"bm c #7f7f7f",
"#c c #808080",
"a6 c #818181",
"aP c #828282",
"b. c #838383",
".4 c #858585",
"#K c #868686",
".1 c #878787",
"#1 c #888888",
"aD c #898989",
"as c #8a8a8a",
"a# c #8b8b8b",
".Y c #8d8d8d",
".z c #8e8e8e",
"a7 c #8f8f8f",
"#f c #909090",
"aw c #919191",
"aU c #929292",
"#5 c #939393",
"#y c #949494",
".F c #959595",
"#. c #969696",
"aj c #979797",
"bn c #989898",
"ai c #999999",
".r c #9a9a9a",
".i c #9b9b9b",
".w c #9c9c9c",
"aK c #9d9d9d",
"#X c #9e9e9e",
"ah c #9f9f9f",
"#L c #a0a0a0",
".n c #a1a1a1",
".N c #a2a2a2",
".h c #a3a3a3",
".B c #a4a4a4",
"#b c #a5a5a5",
"an c #a6a6a6",
".Z c #a7a7a7",
".Q c #a9a9a9",
"bk c #a9c79c",
"aB c #aaaaaa",
"#G c #ababab",
".E c #acacac",
"bi c #adadad",
".v c #aeaeae",
"be c #aecca1",
"ae c #afafaf",
".m c #b0b0b0",
"aF c #b1b1b1",
".g c #b2b2b2",
"aa c #b3b3b3",
"#a c #b4b4b4",
".C c #b5b5b5",
".0 c #b6b6b6",
".O c #b7b7b7",
".P c #b8b8b8",
"au c #b9b9b9",
"a8 c #b9c3b5",
"bj c #b9c9b1",
".D c #bababa",
".s c #bbbbbb",
"ak c #bcbcbc",
".b c #bdbdbd",
"bd c #bdceb6",
"#z c #bebebe",
".l c #bfbfbf",
"## c #c0c0c0",
".f c #c1c1c1",
".j c #c2c2c2",
".# c #c3c3c3",
".I c #c4c4c4",
".t c #c5c5c5",
"#s c #c6c6c6",
"#W c #c7c7c7",
"ag c #c8c8c8",
".c c #c9c9c9",
".d c #cacaca",
"#Y c #cbcbcb",
".u c #cccccc",
"#6 c #cdcdcd",
"#3 c #cecece",
"#2 c #cfcfcf",
".k c #d0d0d0",
"bc c #d0e1c9",
"#7 c #d1d1d1",
".a c #d2d2d2",
"ax c #d3d3d3",
"bb c #d3e3cb",
"ap c #d4d4d4",
".8 c #d5d5d5",
".e c #d6d6d6",
"aQ c #d7d7d7",
"ba c #d7e5d0",
"af c #d8d8d8",
"b# c #d8e6d2",
"aZ c #d9d9d9",
"aE c #dadada",
"#r c #dbdbdb",
"a3 c #dbe7d6",
"#g c #dddddd",
"#j c #dedede",
"at c #dfdfdf",
"al c #e0e0e0",
"bl c #e0eadb",
"#t c #e1e1e1",
"bf c #e1ebdc",
"#H c #e2e2e2",
"ay c #e3e3e3",
"#p c #e4e4e4",
"#P c #e5e5e5",
"#U c #e7e7e7",
"#D c #e8e8e8",
"ao c #e9e9e9",
"#V c #ebebeb",
".V c #ececec",
".5 c #ededed",
"#h c #eeeeee",
".J c #efefef",
"#q c #f0f0f0",
"aL c #f1f1f1",
"#u c #f2f2f2",
"aC c #f4f4f4",
"#O c #f5f5f5",
"aT c #f6f6f6",
"ab c #f7f7f7",
"#4 c #f8f8f8",
".U c #f9f9f9",
"#i c #fafafa",
".7 c #fbfbfb",
"am c #fcfcfc",
"#E c #fdfdfd",
"#F c #fefefe",
".6 c #ffffff",
"QtQtQtQtQtQtQtQtQtQtQtQtQtQtQtQtQtQtQtQtQtQtQt.#.#.aQtQtQtQtQtQtQtQtQtQtQtQtQtQtQtQtQtQtQtQtQtQtQtQtQtQt",
"QtQtQtQtQtQtQtQtQtQtQtQtQtQtQtQtQtQtQtQtQt.#.#.b.c.d.eQtQtQtQtQtQtQtQtQtQtQtQtQtQtQtQtQtQtQtQtQtQtQtQtQt",
"QtQtQtQtQtQtQtQtQtQtQtQtQtQtQtQtQtQtQt.#.f.g.h.i.j.d.kQtQtQtQtQtQtQtQtQtQtQtQtQtQtQtQtQtQtQtQtQtQtQtQtQt",
"QtQtQtQtQtQtQtQtQtQtQtQtQtQtQtQtQt.#.l.m.n.o.p.q.r.s.t.uQtQtQtQtQtQtQtQtQtQtQtQtQtQtQtQtQtQtQtQtQtQtQtQt",
"QtQtQtQtQtQtQtQtQtQtQtQtQtQtQt.#.b.v.w.q.x.y.z.A.q.B.C.tQtQtQtQtQtQtQtQtQtQtQtQtQtQtQtQtQtQtQtQtQtQtQtQt",
"QtQtQtQtQtQtQtQtQtQtQtQtQt.#.D.E.F.y.G.H.I.JQt.K.L.M.N.O.IQtQtQtQtQtQtQtQtQtQtQtQtQtQtQtQtQtQtQtQtQtQtQt",
"QtQtQtQtQtQtQtQtQtQtQt.#.P.Q.z.R.S.T.d.J.U.V.k.F.W.X.Y.Z.bQtQtQtQtQtQtQtQtQtQtQtQtQtQtQtQtQtQtQtQtQtQtQt",
"QtQtQtQtQtQtQtQt.#.#.0.Z.1.2.3.4.a.5.U.6.7.8.fQt.3.9.q#..m##QtQtQtQtQtQtQtQtQtQtQtQtQtQtQtQtQtQtQtQtQtQt",
"QtQtQtQtQtQt.#.##a#b#c#d#e#f#g#h#i.6.6.6#h.s.j#j.F#k#l.4.h.bQtQtQtQtQtQtQtQtQtQtQtQtQtQtQtQtQtQtQtQtQtQt",
"QtQtQtQt.#.f.g.h#m#n#o.i#p#q.7.6.6.6.6.6#r.E#s#t#u#v#w#x#y.m#zQtQtQtQtQtQtQtQtQtQtQtQtQtQtQtQtQtQtQtQtQt",
"QtQtQt#z.m.n#A#B#C.Q#D#u#E.6.6.6.6.6.6#F#z#G.d#H#u.Y#I#J#K.h#zQtQtQtQtQtQtQtQtQtQtQtQtQtQtQtQtQtQtQtQtQt",
"QtQt.b#L#M.x#N.D#h#O.6.6.6.6.6.6.6.6.6#P#b.Z.c#t#h.5#Q#R.o#..g#zQtQtQtQtQtQtQtQtQtQtQtQtQtQtQtQtQtQtQtQt",
"QtQt.##G#S#T#U#V#E.6.6.6.6.6.6.6.6.6#i#W.T#X#z#Y#H.V.M#Z#0#1.Z.lQtQtQtQtQtQtQtQtQtQtQtQtQtQtQtQtQtQtQtQt",
"QtQtQt.D.z.3#2#3#3#g.5#4.6.6.6.6.6.6#4.Q.T#5.B.s#6#r#7#8#9a..w.0QtQtQtQtQtQtQtQtQtQtQtQtQtQtQtQtQtQtQtQt",
"QtQtQt.#.Q#0a##7.f.0aa#z.eab#4.6.6.6#U.v#a.O.m#G.0.I.8.yacad#5ae.IQtQtQtQtQtQtQtQtQtQtQtQtQtQtQtQtQtQtQt",
"QtQtQtQt.P.1#e#pafag.0ahaiajakalabam.uan.u#Uao#tap.c#6.0aqaras#G##QtQtQtQtQtQtQtQtQtQtQtQtQtQtQtQtQtQtQt",
"QtQtQtQt.#.Z#l.Naoatagauaiavaw.E.gak.z.Nax#h#4#E#F.U#Uayaz.LaAaB###6QtQtQtQtQtQtQtQtQtQtQtQtQtQtQtQtQtQt",
"QtQtQtQtQt.0#c#JaC.5Qt.t.B.i#z#z.n.Y#f#aal#O.7#Fab#q.t#N#k#daDae.j#2.#.#.#.#.#QtQtQtQtQtQtQtQtQtQtQtQtQt",
"QtQtQtQtQt.##b.Kaa#q#tag.Q.P#Dat#2.s.faE#h#i#uaoaF#0aGaHaIaJaK.0.t.k.eQt#L#L.#.#QtQtQtQtQtQtQtQtQtQtQtQt",
"QtQtQtQtQt.##a#m.RaLal.tanaf#OaL.V#Dao#u.V#p#LaMaN.S#eaOaP.iae##.uaxaQQtaR#L#L.#.#.#QtQtQtQtQtQtQtQtQtQt",
"QtQtQtQtQtQt.#.haSauQt.lak.5am.7.UaT#V#taUaVaWaXaYad.M.zah.m#z.d#2QtQtQtaRaR#L#L.#.#QtQtQtQtQtQtQtQtQtQt",
"QtQtQtQtQtQt.#.g#A.yaZ.j.8#E#F.U#hat.4.Sa0a1#na2aA.Y.waB.O.jQtQtQtQtQtQtaRa3aR#L#L.#.#.#QtQtQtQtQtQtQtQt",
"QtQtQtQtQtQtQt##.naV.g#6.5.7#q.e.Ma4a4.9a5#Na6a7aKaB.0#zQtQtQtQtaRaRaRaRaRa8a3aR#L.#.#.#QtQtQtQtQtQtQtQt",
"QtQtQtQtQtQtQt.#.m#Ma9Qt.J.k#AaG#Z#R#J.qb.awah.E.P#zQtQtQtQtQtQtaRb#babbbcbdbebfaR#L.#.#QtQtQtQtQtQtQtQt",
"QtQtQtQtQtQtQtQt#z.ia1#Gbg#Q.A#Bbh.H#K#y.nbi.D#zQtQtQtQtQtQtQtQtaRbjbebebebkbebeblaR#L.#QtQtQtQtQtQtQtQt",
"QtQtQtQtQtQtQtQt.#bia2.Gar#C.qbm.Ybn.B.m.s#zQtQtQtQtQtQtQtQtQtQtaRbobpbpbpbqbpbpbraR#L.#.#QtQtQtQtQtQtQt",
"QtQtQtQtQtQtQtQtQt.bbi#f#5#XanaB.E#a.l.lQtQtQtQtQtQtQtQtQtQtQtQtaRbsbtbtbtbubpbvaR#L#L.#.#QtQtQtQtQtQtQt",
"QtQtQtQtQtQtQtQtQt.#.l.P#z##.#.I.t.fQtQtQtQtQtQtQtQtQtQtQtQtQtQtaRaRaRaRaRbwbxaR#L#L.#.#QtQtQtQtQtQtQtQt",
"QtQtQtQtQtQtQtQtQtQtQt.f.#.I.#QtQtQtQtQtQtQtQtQtQtQtQtQtQtQtQtQtQtQtQtQtaRbyaR#L#L.#.#QtQtQtQtQtQtQtQtQt",
"QtQtQtQtQtQtQtQtQtQtQtaxQtQtQtQtQtQtQtQtQtQtQtQtQtQtQtQtQtQtQtQtQtQtQtQtaRaR#L#L.#.#QtQtQtQtQtQtQtQtQtQt",
"QtQtQtQtQtQtQtQtQtQtQtQtQtQtQtQtQtQtQtQtQtQtQtQtQtQtQtQtQtQtQtQtQtQtQtQtaR#L#L.#.#.#QtQtQtQtQtQtQtQtQtQt",
"QtQtQtQtQtQtQtQtQtQtQtQtQtQtQtQtQtQtQtQtQtQtQtQtQtQtQtQtQtQtQtQtQtQtQtQt#L.#.#.#.#QtQtQtQtQtQtQtQtQtQtQt",
"QtQtQtQtQtQtQtQtQtQtQtQtQtQtQtQtQtQtQtQtQtQtQtQtQtQtQtQtQtQtQtQtQtQtQtQt.#.#.#QtQtQtQtQtQtQtQtQtQtQtQtQt"};
