/* XPM */
static char * mail_sign_xpm[] = {
"24 24 51 1",
" 	c None",
".	c #D6D6D6",
"+	c #B7B7BC",
"@	c #A6A6AE",
"#	c #D3D3D4",
"$	c #C0C0C4",
"%	c #CACACC",
"&	c #BBBBC0",
"*	c #92929E",
"=	c #D5D5D5",
"-	c #B1B1B7",
";	c #6F6F81",
">	c #C7C7C9",
",	c #AAAAB1",
"'	c #CFCFD0",
")	c #D2D2D3",
"!	c #B8B8BD",
"~	c #BCBCC0",
"{	c #B2B2B8",
"]	c #7C7C8A",
"^	c #9797A1",
"/	c #8A8A96",
"(	c #CBCBCD",
"_	c #B3B3B8",
":	c #CDCDCE",
"<	c #BABABF",
"[	c #D0D0D1",
"}	c #A2A2AA",
"|	c #C0C0C3",
"1	c #C9C9CB",
"2	c #BDBDC1",
"3	c #D1D1D2",
"4	c #C2C2C5",
"5	c #A4A4AC",
"6	c #8C8C98",
"7	c #D4D4D5",
"8	c #A0A0A9",
"9	c #7D7D8B",
"0	c #6A6A7C",
"a	c #B3B3B9",
"b	c #93939E",
"c	c #D4D4D4",
"d	c #ADADB4",
"e	c #C7C7CA",
"f	c #868694",
"g	c #868693",
"h	c #8F8F9B",
"i	c #303030",
"j	c #C7A2E8",
"k	c #A680BB",
"l	c #7C7C8B",
"                        ",
"                        ",
"           ..           ",
"          ....          ",
"         ......         ",
"        ..+@.#..        ",
"       ..$%$&*=..       ",
"      ..-;>,>'@)..      ",
"     ..>!~{]%^/....     ",
"    ..-;(_.:~/._.=..    ",
"   ..<;~[}:^|.:}1*#..   ",
"   2.34567~|.8-195....  ",
"   0a.#*1(b.8.)-5....c  ",
"    0a.=@d.:-)9e....[f  ",
"     0a.)./}1-e....[g   ",
"      0a.)@195..h4[iii  ",
"       0a.=*5...4iijjji ",
"        0a.#.iiiiijjjji ",
"         0a..ijjjjjjiji ",
"          0a.ikikijjjji ",
"           0a[i i ijjji ",
"            0l     iii  ",
"                        ",
"                        "};
