/* XPM */
static char * online_xpm[] = {
"26 11 108 2",
"  	c None",
". 	c #747474",
"+ 	c #565656",
"@ 	c #3F3F3F",
"# 	c #151515",
"$ 	c #080808",
"% 	c #111111",
"& 	c #2A2A2A",
"* 	c #525252",
"= 	c #656565",
"- 	c #4E4E4E",
"; 	c #434343",
"> 	c #737373",
", 	c #7E7E7E",
"' 	c #848484",
") 	c #686868",
"! 	c #636363",
"~ 	c #313131",
"{ 	c #292929",
"] 	c #626262",
"^ 	c #646464",
"/ 	c #E1E1E1",
"( 	c #DBDBDB",
"_ 	c #CBCBCB",
": 	c #ACACAC",
"< 	c #AEAEAE",
"[ 	c #B2B2B2",
"} 	c #B8B8B8",
"| 	c #414141",
"1 	c #A2A2A2",
"2 	c #757575",
"3 	c #6F6F6F",
"4 	c #3E3E3E",
"5 	c #C3C3C3",
"6 	c #D9D9D9",
"7 	c #C8C8C8",
"8 	c #AAAAAA",
"9 	c #A8A8A8",
"0 	c #ADADAD",
"a 	c #B3B3B3",
"b 	c #8B8B8B",
"c 	c #191919",
"d 	c #555555",
"e 	c #838383",
"f 	c #6C6C6C",
"g 	c #3A3A3A",
"h 	c #666666",
"i 	c #676767",
"j 	c #959595",
"k 	c #D3D3D3",
"l 	c #D4D4D4",
"m 	c #CFCFCF",
"n 	c #C0C0C0",
"o 	c #A5A5A5",
"p 	c #A1A1A1",
"q 	c #9E9E9E",
"r 	c #5D5D5D",
"s 	c #343434",
"t 	c #1A1A1A",
"u 	c #1B1B1B",
"v 	c #6D6D6D",
"w 	c #B4B4B4",
"x 	c #BCBCBC",
"y 	c #C2C2C2",
"z 	c #C5C5C5",
"A 	c #C7C7C7",
"B 	c #B7B7B7",
"C 	c #494949",
"D 	c #999999",
"E 	c #9C9C9C",
"F 	c #939393",
"G 	c #898989",
"H 	c #858585",
"I 	c #454545",
"J 	c #272727",
"K 	c #4F4F4F",
"L 	c #535353",
"M 	c #7A7A7A",
"N 	c #B5B5B5",
"O 	c #B9B9B9",
"P 	c #969696",
"Q 	c #444444",
"R 	c #929292",
"S 	c #9D9D9D",
"T 	c #9A9A9A",
"U 	c #424242",
"V 	c #222222",
"W 	c #2C2C2C",
"X 	c #888888",
"Y 	c #ABABAB",
"Z 	c #A9A9A9",
"` 	c #8D8D8D",
" .	c #8A8A8A",
"..	c #727272",
"+.	c #7C7C7C",
"@.	c #333333",
"#.	c #989898",
"$.	c #383838",
"%.	c #8E8E8E",
"&.	c #828282",
"*.	c #3C3C3C",
"=.	c #707070",
"-.	c #1F1F1F",
";.	c #1D1D1D",
">.	c #0F0F0F",
",.	c #878787",
"'.	c #515151",
").	c #919191",
"                . + @ # $ % & * =                   ",
"              - ; > . , ; ' ) ! ~ {                 ",
"            ] ^ / ( _ : + < [ } < | &               ",
"1 2 2 3 3 3 4 5 / 6 7 8 * 9 0 a 0 b c d d d d 2 2 e ",
"f g h i i i j k l m n o - p 9 : 9 q r s s s s ~ t u ",
"v r w x x x y z A 5 B q C D 1 o p E F G G G G H I u ",
"f J K L L L M N O B : P Q R E S T F ] U U U U | V u ",
"q v f i i i W X Y Z 1 ` 4  .j j R ..c L L L L f f +.",
"            2 @.F S #.' $.e %.%.&.& *.              ",
"              =.% -.& @ t 4 V ;.>.C                 ",
"                S ,., '.I C =.H ).                  "};
