/* XPM */
static char * edit_extern[] = {
"24 24 290 2",
"  	c None",
". 	c #BCC0BC",
"+ 	c #AA988A",
"@ 	c #60534B",
"# 	c #8C6C58",
"$ 	c #6B3D33",
"% 	c #CACFCE",
"& 	c #949796",
"* 	c #B3A998",
"= 	c #78543E",
"- 	c #54260C",
"; 	c #5A3724",
"> 	c #655F58",
", 	c #755853",
"' 	c #523528",
") 	c #C8CAC8",
"! 	c #6E7374",
"~ 	c #828586",
"{ 	c #54545C",
"] 	c #565352",
"^ 	c #322620",
"/ 	c #36221C",
"( 	c #C0BCB4",
"_ 	c #C6C6C6",
": 	c #5A3928",
"< 	c #75736B",
"[ 	c #56555C",
"} 	c #404045",
"| 	c #A4A3A2",
"1 	c #545462",
"2 	c #44444C",
"3 	c #2C2D34",
"4 	c #20232E",
"5 	c #2E2E32",
"6 	c #B4B7BA",
"7 	c #CCCFD2",
"8 	c #B8B5B2",
"9 	c #4C301A",
"0 	c #6C6C60",
"a 	c #CCBC7C",
"b 	c #88773C",
"c 	c #787A78",
"d 	c #BDAF9D",
"e 	c #AA927C",
"f 	c #505056",
"g 	c #2A2B34",
"h 	c #26292E",
"i 	c #787B7C",
"j 	c #C6CACC",
"k 	c #AEB2B2",
"l 	c #CCCED0",
"m 	c #CCCED4",
"n 	c #A0978D",
"o 	c #44281A",
"p 	c #E0CD6B",
"q 	c #604C3C",
"r 	c #BBAD9B",
"s 	c #966D4E",
"t 	c #743C18",
"u 	c #7A6454",
"v 	c #22242E",
"w 	c #20232A",
"x 	c #6C6E70",
"y 	c #D2D7D8",
"z 	c #E4E8E8",
"A 	c #E0E2E4",
"B 	c #D8DEE0",
"C 	c #D8D8D8",
"D 	c #D4D7D8",
"E 	c #C8CCCE",
"F 	c #7D6B63",
"G 	c #482F22",
"H 	c #C2A550",
"I 	c #58534B",
"J 	c #E6D8CA",
"K 	c #824B24",
"L 	c #804A22",
"M 	c #B89C86",
"N 	c #DADAD6",
"O 	c #585A5E",
"P 	c #CACDD0",
"Q 	c #F0F0F0",
"R 	c #E8EEF0",
"S 	c #D2D5D6",
"T 	c #B2B7B6",
"U 	c #CACDCE",
"V 	c #D2D4D6",
"W 	c #CACED2",
"X 	c #BCC1C4",
"Y 	c #AC9C74",
"Z 	c #766532",
"` 	c #848480",
" .	c #C5C8C5",
"..	c #C6A180",
"+.	c #7E4F30",
"@.	c #E8ECE8",
"#.	c #F8FCF8",
"$.	c #E4E5E4",
"%.	c #C8C9C8",
"&.	c #E2E2E2",
"*.	c #E4EAEC",
"=.	c #CCCECE",
"-.	c #B4B8BA",
";.	c #C0C5C8",
">.	c #C0C3C2",
",.	c #C2C4C6",
"'.	c #C8CBCC",
").	c #D8C986",
"!.	c #402A14",
"~.	c #52463A",
"{.	c #E5E1DB",
"].	c #966C48",
"^.	c #86684E",
"/.	c #A6A8A8",
"(.	c #D8D9DA",
"_.	c #C2C5C6",
":.	c #B0B2AE",
"<.	c #CED0D0",
"[.	c #C4C9C8",
"}.	c #A2A5A6",
"|.	c #A8ABAC",
"1.	c #C4C6C6",
"2.	c #BCA048",
"3.	c #6E6F6E",
"4.	c #543A2C",
"5.	c #3D3128",
"6.	c #E0CFC0",
"7.	c #7C4720",
"8.	c #9A8F84",
"9.	c #F8F8F8",
"0.	c #AEB4B4",
"a.	c #C4C8C8",
"b.	c #B4B7B4",
"c.	c #BEC1C2",
"d.	c #ACB1B2",
"e.	c #A6A9AA",
"f.	c #A8ACAC",
"g.	c #A0A6A6",
"h.	c #ACAEB0",
"i.	c #DDD788",
"j.	c #6A542E",
"k.	c #AAAFB0",
"l.	c #9C9D9E",
"m.	c #3E291C",
"n.	c #504B45",
"o.	c #C4C6C4",
"p.	c #D0B194",
"q.	c #663718",
"r.	c #BAB8B6",
"s.	c #EAEDF0",
"t.	c #A0A1A3",
"u.	c #CACCCC",
"v.	c #A4A6A8",
"w.	c #A4A7A8",
"x.	c #ACB0B2",
"y.	c #8C9292",
"z.	c #B8BCBE",
"A.	c #AAACAE",
"B.	c #D6C772",
"C.	c #68584A",
"D.	c #928D88",
"E.	c #3A1F0E",
"F.	c #656058",
"G.	c #D8D9D5",
"H.	c #9C7250",
"I.	c #603F2A",
"J.	c #DEE1E4",
"K.	c #D2D2D2",
"L.	c #9C9E9E",
"M.	c #9A9B9C",
"N.	c #9A9D9C",
"O.	c #B8BBBA",
"P.	c #9CA0A0",
"Q.	c #AEB0AA",
"R.	c #AC9040",
"S.	c #8A8A8A",
"T.	c #B8B8B8",
"U.	c #ACAFB2",
"V.	c #A4A8AC",
"W.	c #7E7C78",
"X.	c #341908",
"Y.	c #5C5C58",
"Z.	c #DED2C6",
"`.	c #864C26",
" +	c #725D52",
".+	c #F0F0F2",
"++	c #BABFC0",
"@+	c #A4A6A6",
"#+	c #C8CCCC",
"$+	c #BABDC0",
"%+	c #8B908D",
"&+	c #CEC98C",
"*+	c #6A5034",
"=+	c #B6B9B8",
"-+	c #B4B6B8",
";+	c #A2A6A4",
">+	c #989A9C",
",+	c #605850",
"'+	c #2A1508",
")+	c #747474",
"!+	c #CEB59C",
"~+	c #683010",
"{+	c #98918E",
"]+	c #B0B1B0",
"^+	c #A4AAA8",
"/+	c #D6C472",
"(+	c #68635E",
"_+	c #C0C4C8",
":+	c #B6B9BC",
"<+	c #9EA2A2",
"[+	c #767878",
"}+	c #28140C",
"|+	c #36302A",
"1+	c #CDCFCB",
"2+	c #AC8160",
"3+	c #502A14",
"4+	c #BCBEC0",
"5+	c #D4D8D6",
"6+	c #AAADAE",
"7+	c #D4C6BE",
"8+	c #96803E",
"9+	c #9CA1A2",
"0+	c #A8A8A8",
"a+	c #6C7070",
"b+	c #261208",
"c+	c #302B26",
"d+	c #D4D2CA",
"e+	c #7E4926",
"f+	c #58402E",
"g+	c #DAE0DE",
"h+	c #B6B7B8",
"i+	c #C8CDD0",
"j+	c #D4D6D8",
"k+	c #D8C0B0",
"l+	c #6A5040",
"m+	c #BCC2C4",
"n+	c #BCC0C2",
"o+	c #9A9FA0",
"p+	c #4E5254",
"q+	c #060402",
"r+	c #2E2B26",
"s+	c #CEBCA8",
"t+	c #602E14",
"u+	c #6C6058",
"v+	c #A69786",
"w+	c #78797A",
"x+	c #606366",
"y+	c #545456",
"z+	c #1C1A18",
"A+	c #220B00",
"B+	c #2C2824",
"C+	c #D0D2D0",
"D+	c #B69072",
"E+	c #52250C",
"F+	c #94938E",
"G+	c #BEBEBE",
"H+	c #909296",
"I+	c #8E9294",
"J+	c #ABADAD",
"K+	c #504F50",
"L+	c #2A0F00",
"M+	c #302C26",
"N+	c #E0DCD8",
"O+	c #7E593C",
"P+	c #442312",
"Q+	c #BCBFC2",
"R+	c #423E3A",
"S+	c #2E1104",
"T+	c #DCCBB8",
"U+	c #663316",
"V+	c #523E32",
"W+	c #BABBC0",
"X+	c #383430",
"Y+	c #321504",
"Z+	c #C0C2C0",
"`+	c #C2A890",
" @	c #50230A",
".@	c #56504C",
"+@	c #302822",
"@@	c #3E1A06",
"#@	c #2A2620",
"$@	c #D5D1CD",
"%@	c #946E4E",
"&@	c #441D08",
"*@	c #401C06",
"=@	c #2C2822",
"-@	c #D8CEBE",
";@	c #5C3924",
">@	c #2C241E",
",@	c #9E9D9A",
"                    . + @           # $         ",
"          % &     * = - ; >         , '         ",
"        ) ! ~ { ] ^ / ( _ : <       [ }         ",
"          | 1 2 3 4 5 6 7 8 9 0   a b c         ",
"      d e f g 4 h i j k l m n o   p q           ",
"  r s t u v w x y z A B C D E F G H I           ",
"J K L M N O P Q R z S T U V W X Y Z `           ",
" ...+.@.#.$.%.&.*.=.-.;.>.,.'.,.).!.~.          ",
"  {.].^.#./.U (._.:.<.[.}.|.j 1.2.3.4.5.        ",
"    6.7.8.9.0.a.b.c.d.e.f.g.h.i.j.k.l.m.n.      ",
"    o.p.q.r.s.t.u.v.w.x.y.z.A.B.C.0.|.D.E.F.    ",
"      G.H.I.J.K.L.c.M.N.O.P.Q.R.S.T.U.V.W.X.Y.  ",
"        Z.`. +.+++@+#+$+/.%+&+*+=+T.-+;+>+,+'+)+",
"          !+~+{+R 7 ]+^+L.6 /+(+_+:+V.<+[+}+|+  ",
"          1+2+3+4+5+& 6+-.7+8+9+_+6 0+a+b+c+    ",
"            d+e+f+g+h+i+j+k+l+m+n+o+p+q+r+      ",
"              s+t+u+A B j+v+w+x+y+z+A+B+        ",
"              C+D+E+F+B G+H+I+J+K+L+M+          ",
"                N+O+P+$+j+m Q+R+S+M+            ",
"                  T+U+V+l W+X+Y+M+              ",
"                  Z+`+ @.@+@@@#@                ",
"                    $@%@&@*@=@                  ",
"                      -@;@>@                    ",
"                        ,@                      "};
