/* XPM */ 
static char * mail_receive_all_xpm[] = {
"24 24 248 2",
"  	c None",
"! 	c black",
"# 	c #009A00",
"$ 	c #009900",
"% 	c #6FC570",
"& 	c #B6E2B6",
"' 	c #AADDAA",
"( 	c #68C368",
") 	c #009901",
"* 	c #6FC66F",
"+ 	c #CAEACA",
", 	c #E8F6E8",
"- 	c #D9F0D9",
". 	c #A3DAA3",
"/ 	c #0084D2",
"0 	c #0080FF",
"1 	c #0687D2",
"2 	c #C8E9C8",
"3 	c #E7F6E7",
"4 	c #A2DAA2",
"5 	c #7BC1D2",
"6 	c #92C9FF",
"7 	c #8EC7FF",
"8 	c #8AC5FF",
"9 	c #84C2FF",
": 	c #68B7D2",
"; 	c #1D8FFF",
"< 	c #B9E1D2",
"= 	c #C0E6C0",
"> 	c #E0F2E0",
"? 	c #D1EDD1",
"@ 	c #9DD89D",
"A 	c #C5E6D2",
"B 	c #E9F4FF",
"C 	c #E3F1FF",
"D 	c #DBEDFF",
"E 	c #D3E9FF",
"F 	c #A6D8D2",
"G 	c #0082ED",
"H 	c #349FCC",
"I 	c #8ED0A8",
"J 	c #B4E1B4",
"K 	c #D3EDD3",
"L 	c #C6E8C6",
"M 	c #93D493",
"N 	c #A1D9A8",
"O 	c #BFE4CC",
"P 	c #BAE2CC",
"Q 	c #B9E1D1",
"R 	c #ABDBCC",
"S 	c #86CBA8",
"T 	c #029814",
"U 	c #A6DBA6",
"V 	c #C1E6C1",
"W 	c #B5E1B5",
"X 	c #85CF85",
"Y 	c #0E9E0F",
"Z 	c #02905F",
"[ 	c #57BC57",
"\ 	c #90D390",
"] 	c #ACDDAC",
"^ 	c #ABDDAB",
"_ 	c #83CE83",
"` 	c #56BB56",
"a 	c #20A620",
"b 	c #57BB5E",
"c 	c #56BB5F",
"d 	c #0080FC",
"e 	c #44B166",
"f 	c #029A02",
"g 	c #5DBE5D",
"h 	c #95D595",
"i 	c #8CD18C",
"j 	c #7ECB7E",
"k 	c #67C267",
"l 	c #29A929",
"m 	c #019901",
"n 	c #41AF6C",
"o 	c #98CBFF",
"p 	c #92C9FC",
"q 	c #2BA566",
"r 	c #019902",
"s 	c #A5D2FF",
"t 	c #66C07E",
"u 	c #3BB13B",
"v 	c #63C163",
"w 	c #52BA52",
"x 	c #1BA41B",
"y 	c #008C81",
"z 	c #008D7E",
"{ 	c #9CCDFF",
"| 	c #C4E1FF",
"} 	c #74C493",
"~ 	c #11A011",
" !	c #079C08",
"!!	c #59B699",
"#!	c #96CBFF",
"$!	c #98CCFF",
"%!	c #97CBFF",
"&!	c #95CAFF",
"'!	c #52B493",
"(!	c #2EA199",
")!	c #0683FF",
"*!	c #91C8FF",
"+!	c #B7DBFF",
",!	c #B6DBFF",
"-!	c #0189A8",
".!	c #01990C",
"/!	c #0B9D0C",
"0!	c #9ED6AE",
"1!	c #EEF6FF",
"2!	c #F3F9FF",
"3!	c #F6FBFF",
"4!	c #F4F9FF",
"5!	c #EFF7FF",
"6!	c #90D0A8",
"7!	c #0A9D0C",
"8!	c #82C9AE",
"9!	c #B3D9FF",
":!	c #A6D3FF",
";!	c #1389FF",
"<!	c #A7D3FF",
"=!	c #41A0FF",
">!	c #D8ECFF",
"?!	c #EAF4FF",
"@!	c #F0F8FF",
"A!	c #FCFDFF",
"B!	c #FDFEFF",
"C!	c #F9FCFF",
"D!	c #F4FAFF",
"E!	c #E1F0FF",
"F!	c #D6EBFF",
"G!	c #CBE5FF",
"H!	c #C1E0FF",
"I!	c #B5DAFF",
"J!	c #A2D1FF",
"K!	c #3198FF",
"L!	c #70B8FF",
"M!	c #93C9FF",
"N!	c #7FBFFF",
"O!	c #0F87FF",
"P!	c #1D8EFF",
"Q!	c #AFD7FF",
"R!	c #FAFCFF",
"S!	c #F8FBFF",
"T!	c #F5FAFF",
"U!	c #F1F8FF",
"V!	c #EBF5FF",
"W!	c #E4F2FF",
"X!	c #CEE7FF",
"Y!	c #C0E0FF",
"Z!	c #1A8DFF",
"[!	c #0784FF",
"\!	c #2894FF",
"]!	c #7BBDFF",
"^!	c #6BB6FF",
"_!	c #47A3FF",
"`!	c #0381FF",
"a!	c #71B8FF",
"b!	c #E9F5FF",
"c!	c #EDF5FF",
"d!	c #E6F3FF",
"e!	c #DDEEFF",
"f!	c #CAE4FF",
"g!	c #56ABFF",
"h!	c #3098FF",
"i!	c #6CB6FF",
"j!	c #0081FF",
"k!	c #1088FF",
"l!	c #379BFF",
"m!	c #ABD6FF",
"n!	c #D7EBFF",
"o!	c #85C2FF",
"p!	c #0B85FF",
"q!	c #2995FF",
"r!	c #F2F9FF",
"s!	c #F2F8FF",
"t!	c #EDF6FF",
"u!	c #E7F3FF",
"v!	c #A7D4FF",
"w!	c #6FB7FF",
"x!	c #9DCEFF",
"y!	c #74BAFF",
"z!	c #CFE7FF",
"{!	c #D4EAFF",
"|!	c #BDDEFF",
"}!	c #369BFF",
"~!	c #0583FF",
" #	c #83C1FF",
"!#	c #E4F1FF",
"##	c #65B2FF",
"$#	c #3B9DFF",
"%#	c #9CCEFF",
"&#	c #94CAFF",
"'#	c #C9E4FF",
"(#	c #CEE6FF",
")#	c #6DB6FF",
"*#	c #B9DCFF",
"+#	c #1E8FFF",
",#	c #0C86FF",
"-#	c #76BBFF",
".#	c #AED7FF",
"/#	c #A3D1FF",
"0#	c #88C4FF",
"1#	c #62B1FF",
"2#	c #BCDEFF",
"3#	c #C3E1FF",
"4#	c #C5E2FF",
"5#	c #2391FF",
"6#	c #3B9EFF",
"7#	c #AAD4FF",
"8#	c #A0D0FF",
"9#	c #79BCFF",
":#	c #55AAFF",
";#	c #ACD6FF",
"<#	c #B1D8FF",
"=#	c #5AADFF",
">#	c #72B9FF",
"?#	c #A9D4FF",
"@#	c #9ACDFF",
"A#	c #90C8FF",
"B#	c #42A1FF",
"C#	c #9ECFFF",
"D#	c #A1D0FF",
"E#	c #9FCFFF",
"F#	c #9BCDFF",
"G#	c #8DC6FF",
"H#	c #7ABDFF",
"I#	c #5DAEFF",
"J#	c #4BA5FF",
"K#	c #2A95FF",
"L#	c #82C1FF",
"M#	c #87C3FF",
"N#	c #8CC6FF",
"O#	c #8BC5FF",
"P#	c #7DBEFF",
"Q#	c #60B0FF",
"R#	c #50A8FF",
"S#	c #3E9FFF",
"T#	c #43A1FF",
"U#	c #58ACFF",
"V#	c #52A9FF",
"W#	c #4DA6FF",
"X#	c #46A3FF",
"Y#	c #3D9EFF",
"Z#	c #3299FF",
"[#	c #2492FF",
"\#	c #1189FF",
"        # $ $ $                 # $ $ $         "
"      $ % & ' ( $             ) * & ' ( $       "
"      $ + , - . $ / 0 0 0 0 / $ + , - . $       "
"  0 1 $ 2 3 - 4 $ 5 6 7 8 9 : $ 2 3 - 4 $       "
"  ; < $ = > ? @ $ A B C D E F $ = > ? @ $       "
"G H I $ J K L M $ N O P Q R S $ J K L M $       "
"T $ $ $ U V W X $ $ $ $ Y $ $ $ U V W X $ $ $ $ "
"Z $ [ \ ] ^ @ _ ` a $ b c $ [ \ ] ^ @ _ ` a $   "
"d e f g h i j k l m n o p q r g h i j k l $     "
"0 s t $ u v w x $ y 0 0 0 0 z $ u v w x $       "
"0 { | } $ ~  !r !!#!$!$!%!&!6 '!$ ~  !r (!)!0   "
"0 *!+!,!-!.!/!0!1!2!3!3!4!5!B C 6!7!7!8!9!:!;!  "
"0 9 <!9 0 =!>!?!@!3!A!B!C!D!5!B E!F!G!H!I!J!K!0 "
"0 L!M!N!0 O!P!Q!5!D!C!R!S!T!U!V!W!D X!Y!8 Z![!0 "
"  \!]!^!0 J!_!`!a!b!4!T!T!2!U!c!d!e!f!g!0 h!i!0 "
"  j!k!l!0 m!n!o!p!q!| U!r!s!U!t!u!v!; p!w!x!y!0 "
"      0 0 s z!{!|!}!~! #U!r!s!!###0 $#%#J!&#i!0 "
"        0 { | '#(#z!)#~!$#{!*#+#,#-#.#/##!0#1#0 "
"        0 *!+!2#H!3#4#J!5#p!0 6#/#7#8#&!0#9#:#0 "
"        0 9 <!;#<#9!I!I!.#=#>#?#J!@#A# #-###B#0 "
"        0 L!M!@#C#D#J!/#D#E#F#&!G#o!H#)#I#J#K#0 "
"          \!]!L#M#8 N#N#O#0# #P#-#^!Q#R#S#K#)!  "
"          j!k!T#:#U#=#=#U#g!V#W#X#Y#Z#[#\#0 j!  "
"              0 0 0 0 0 0 0 0 0 0 0 0 0 0       "};