/* XPM */
static char * mime_gpg_unknown_xpm[] = {
"24 24 225 2",
"  	c None",
". 	c #A2A2A2",
"+ 	c #9B9B9B",
"@ 	c #9A9A9A",
"# 	c #A7A7A7",
"$ 	c #777777",
"% 	c #000000",
"& 	c #757575",
"* 	c #808080",
"= 	c #292929",
"- 	c #CBCBCB",
"; 	c #E2E2E2",
"> 	c #E3E3E3",
", 	c #E1E1E1",
"' 	c #E0E0E0",
") 	c #DFDFDF",
"! 	c #DEDEDE",
"~ 	c #DDDDDD",
"{ 	c #DBDBDB",
"] 	c #DADADA",
"^ 	c #D9D9D9",
"/ 	c #D8D8D8",
"( 	c #D6D6D6",
"_ 	c #D3D3D3",
": 	c #7F7F7F",
"< 	c #1B1B1B",
"[ 	c #848484",
"} 	c #6D6D6D",
"| 	c #636363",
"1 	c #F5F5F5",
"2 	c #F2F2F2",
"3 	c #F0F0F0",
"4 	c #EFEFEF",
"5 	c #EEEEEE",
"6 	c #EDEDED",
"7 	c #ECECEC",
"8 	c #EBEBEB",
"9 	c #EAEAEA",
"0 	c #E9E9E9",
"a 	c #E8E8E8",
"b 	c #BFBFBF",
"c 	c #373737",
"d 	c #6C6C6C",
"e 	c #696969",
"f 	c #6F6F6F",
"g 	c #F3F3F3",
"h 	c #F1F1F1",
"i 	c #D5D5D5",
"j 	c #656565",
"k 	c #1D1D1D",
"l 	c #040404",
"m 	c #191919",
"n 	c #858585",
"o 	c #E6E6E6",
"p 	c #C4C4C4",
"q 	c #3B3B3B",
"r 	c #676767",
"s 	c #B5B5B5",
"t 	c #0E0E0E",
"u 	c #565656",
"v 	c #8B8B8B",
"w 	c #3A3A3A",
"x 	c #919191",
"y 	c #E7E7E7",
"z 	c #E5E5E5",
"A 	c #C2C2C2",
"B 	c #8A8A8A",
"C 	c #131313",
"D 	c #A1A1A1",
"E 	c #DCDCDC",
"F 	c #0B0B0B",
"G 	c #212121",
"H 	c #E4E4E4",
"I 	c #C0C0C0",
"J 	c #050505",
"K 	c #393939",
"L 	c #020202",
"M 	c #404040",
"N 	c #D0D0D0",
"O 	c #8E8E8D",
"P 	c #4C4B45",
"Q 	c #14130E",
"R 	c #606060",
"S 	c #090909",
"T 	c #C3C3C3",
"U 	c #CDCDCD",
"V 	c #595954",
"W 	c #625D40",
"X 	c #9A915A",
"Y 	c #7B7145",
"Z 	c #302C1C",
"` 	c #7D7D7D",
" .	c #080808",
"..	c #767676",
"+.	c #B8B8B8",
"@.	c #5B5A57",
"#.	c #827B4B",
"$.	c #D5C774",
"%.	c #DBC86F",
"&.	c #C7B05A",
"*.	c #8E804C",
"=.	c #221F16",
"-.	c #6E6E6E",
";.	c #AEAEAE",
">.	c #C6C6C6",
",.	c #888886",
"'.	c #474539",
").	c #ABA15F",
"!.	c #E4D377",
"~.	c #D5C06A",
"{.	c #C9B055",
"].	c #C8B15D",
"^.	c #AD9F65",
"/.	c #2A271B",
"(.	c #282828",
"_.	c #0C0C0C",
":.	c #C5C5C5",
"<.	c #878784",
"[.	c #625D3E",
"}.	c #C4B768",
"|.	c #E6D479",
"1.	c #CEB760",
"2.	c #C9B056",
"3.	c #C3AD5B",
"4.	c #AA9A5B",
"5.	c #6D633D",
"6.	c #1E1C14",
"7.	c #060606",
"8.	c #414141",
"9.	c #595856",
"0.	c #837B4B",
"a.	c #D7C971",
"b.	c #E1CE76",
"c.	c #CCB45B",
"d.	c #C9B158",
"e.	c #C0AB5D",
"f.	c #A89757",
"g.	c #5E5534",
"h.	c #818181",
"i.	c #3F3E33",
"j.	c #9C9253",
"k.	c #E8D97B",
"l.	c #D9C56E",
"m.	c #CAB258",
"n.	c #C8B056",
"o.	c #C0AC66",
"p.	c #A39152",
"q.	c #534B2E",
"r.	c #12120E",
"s.	c #959595",
"t.	c #474644",
"u.	c #9E9C85",
"v.	c #F4F0CC",
"w.	c #E3D6A1",
"x.	c #CBB35C",
"y.	c #C6B05A",
"z.	c #B7A664",
"A.	c #8A7C45",
"B.	c #4C4734",
"C.	c #282827",
"D.	c #8F8F8F",
"E.	c #52524C",
"F.	c #EAEADB",
"G.	c #FAFAF1",
"H.	c #F9F8EE",
"I.	c #D7CA96",
"J.	c #AF9D5A",
"K.	c #827543",
"L.	c #535041",
"M.	c #464646",
"N.	c #C8C8C8",
"O.	c #3D3D3C",
"P.	c #B8B9AE",
"Q.	c #FBFBF4",
"R.	c #FCFDF9",
"S.	c #FAF9F1",
"T.	c #D2CAA7",
"U.	c #786D40",
"V.	c #49473A",
"W.	c #9C9C9C",
"X.	c #B4B4B4",
"Y.	c #6B6B6B",
"Z.	c #666666",
"`.	c #434340",
" +	c #C3C4BF",
".+	c #FAFAF7",
"++	c #F1F1E8",
"@+	c #D8D8C8",
"#+	c #797764",
"$+	c #403F37",
"%+	c #A9A9A9",
"&+	c #343434",
"*+	c #787878",
"=+	c #D2D2D2",
"-+	c #B2B2B2",
";+	c #505050",
">+	c #111111",
",+	c #3A3A39",
"'+	c #A7A8A1",
")+	c #75756D",
"!+	c #484845",
"~+	c #575757",
"{+	c #C9C9C9",
"]+	c #202020",
"^+	c #7B7B7B",
"/+	c #5D5D5D",
"(+	c #0D0D0D",
"_+	c #171717",
":+	c #181818",
"<+	c #727272",
"[+	c #2D2D2D",
"}+	c #222221",
"|+	c #30302F",
"1+	c #565655",
"2+	c #3C3C3B",
"3+	c #616161",
"4+	c #161616",
"5+	c #5E5E5E",
"6+	c #8C8C8C",
"7+	c #A3A3A3",
"8+	c #1F1F1E",
"9+	c #555555",
"0+	c #7C7C7C",
"a+	c #878787",
"b+	c #939393",
"                                                ",
"      . + @ @ @ @ @ @ @ @ @ @ @ @ @ #           ",
"    $ % % % % % % % % % % % % % % % % &         ",
"  * = - ; > , , ' ) ! ~ { ] ^ / ( _ : < [       ",
"  } | 1 2 2 3 4 4 5 6 7 8 9 9 0 a a b c d       ",
"  e f g h 3 5 i j k l m n 9 0 a a o p q r       ",
"  e f 2 4 4 s t % u v w % x y y o z A w r       ",
"  e f 3 5 5 B C D 0 0 E F G o o z H I w r       ",
"  e f 9 9 7 9 9 0 a a y < J z H H > b K r       ",
"  e f _ ! 8 0 a a y o / L M H > ; N O P Q B     ",
"  e f 9 0 9 a y y o z R S T > ; U V W X Y Z `   ",
"  e f 9 0 0 y o o z H  ...; ; +.@.#.$.%.&.*.=.  ",
"  e -.0 a a o z z H ;.% >./ ,.'.).!.~.{.].^./.  ",
"  e -.a y y H H > ; (._.:.<.[.}.|.1.2.3.4.5.6.  ",
"  e } ! ' o H > ; ; 7.8.9.0.a.b.c.d.e.f.g.=.h.  ",
"  e } i { z ; ; , ' n i.j.k.l.m.n.o.p.q.r.s.    ",
"  e } > > > , , ' ( t.u.v.w.x.y.z.A.B.C.r       ",
"  e } > ; ; ' ) ! D.E.F.G.H.I.J.K.L.} M.r       ",
"  e d , ' , ) ! N.O.P.Q.R.S.T.U.V.W.X.c r       ",
"  Y.Z.' ' ' ! ^ e `. +.+++@+#+$+%+i ;.&+e       ",
"  *+c =+! ) { -+;+>+,+'+)+!+~+. - {+B ]+^+      ",
"    /+(+_+:+_+<+[+}+|+1+2+3+$ 4+4+4+J 5+        ",
"      6+h.* * 7+8+9+*+0+a+* * * * * b+          ",
"                                                "};
