/* XPM */
static char *news_compose[]={
"24 24 8 1",
". c None",
"c c #001937",
"# c #002149",
"f c #00306a",
"b c #58a8ff",
"e c #a8dcff",
"d c #c6e9ff",
"a c #ffffff",
"........................",
".....##############.....",
".....#aaaaaaaaaaaa#.....",
".....#ab#a#######a#.....",
".....#a#baabbbbbaa#c....",
".....#aaaaaaaaaaaacdc...",
".....#aaaaaaaaaaacddc...",
".....#a#####a###cddc....",
".....#aeeeeeaeecddc.....",
".....#a#####a#cddc#.....",
".....#aeeeeeacddca#.....",
".....#a#####cddcaa#.....",
".....#aeeeecddcaaa#.....",
".....#a###fdccaaaa#.....",
".....#aeeeccaaaaaa#.....",
".....#aaaaaaa####a#.....",
".....#aaaaaaaeeeea#.....",
".....#aaaaaaa####a#.....",
".....#aaaaaaaeeeea#.....",
".....#aaaaaaaaaaaa#.....",
".....##############.....",
"........................",
"........................",
"........................"};
