/* XPM */
static char *mail_receive[]={
"24 24 5 1",
". c None",
"# c #002149",
"b c #00306a",
"c c #a8dcff",
"a c #ffffff",
"........................",
"........................",
"........................",
"........................",
"........................",
"....#################...",
"....##aaaaaaaaaaaaa##...",
"....#a#aaaaaaaaaaa#a#...",
"....#aa#aaaaaaaaa#aa#...",
"....#aaa#aaaaaaa#aaa#...",
"...bbbbaa#aaaaa#aaaa#...",
"...bccbaaa#aaa#aaaaa#...",
"...bccbaa#a###a#aaaa#...",
"...bccba#aaaaaaa#aaa#...",
"...bccb#aaaaaaaaa#aa#...",
"...bccbaaaaaaaaaaa#a#...",
"..bbccbbaaaaaaaaaaa##...",
".bccccccb############...",
"..bccccb................",
"...bccb.................",
"....bb..................",
"........................",
"........................",
"........................"};
