/* XPM */
static char * drafts_open_xpm[] = {
"16 16 119 2",
"  	c None",
". 	c #B3B3B3",
"+ 	c #6A6A6A",
"@ 	c #676767",
"# 	c #686868",
"$ 	c #989898",
"% 	c #474747",
"& 	c #898989",
"* 	c #A5A5A5",
"= 	c #A4A4A4",
"- 	c #A3A3A3",
"; 	c #A2A2A2",
"> 	c #9F9F9F",
", 	c #3B3B3B",
"' 	c #797979",
") 	c #3D3D3D",
"! 	c #D0D0D0",
"~ 	c #E2E2E2",
"{ 	c #E4E4E4",
"] 	c #E6E6E6",
"^ 	c #E7E7E7",
"/ 	c #E8E8E8",
"( 	c #EAEAEA",
"_ 	c #ECECEC",
": 	c #EDEDED",
"< 	c #3F3F3F",
"[ 	c #808080",
"} 	c #E3E3E3",
"| 	c #C1C1C1",
"1 	c #E5E5E5",
"2 	c #F0F0F0",
"3 	c #2A2A2A",
"4 	c #D1D1D1",
"5 	c #BDBDBD",
"6 	c #181716",
"7 	c #CBCBCB",
"8 	c #CCCCCC",
"9 	c #CDCDCD",
"0 	c #CECECE",
"a 	c #EFEFEF",
"b 	c #282828",
"c 	c #2F2F2E",
"d 	c #414040",
"e 	c #858582",
"f 	c #585856",
"g 	c #DCDCDC",
"h 	c #DEDEDE",
"i 	c #F2F2F2",
"j 	c #3C3C3C",
"k 	c #878787",
"l 	c #BFC0B8",
"m 	c #FCFCF6",
"n 	c #E7E7D8",
"o 	c #57543F",
"p 	c #F3F3F3",
"q 	c #F4F4F4",
"r 	c #EBEBEB",
"s 	c #C9C9C9",
"t 	c #6D6D65",
"u 	c #FAFAEE",
"v 	c #F7F5E9",
"w 	c #C9BC5D",
"x 	c #66655F",
"y 	c #DDDDDD",
"z 	c #626260",
"A 	c #C2B479",
"B 	c #D2BE6D",
"C 	c #D0B858",
"D 	c #999046",
"E 	c #8B8B8B",
"F 	c #D3D3D3",
"G 	c #EEEEEE",
"H 	c #545043",
"I 	c #CDB355",
"J 	c #C8AF53",
"K 	c #DAC55E",
"L 	c #676236",
"M 	c #F8F8F8",
"N 	c #D4D4D4",
"O 	c #50492F",
"P 	c #D5BA58",
"Q 	c #C8AE53",
"R 	c #DAC960",
"S 	c #585542",
"T 	c #AAAAAA",
"U 	c #685C30",
"V 	c #D4B958",
"W 	c #C8B054",
"X 	c #B0A44F",
"Y 	c #9C9C9C",
"Z 	c #F1F1F1",
"` 	c #E9E9E9",
" .	c #9B9B9B",
"..	c #887739",
"+.	c #D2B857",
"@.	c #6F622F",
"#.	c #BCBCBC",
"$.	c #F5F5F5",
"%.	c #F6F6F6",
"&.	c #888886",
"*.	c #5C5744",
"=.	c #919190",
"-.	c #FAFAFA",
";.	c #272727",
">.	c #4E4E4E",
",.	c #606060",
"'.	c #747474",
").	c #727272",
"!.	c #717171",
"~.	c #717170",
"{.	c #707070",
"].	c #6F6F6F",
"^.	c #6E6E6E",
"/.	c #696969",
"(.	c #363636",
"_.	c #979797",
":.	c #939393",
"<.	c #989897",
"[.	c #929292",
"  . + @ @ @ @ @ @ @ @ # $       ",
"  % & * * * = - - ; ; > , '     ",
"  ) ! ~ { ] ^ / ( ( _ : / < [   ",
"  ) ! } | ] 1 ^ / ( ( _ 2 ~ 3   ",
"  ) 4 5 6 ) = 7 7 8 9 0 a _ b   ",
"  ) ! / c d e f | g h h i _ b   ",
"  j 4 / k l m n o ( i p q r b   ",
"  j 4 ( s t u v w x y y q r b   ",
"  j 4 _ 0 z A B C D E F q r b   ",
"  j 4 : G ( H I J K L F M r b   ",
"  j 4 G ] ] N O P Q R S i r b   ",
"  j 4 2 ! ! ! T U V W X Y ( b   ",
"  j 4 Z ] ^ / `  ...+.@.#.( b   ",
"  j 4 Z i p q $.%.&.*.=.-.` ;.  ",
"  >.,.'.).).!.~.{.{.!.].^./.(.  ",
"    $ _.:.<.$ _.[.$ $ $ $ $     "};
