/* XPM */
static char * drafts_open_xpm[] = {
"16 12 34 1",
" 	c None",
".	c #000000",
"+	c #D7D7D8",
"@	c #DEDEDE",
"#	c #CCCCCD",
"$	c #BBBBBD",
"%	c #DCDCDD",
"&	c #CBCBCC",
"*	c #898989",
"=	c #3B3737",
"-	c #DADADB",
";	c #C9C9CA",
">	c #FFFFFF",
",	c #D9D9DA",
"'	c #C8C8C9",
")	c #060606",
"!	c #0A0A0A",
"~	c #242424",
"{	c #E4E3E3",
"]	c #F8F8F8",
"^	c #F0F0F0",
"/	c #E9E9E9",
"(	c #E2E1E1",
"_	c #101010",
":	c #F5F4F5",
"<	c #EFEFEF",
"[	c #E7E7E7",
"}	c #E0E0E0",
"|	c #1D1D1D",
"1	c #ECECEC",
"2	c #E6E6E6",
"3	c #E2E3E3",
"4	c #DCDBDC",
"5	c #868686",
"   .....        ",
"  .++@#$....... ",
"  .++%&*======*.",
"  .++-;=>>>>>>=.",
"  .++,'=>====>=.",
"  .+++.=>>>>>>=.",
"...)!~{=>====>=.",
" .>]^/(=>>>>>>=.",
"  _:<[}=>====>=.",
"   |12@=>>>>>>=.",
"    )34*======5.",
"     .......... "};
