/* XPM */
static char *trash_close[]={
"16 12 11 1",
". c None",
"h c #000000",
"# c #303030",
"i c #808080",
"g c #989898",
"f c #a9a9a9",
"e c #bababa",
"d c #cccccc",
"c c #dddddd",
"b c #eeeeee",
"a c #ffffff",
".....#######....",
"....#abcdefg#...",
"....#hhhhhhh#...",
"....#abcdefg#...",
"....#abidifg#...",
"....#abidifg#...",
"....#abidifg#...",
"....#abidifg#...",
"....#abidifg#...",
"....#abidifg#...",
"....#abcdefg#...",
".....#######...."};
