/* XPM */
static char * address_xpm[] = {
"16 16 56 1",
" 	c None",
".	c #272D40",
"+	c #2F3C64",
"@	c #2C3757",
"#	c #22252B",
"$	c #374E8D",
"%	c #364A85",
"&	c #35487F",
"*	c #364B89",
"=	c #384F91",
"-	c #384F90",
";	c #374F90",
">	c #364D8C",
",	c #252B38",
"'	c #31416E",
")	c #242935",
"!	c #23262F",
"~	c #324371",
"{	c #364B88",
"]	c #364A86",
"^	c #354881",
"/	c #324372",
"(	c #232630",
"_	c #303E68",
":	c #324270",
"<	c #2E3C61",
"[	c #2F3D65",
"}	c #303D66",
"|	c #2C385A",
"1	c #22262D",
"2	c #30406A",
"3	c #374E8F",
"4	c #324271",
"5	c #252A36",
"6	c #242833",
"7	c #22262E",
"8	c #303E69",
"9	c #35477E",
"0	c #324374",
"a	c #35477F",
"b	c #364D8A",
"c	c #31406C",
"d	c #344679",
"e	c #334475",
"f	c #252B37",
"g	c #344579",
"h	c #34467B",
"i	c #334474",
"j	c #364983",
"k	c #374D8C",
"l	c #252A37",
"m	c #262C3D",
"n	c #2D395B",
"o	c #2C3858",
"p	c #2A334B",
"q	c #212227",
"                ",
"                ",
"                ",
" .++++++++++++@#",
" +$%&&*=-----;>,",
" +%')!~-{{]^;;>,",
" +%'/(_-:+<[/]>,",
" +%}|12-$$;;33>,",
" +45678-/290a{b,",
" +%c22d-:/de}]bf",
" +bghi^;jk&^{>*f",
" +3]j%;;jk&^]>*l",
" mnnnnnn||oooopq",
"                ",
"                ",
"                "};
