/* XPM */
static char * outbox_close_hrm_xpm[] = {
"16 16 45 1",
" 	c None",
".	c #000000",
"+	c #E9DDDB",
"@	c #DBC9C5",
"#	c #AF948F",
"$	c #F6F0EE",
"%	c #B9968F",
"&	c #CAABA4",
"*	c #C8A5A0",
"=	c #BF9C95",
"-	c #7C5952",
";	c #ECDBD8",
">	c #F8F4F2",
",	c #EAD9D6",
"'	c #EAD8D4",
")	c #E9D7D3",
"!	c #E7D5D1",
"~	c #CEB3AE",
"{	c #F8F6F6",
"]	c #DFC4BD",
"^	c #DFC2BB",
"/	c #DDBDB9",
"(	c #DBBBB7",
"_	c #DBBAB3",
":	c #D8B5B0",
"<	c #D7B6AF",
"[	c #D6B3AC",
"}	c #D4AEA8",
"|	c #D4AFA6",
"1	c #A3756F",
"2	c #FFFFFF",
"3	c #D2ABA4",
"4	c #D0A9A2",
"5	c #A2746A",
"6	c #DF421E",
"7	c #EFEFEF",
"8	c #CCCCCC",
"9	c #CEA7A0",
"0	c #CEA49C",
"a	c #9F6D67",
"b	c #CBA099",
"c	c #CA9C96",
"d	c #9E6C64",
"e	c #C79993",
"f	c #724C46",
"                ",
"                ",
"   ....         ",
"  .+@@#.        ",
" .$%&*=-....... ",
" .;>;;;,;''))!~.",
" .{]^/(_:<<[}|1.",
".........<<[}|1.",
".2222222.}}|345.",
".2666678.33490a.",
".2666778.990bcd.",
".2666678.bbceed.",
".2676668.eeeeed.",
".2777678.dddddf.",
".2888888....... ",
".........       "};
