/* XPM */
static char * mail_attach[] = {
"24 24 35 1",
" 	c None",
".	c #515151",
"+	c #A0A0A0",
"@	c #1B1B1B",
"#	c #EFEFEF",
"$	c #000000",
"%	c #C8B7D0",
"&	c #A080B0",
"*	c #644474",
"=	c #280838",
"-	c #3C3C3C",
";	c #14041C",
">	c #8C7C94",
",	c #787878",
"'	c #504058",
")	c #6C447A",
"!	c #B3B3B3",
"~	c #A07CA8",
"{	c #C8B3D0",
"]	c #C8B7CC",
"^	c #C4B7C8",
"/	c #C4B3CC",
"(	c #9C7CA0",
"_	c #987CA4",
":	c #8C788C",
"<	c #9880A4",
"[	c #141414",
"}	c #BFB7BF",
"|	c #907C94",
"1	c #BFB3C4",
"2	c #807880",
"3	c #BBB3BB",
"4	c #403C40",
"5	c #B7B3B7",
"6	c #1A1717",
"                        ",
" .++++++++++++++++++++@ ",
" .####################$$",
" .##############$$$$$$$$",
" .#%%&&#&&%&&%*$$$$$$$$$",
" .#%&&&%%&&&&=$$#####$$$",
" .#%&&%&&&&&-$$$$$;&&$$$",
" .###&&&&&>$$$$$$$$,#$$$",
" .#%&&&&&;$$$$&&&%$'#$$$",
" .#%%&%*;$$$$&&###$,$$$$",
" .#%&&)$$$$%&&&&&$$$$$$$",
" .#%%;$$$$%&&&&&$$$$!#$$",
" .#>;$$$&&&&&%&*$$$>&#$$",
" .,$$$$~{]{###$$$-!###$$",
" $$$$$^/(_(_:$$$,#####$$",
"$$$$$&&&%&&$$$-><#&%##$$",
"$[#}|1|||1$$$,########$$",
"$[#%&%&&$$$$2#########$$",
" $-###%$$$$&%&&%&&&3##$$",
" .$4%$$$$>&&&5525&&&%#$$",
" .!$$$$-##############$$",
" .,-$$$,,,,,,,,,,,,,,,$$",
"  $$$6$$$$$$$$$$$$$$$$$$",
"                        "};
