/* XPM */
static char * outbox_close_hrm_xpm[] = {
"16 16 205 2",
"  	c None",
". 	c #B6B6B6",
"+ 	c #B8B8B8",
"@ 	c #BBBBBB",
"# 	c #BCBCBC",
"$ 	c #B9B9B9",
"% 	c #CCB7B7",
"& 	c #B5B5B5",
"* 	c #B75454",
"= 	c #737373",
"- 	c #BE5D5D",
"; 	c #BF6767",
"> 	c #BF6768",
", 	c #BF5F5F",
"' 	c #928083",
") 	c #B9595C",
"! 	c #828485",
"~ 	c #BC5454",
"{ 	c #828282",
"] 	c #BA5050",
"^ 	c #BA7D7D",
"/ 	c #B44B4B",
"( 	c #878787",
"_ 	c #B93D3D",
": 	c #E06262",
"< 	c #DA5D5D",
"[ 	c #D94142",
"} 	c #D54547",
"| 	c #D75B5C",
"1 	c #B03A40",
"2 	c #C0474B",
"3 	c #EF4343",
"4 	c #D75B5B",
"5 	c #E86A6A",
"6 	c #D25555",
"7 	c #AF4141",
"8 	c #8A8A8A",
"9 	c #A76767",
"0 	c #E26060",
"a 	c #ED6E6E",
"b 	c #E86969",
"c 	c #EB4747",
"d 	c #CF5255",
"e 	c #E66868",
"f 	c #BB4448",
"g 	c #C1494D",
"h 	c #EA6B6B",
"i 	c #EC6D6D",
"j 	c #F07171",
"k 	c #C04B4B",
"l 	c #868686",
"m 	c #C06767",
"n 	c #CE8383",
"o 	c #595A5B",
"p 	c #575A5B",
"q 	c #4D565C",
"r 	c #5B5D5E",
"s 	c #44525A",
"t 	c #49575F",
"u 	c #636461",
"v 	c #5F5F5D",
"w 	c #D75858",
"x 	c #B74545",
"y 	c #838383",
"z 	c #BD6565",
"A 	c #D35758",
"B 	c #DF6162",
"C 	c #676C6D",
"D 	c #666A6B",
"E 	c #77746F",
"F 	c #485962",
"G 	c #616A6C",
"H 	c #8C887C",
"I 	c #767168",
"J 	c #D45555",
"K 	c #EE6F6F",
"L 	c #BB4949",
"M 	c #8B8B8B",
"N 	c #BC5F61",
"O 	c #C44A4D",
"P 	c #CC4D51",
"Q 	c #4E595E",
"R 	c #616968",
"S 	c #74756E",
"T 	c #6F716C",
"U 	c #505E63",
"V 	c #928B7B",
"W 	c #9E8D74",
"X 	c #8C7D66",
"Y 	c #D65755",
"Z 	c #C14848",
"` 	c #818181",
" .	c #767A7D",
"..	c #C2494C",
"+.	c #CD5355",
"@.	c #6A6559",
"#.	c #A68D69",
"$.	c #92846B",
"%.	c #606966",
"&.	c #616863",
"*.	c #A28F6D",
"=.	c #BFA172",
"-.	c #B89E70",
";.	c #D95957",
">.	c #EF7070",
",.	c #B84545",
"'.	c #B7B7B7",
").	c #C05B5C",
"!.	c #CC5356",
"~.	c #CF5457",
"{.	c #7D6549",
"].	c #A98150",
"^.	c #6B6759",
"/.	c #646356",
"(.	c #957949",
"_.	c #76694B",
":.	c #9D8656",
"<.	c #A28349",
"[.	c #D75854",
"}.	c #C54B4B",
"|.	c #7E7F7F",
"1.	c #84898D",
"2.	c #B33E42",
"3.	c #AE494F",
"4.	c #414C50",
"5.	c #444A4B",
"6.	c #394247",
"7.	c #363029",
"8.	c #422E17",
"9.	c #312616",
"0.	c #343028",
"a.	c #3A3933",
"b.	c #BD4346",
"c.	c #CD5356",
"d.	c #B24546",
"e.	c #919394",
"f.	c #C8B6B7",
"g.	c #B55154",
"h.	c #B33D43",
"i.	c #BB4449",
"j.	c #BF484C",
"k.	c #CE5457",
"l.	c #D25759",
"m.	c #BD4447",
"n.	c #C14547",
"o.	c #D05253",
"p.	c #CC4D4D",
"q.	c #DC5D5E",
"r.	c #E86A6B",
"s.	c #ED6F70",
"t.	c #C1494A",
"u.	c #7D7E7E",
"v.	c #838687",
"w.	c #CD5253",
"x.	c #EC6E6E",
"y.	c #F26666",
"z.	c #F46060",
"A.	c #EC6E6F",
"B.	c #BF4447",
"C.	c #975358",
"D.	c #9A5458",
"E.	c #C34647",
"F.	c #EA6B6C",
"G.	c #B54A4A",
"H.	c #929292",
"I.	c #BB5151",
"J.	c #E96A6A",
"K.	c #F55959",
"L.	c #F65959",
"M.	c #B64848",
"N.	c #D25556",
"O.	c #C04649",
"P.	c #BC4448",
"Q.	c #CE5558",
"R.	c #D3595C",
"S.	c #B03B3E",
"T.	c #7C8082",
"U.	c #C57B7B",
"V.	c #D35656",
"W.	c #F06D6D",
"X.	c #EF7171",
"Y.	c #E95657",
"Z.	c #E86B6C",
"`.	c #D3787A",
" +	c #B24747",
".+	c #919293",
"++	c #BD4848",
"@+	c #A75151",
"#+	c #BC4A4A",
"$+	c #BE4949",
"%+	c #686868",
"&+	c #C34C4C",
"*+	c #696969",
"=+	c #C44B4B",
"-+	c #B64A4A",
";+	c #AA3636",
">+	c #7E7E7E",
",+	c #888888",
"'+	c #808080",
")+	c #8E8E8E",
"!+	c #919191",
"~+	c #7B7B7B",
"{+	c #7D7D7D",
"]+	c #909090",
"^+	c #939393",
"  .   + @ # $   %   .   &   &   ",
". * = - ; > , ' ) ! ~ { ] ^ / ( ",
"  = _ : < [ } | 1 2 3 4 5 6 7 8 ",
"  9 0 a b c d e f g h i j j k l ",
"  m n b o p q r s t u v w i x y ",
"  z A B p C D E F G H I J K L M ",
"  N O P Q R S T U V W X Y K Z ` ",
"   ...+.@.#.$.%.&.*.=.-.;.>.,.M ",
"'.).!.~.{.].^./.(._.:.<.[.j }.|.",
"  1.2.3.4.5.6.7.8.9.0.a.b.c.d.e.",
"f.g.h.i.j.k.l.m.n.o.p.q.r.s.t.u.",
"  v.w.3 x.y.z.A.B.C.D.E.F.a G.H.",
"& I.J.K.K.L.L.L.M.N.O.P.Q.R.S.T.",
"  U.V.>.a W.W.>.i a X.Y.Z.`. +.+",
"& / 7 ++@+#+$+%+&+*+=+*+=+-+;+>+",
"  ,+8 l y M '+)+>+!+~+H.{+]+>+^+"};
