/* XPM */
static char * privacy_emblem_warn_xpm[] = {
"9 11 48 1",
" 	c None",
".	c #000000",
"+	c #2B2B2B",
"@	c #F3EFE0",
"#	c #F4E5B3",
"$	c #CDB86D",
"%	c #F4F0E4",
"&	c #8F99A2",
"*	c #5C5C5C",
"=	c #828282",
"-	c #F2E1A5",
";	c #454545",
">	c #363636",
",	c #EED680",
"'	c #343434",
")	c #313131",
"!	c #2C2C2C",
"~	c #F9F9F9",
"{	c #F2F1E8",
"]	c #EDECE1",
"^	c #EBE9DF",
"/	c #E9E8DD",
"(	c #E5E3D7",
"_	c #AFAC9F",
":	c #F3F1E7",
"<	c #DFDAC1",
"[	c #CCC49C",
"}	c #C7C099",
"|	c #C4BE94",
"1	c #C0BA90",
"2	c #827A5A",
"3	c #F4F3EA",
"4	c #DED9C0",
"5	c #CAC29A",
"6	c #C6BE96",
"7	c #C2BC92",
"8	c #BEB88E",
"9	c #7E7758",
"0	c #F7F5EF",
"a	c #DAD5B8",
"b	c #C8C19A",
"c	c #BDB78D",
"d	c #DFDED9",
"e	c #9D9A8D",
"f	c #7C7558",
"g	c #7B7455",
"h	c #7A7454",
"i	c #59533B",
"   ...   ",
"  +@#$.  ",
" .%&*=$. ",
" .-; >,. ",
".'$)!'$..",
".~{]^/(_.",
".:<[}|12.",
".3456789.",
".0ab|1c9.",
".def9ghi.",
"........."};
