/* XPM */
static char * dir_open_xpm[] = {
"16 12 92 2",
"  	c None",
". 	c #000000",
"+ 	c #D7D7D8",
"@ 	c #DEDEDE",
"# 	c #CCCCCD",
"$ 	c #BBBBBD",
"% 	c #DCDCDD",
"& 	c #CBCBCC",
"* 	c #BABABB",
"= 	c #A8A8AA",
"- 	c #979799",
"; 	c #868688",
"> 	c #757578",
", 	c #646467",
"' 	c #525256",
") 	c #414145",
"! 	c #DADADB",
"~ 	c #C9C9CA",
"{ 	c #B8B8BA",
"] 	c #A7A7A9",
"^ 	c #969698",
"/ 	c #848487",
"( 	c #737376",
"_ 	c #626265",
": 	c #515154",
"< 	c #3F3F43",
"[ 	c #D9D9DA",
"} 	c #C8C8C9",
"| 	c #B6B6B8",
"1 	c #A5A5A7",
"2 	c #949496",
"3 	c #838385",
"4 	c #727275",
"5 	c #606064",
"6 	c #4F4F53",
"7 	c #707073",
"8 	c #5F5F62",
"9 	c #4E4E51",
"0 	c #060606",
"a 	c #0A0A0A",
"b 	c #242424",
"c 	c #E4E3E3",
"d 	c #DBDBDB",
"e 	c #D4D3D4",
"f 	c #CCCCCC",
"g 	c #C5C5C5",
"h 	c #5D5D61",
"i 	c #4C4C50",
"j 	c #FFFFFF",
"k 	c #F8F8F8",
"l 	c #F0F0F0",
"m 	c #E9E9E9",
"n 	c #E2E1E1",
"o 	c #DBDADA",
"p 	c #D3D3D3",
"q 	c #CCCCCB",
"r 	c #C4C4C4",
"s 	c #BCBBBB",
"t 	c #020202",
"u 	c #4A4A4E",
"v 	c #101010",
"w 	c #F5F4F5",
"x 	c #EFEFEF",
"y 	c #E7E7E7",
"z 	c #E0E0E0",
"A 	c #D9D9D8",
"B 	c #D1D1D1",
"C 	c #CACACA",
"D 	c #C3C2C3",
"E 	c #BBBBBB",
"F 	c #B3B3B3",
"G 	c #1D1D1D",
"H 	c #ECECEC",
"I 	c #E6E6E6",
"J 	c #D7D7D7",
"K 	c #CFCFCF",
"L 	c #C8C8C8",
"M 	c #C0C0C1",
"N 	c #B9B9B9",
"O 	c #B2B2B2",
"P 	c #AAA9A9",
"Q 	c #080808",
"R 	c #E2E3E3",
"S 	c #DCDBDC",
"T 	c #D4D4D4",
"U 	c #CDCCCD",
"V 	c #C5C5C6",
"W 	c #BEBEBE",
"X 	c #B7B6B6",
"Y 	c #AFAFAF",
"Z 	c #A8A8A8",
"` 	c #A1A1A0",
"      . . . . .                 ",
"    . + + @ # $ . . . . . . .   ",
"    . + + % & * = - ; > , ' ) . ",
"    . + + ! ~ { ] ^ / ( _ : < . ",
"    . + + [ } | 1 2 3 4 5 6 < . ",
"    . + + + . . . . . 7 8 9 < . ",
". . . 0 a b c d e f g . h i < . ",
"  . j k l m n o p q r s t u < . ",
"    v w x y z A B C D E F . < . ",
"      G H I @ J K L M N O P Q . ",
"        0 R S T U V W X Y Z ` . ",
"          . . . . . . . . . .   "};
