/* XPM */
static char * replied_xpm[] = {
"16 16 9 1",
" 	c None",
".	c #000000",
"+	c #AEC5A8",
"@	c #6B9063",
"#	c #C1D6BD",
"$	c #A7C5A4",
"%	c #445B2C",
"&	c #5B7950",
"*	c #506B46",
"                ",
"                ",
"        .       ",
"       ..       ",
"      .+.       ",
"     .@#.....   ",
"    .@$####+.   ",
"   .@$$$$$$#.   ",
"   .%@&@&@&$.   ",
"    .%@&*%*&.   ",
"     .%@.....   ",
"      .%.       ",
"       ..       ",
"        .       ",
"                ",
"                "};
