/* XPM */
/* Brand Huntsman */
/* modified from 'stk' theme */
static char * mail_sign[] = {
"24 24 2 1",
"  c None",
"# c #000000",
"                        ",
"                        ",
"                        ",
"                        ",
"                        ",
"                        ",
"       ##               ",
"      ####              ",
"      #####             ",
"      # ####            ",
"      #  ####           ",
"       #  ####          ",
"        #  ####         ",
"         ## ####        ",
"             ####       ",
"              ###       ",
"               ###      ",
"                 #      ",
"                        ",
"                        ",
"                        ",
"                        ",
"                        ",
"                        "};
