/* XPM */
static char * drafts_close_hrm_xpm[] = {
"16 16 105 2",
"  	c None",
". 	c #B3B3B3",
"+ 	c #6A6A6A",
"@ 	c #676767",
"# 	c #686868",
"$ 	c #989898",
"% 	c #474747",
"& 	c #C44545",
"* 	c #D15252",
"= 	c #D05252",
"- 	c #D05151",
"; 	c #CF5151",
"> 	c #CE4F4F",
", 	c #3B3B3B",
"' 	c #797979",
") 	c #3D3D3D",
"! 	c #E95E5E",
"~ 	c #F07171",
"{ 	c #F17272",
"] 	c #F27373",
"^ 	c #F37474",
"/ 	c #F47575",
"( 	c #F57676",
"_ 	c #3F3F3F",
": 	c #808080",
"< 	c #DF6060",
"[ 	c #F77878",
"} 	c #2A2A2A",
"| 	c #EB5757",
"1 	c #DD5E5E",
"2 	c #181716",
"3 	c #E46565",
"4 	c #E56666",
"5 	c #E66767",
"6 	c #F67777",
"7 	c #282828",
"8 	c #2F2F2E",
"9 	c #414040",
"0 	c #858582",
"a 	c #585856",
"b 	c #ED6E6E",
"c 	c #EE6F6F",
"d 	c #F87979",
"e 	c #3C3C3C",
"f 	c #C24343",
"g 	c #BFC0B8",
"h 	c #FCFCF6",
"i 	c #E7E7D8",
"j 	c #57543F",
"k 	c #F97A7A",
"l 	c #E36464",
"m 	c #6D6D65",
"n 	c #FAFAEE",
"o 	c #F7F5E9",
"p 	c #C9BC5D",
"q 	c #B2322F",
"r 	c #626260",
"s 	c #C2B479",
"t 	c #D2BE6D",
"u 	c #D0B858",
"v 	c #999046",
"w 	c #E86969",
"x 	c #545043",
"y 	c #CDB355",
"z 	c #C8AF53",
"A 	c #DAC55E",
"B 	c #676236",
"C 	c #FB7C7C",
"D 	c #E09494",
"E 	c #50492F",
"F 	c #D5BA58",
"G 	c #C8AE53",
"H 	c #DAC960",
"I 	c #585542",
"J 	c #E76464",
"K 	c #D45555",
"L 	c #685C30",
"M 	c #D4B958",
"N 	c #C8B054",
"O 	c #B0A44F",
"P 	c #CD4E4E",
"Q 	c #CC4D4D",
"R 	c #887739",
"S 	c #D2B857",
"T 	c #6F622F",
"U 	c #F98B8B",
"V 	c #C34443",
"W 	c #5C5744",
"X 	c #C74848",
"Y 	c #FC8E8E",
"Z 	c #272727",
"` 	c #4E4E4E",
" .	c #A43737",
"..	c #B93A3A",
"+.	c #B83939",
"@.	c #B83838",
"#.	c #B73838",
"$.	c #B73737",
"%.	c #B63737",
"&.	c #B43434",
"*.	c #363636",
"=.	c #979797",
"-.	c #939393",
";.	c #989897",
">.	c #929292",
"  . + @ @ @ @ @ @ @ @ # $       ",
"  % & * * * = - - ; ; > , '     ",
"  ) ! ~ { ] ] ^ / / ( ( ^ _ :   ",
"  ) ! ~ < ] { ] ^ / / ( [ ~ }   ",
"  ) | 1 2 ) * 3 3 4 4 5 6 ( 7   ",
"  ) ! ^ 8 9 0 a < b c c d ( 7   ",
"  e | ^ f g h i j / d d k / 7   ",
"  e | / l m n o p q b b k / 7   ",
"  e | ( 5 r s t u v & w k / 7   ",
"  e | ( 6 / x y z A B w C / 7   ",
"  e | 6 ] ] D E F G H I d / 7   ",
"  e | [ J J J K L M N O P / 7   ",
"  e | [ ] ] ^ ^ Q R S T 1 / 7   ",
"  e | [ d d k k U V W X Y ^ Z   ",
"  `  ...+.+.@.@.#.#.@.$.%.&.*.  ",
"    $ =.-.;.$ =.>.$ $ $ $ $     "};
