/* XPM */
static char * privacy_emblem_enabled_xpm[] = {
"16 16 150 2",
"  	c None",
". 	c #999999",
"+ 	c #616161",
"@ 	c #5E5E5E",
"# 	c #5D5D5D",
"$ 	c #595959",
"% 	c #7E7E7E",
"& 	c #969696",
"* 	c #727272",
"= 	c #B2B2B2",
"- 	c #D9D9D9",
"; 	c #DADADA",
"> 	c #C6C6C6",
", 	c #6A6A6A",
"' 	c #AEAEAE",
") 	c #646464",
"! 	c #CFCFCF",
"~ 	c #949494",
"{ 	c #494949",
"] 	c #444444",
"^ 	c #686868",
"/ 	c #6B6B6B",
"( 	c #797979",
"_ 	c #BDBDBD",
": 	c #9F9F9F",
"< 	c #3B3B3B",
"[ 	c #7A7A7A",
"} 	c #696969",
"| 	c #676767",
"1 	c #B9B9B9",
"2 	c #4A4A4A",
"3 	c #A8A8A8",
"4 	c #747474",
"5 	c #B8B8B8",
"6 	c #868686",
"7 	c #585858",
"8 	c #A7A7A7",
"9 	c #4B4B4B",
"0 	c #CECDCD",
"a 	c #414141",
"b 	c #9B9B9B",
"c 	c #5B554F",
"d 	c #54493E",
"e 	c #78736D",
"f 	c #6E665E",
"g 	c #463D33",
"h 	c #554A3D",
"i 	c #52473C",
"j 	c #635445",
"k 	c #7F776E",
"l 	c #5C4D3E",
"m 	c #4C3A26",
"n 	c #807E7C",
"o 	c #3F3A32",
"p 	c #ECD5B8",
"q 	c #E2C6A5",
"r 	c #DDBF9A",
"s 	c #D7B68B",
"t 	c #D1AF82",
"u 	c #D1AF81",
"v 	c #CEAB7C",
"w 	c #CAA26F",
"x 	c #C59660",
"y 	c #7B4D18",
"z 	c #B7B7B7",
"A 	c #3F3932",
"B 	c #E9CEAC",
"C 	c #D9B386",
"D 	c #D2A978",
"E 	c #CCA26B",
"F 	c #C79C65",
"G 	c #C89E66",
"H 	c #C49860",
"I 	c #BE8E50",
"J 	c #B8803C",
"K 	c #7B4C17",
"L 	c #434343",
"M 	c #3F3931",
"N 	c #E8CDAB",
"O 	c #D8B285",
"P 	c #CDA370",
"Q 	c #C69B64",
"R 	c #C1955D",
"S 	c #BD8E53",
"T 	c #B98646",
"U 	c #B67C38",
"V 	c #794A16",
"W 	c #D7B183",
"X 	c #CEA672",
"Y 	c #C79D66",
"Z 	c #C3975E",
"` 	c #C39760",
" .	c #C2975F",
"..	c #BF9156",
"+.	c #BB8747",
"@.	c #B57C37",
"#.	c #7A4C18",
"$.	c #E8CCAA",
"%.	c #D8B183",
"&.	c #D2AB78",
"*.	c #CCA36B",
"=.	c #C79D64",
"-.	c #C69C64",
";.	c #C69D64",
">.	c #C4965A",
",.	c #BE8A48",
"'.	c #B47A36",
").	c #815424",
"!.	c #3E3931",
"~.	c #E7CAA6",
"{.	c #D5AD7D",
"].	c #CAA069",
"^.	c #C2965E",
"/.	c #BD9056",
"(.	c #BD9158",
"_.	c #BE9258",
":.	c #BC8B4F",
"<.	c #B88242",
"[.	c #B47A35",
"}.	c #855B2D",
"|.	c #3F3830",
"1.	c #E6CAA7",
"2.	c #D5AD7E",
"3.	c #D0A771",
"4.	c #C9A068",
"5.	c #C59B62",
"6.	c #C69B62",
"7.	c #C39559",
"8.	c #BD8A49",
"9.	c #BB8443",
"0.	c #875F31",
"a.	c #716B62",
"b.	c #A68964",
"c.	c #A37D4E",
"d.	c #9D7443",
"e.	c #986F3B",
"f.	c #956C37",
"g.	c #976D38",
"h.	c #99703C",
"i.	c #9A6F3C",
"j.	c #986E3C",
"k.	c #946835",
"l.	c #604425",
"m.	c #636363",
"n.	c #B4B4B4",
"o.	c #A4A4A4",
"p.	c #404040",
"q.	c #979797",
"r.	c #B5B5B5",
"s.	c #B1B1B1",
"        . + @ # $ %             ",
"      & * = - ; > , , =         ",
"    ' ) ! ~ { ] ^ = % /         ",
"    ( _ : < [ . } | 1 2 3       ",
"    4 5 6 7 8     9 0 a b       ",
"  c d e f g h i i j k l m n     ",
"  o p q r s t u t v w x y { z   ",
"  A B C D E F G G H I J K L =   ",
"  M N O P Q R R R S T U V L =   ",
"  A N W X Y Z `  ...+.@.#.L =   ",
"  M $.%.&.*.=.-.;.>.,.'.).L =   ",
"  !.~.{.].^./.(._.:.<.[.}.L =   ",
"  |.1.2.3.4.5.6.6.7.8.9.0.L =   ",
"  a.b.c.d.e.f.g.h.i.j.k.l.m.n.  ",
"  o.) ] p.p.p.p.p.p.p.p.) q.    ",
"      r.s.s.s.s.s.s.s.s.        "};
