/* XPM */
static char * work_offline_xpm[] = {
"24 6 37 1",
" 	c None",
".	c #474747",
"+	c #414141",
"@	c #282828",
"#	c #2D2D2D",
"$	c #545454",
"%	c #818181",
"&	c #EFEFEF",
"*	c #E8E8E8",
"=	c #4A4A4A",
"-	c #D0D0D0",
";	c #CCCCCC",
">	c #676767",
",	c #F7F7F7",
"'	c #FAFAFA",
")	c #FFFFFF",
"!	c #F8F8F8",
"~	c #2F2F2F",
"{	c #6E6E6E",
"]	c #707070",
"^	c #5C5C5C",
"/	c #F2F2F2",
"(	c #F6F6F6",
"_	c #FEFEFE",
":	c #404040",
"<	c #4E4E4E",
"[	c #767676",
"}	c #E5E5E5",
"|	c #DEDEDE",
"1	c #464646",
"2	c #292929",
"3	c #424242",
"4	c #434343",
"5	c #3E3E3E",
"6	c #272727",
"7	c #212121",
"8	c #262626",
"      .+@    .+#+.      ",
"$$$$$%&*=   .-;>*&%$$$$$",
",,,,,')!$   ~{]^!)',,,,,",
"/////(_,$   :;;],_(/////",
"<<<<<[}|1   233.|}[<<<<<",
"      456    77854      "};
