/* XPM */
static char * outbox_open_hrm_xpm[] = {
"16 12 84 1",
" 	c None",
".	c #000000",
"+	c #F0E7D3",
"@	c #EDDFC9",
"#	c #E6D3B6",
"$	c #010101",
"%	c #DABE9B",
"&	c #0D0C0B",
"*	c #080604",
"=	c #040201",
"-	c #F2EAD5",
";	c #EDDFC7",
">	c #383836",
",	c #076A36",
"'	c #333434",
")	c #D7B58F",
"!	c #D2AB80",
"~	c #CCA072",
"{	c #C69665",
"]	c #C08D57",
"^	c #BC8249",
"/	c #826945",
"(	c #F2EAD6",
"_	c #707070",
":	c #01BC59",
"<	c #D2AB81",
"[	c #CCA172",
"}	c #C79665",
"|	c #C18C56",
"1	c #BB8248",
"2	c #F3E9D6",
"3	c #323333",
"4	c #148F4E",
"5	c #D1AB81",
"6	c #CBA173",
"7	c #C69764",
"8	c #C08C56",
"9	c #BB8148",
"0	c #3B3C3C",
"a	c #177343",
"b	c #C69866",
"c	c #BB8147",
"d	c #777777",
"e	c #222222",
"f	c #161616",
"g	c #191919",
"h	c #1D1D1D",
"i	c #2F2F2F",
"j	c #C18D58",
"k	c #BB8247",
"l	c #FDF6EA",
"m	c #E3CCAC",
"n	c #E2C9AB",
"o	c #E1C8A8",
"p	c #E0C7A6",
"q	c #E5D1B3",
"r	c #E4CFB0",
"s	c #E3CDAE",
"t	c #E2CCAC",
"u	c #E2C9AA",
"v	c #E0C8A7",
"w	c #E0C6A5",
"x	c #DEC4A2",
"y	c #F2B5B6",
"z	c #EFA8A8",
"A	c #ED9B9A",
"B	c #EB8C8D",
"C	c #E9807F",
"D	c #E77372",
"E	c #E56565",
"F	c #E35957",
"G	c #E14C4A",
"H	c #DB3D3B",
"I	c #070505",
"J	c #F0A8A8",
"K	c #ED9999",
"L	c #EB8C8B",
"M	c #E87F7E",
"N	c #E67070",
"O	c #E46463",
"P	c #E25655",
"Q	c #DF4848",
"R	c #DD3C3B",
"S	c #D23530",
"   .....        ",
"  .+@#$%&*=.... ",
"  .-;>,')!~{]^/.",
"  .(_,:,_<[}|1/.",
"  .234:4356789/.",
"  .0a:::a3.b8c/.",
"...defghi_/.jk/.",
" .lllllmnop/.k/.",
"  .lqrstuvwx/./.",
"   $yzABCDEFGH..",
"    IJKLMNOPQRS.",
"     .......... "};
