/* XPM */
static char * outbox_open_xpm[] = {
"16 12 80 1",
" 	c None",
".	c #3B3B3B",
"+	c #000000",
"@	c #080808",
"#	c #008300",
"$	c #111111",
"%	c #CCCCCD",
"&	c #BBBBBD",
"*	c #557C3B",
"=	c #BABABB",
"-	c #A8A8AA",
";	c #979799",
">	c #868688",
",	c #757578",
"'	c #646467",
")	c #525256",
"!	c #414145",
"~	c #45B145",
"{	c #A6A6A8",
"]	c #969698",
"^	c #848487",
"/	c #737376",
"(	c #626265",
"_	c #515154",
":	c #3F3F43",
"<	c #050505",
"[	c #949496",
"}	c #838385",
"|	c #727275",
"1	c #606064",
"2	c #4F4F53",
"3	c #707073",
"4	c #5F5F62",
"5	c #4E4E51",
"6	c #DBDBDB",
"7	c #D4D3D4",
"8	c #CCCCCC",
"9	c #C5C5C5",
"0	c #5D5D61",
"a	c #4C4C50",
"b	c #DBDADA",
"c	c #D3D3D3",
"d	c #CCCCCB",
"e	c #C4C4C4",
"f	c #BCBBBB",
"g	c #020202",
"h	c #4A4A4E",
"i	c #101010",
"j	c #F5F4F5",
"k	c #EFEFEF",
"l	c #E7E7E7",
"m	c #E0E0E0",
"n	c #D9D9D8",
"o	c #D1D1D1",
"p	c #CACACA",
"q	c #C3C2C3",
"r	c #BBBBBB",
"s	c #B3B3B3",
"t	c #1D1D1D",
"u	c #ECECEC",
"v	c #E6E6E6",
"w	c #DEDEDE",
"x	c #D7D7D7",
"y	c #CFCFCF",
"z	c #C8C8C8",
"A	c #C0C0C1",
"B	c #B9B9B9",
"C	c #B2B2B2",
"D	c #AAA9A9",
"E	c #060606",
"F	c #E2E3E3",
"G	c #DCDBDC",
"H	c #D4D4D4",
"I	c #CDCCCD",
"J	c #C5C5C6",
"K	c #BEBEBE",
"L	c #B7B6B6",
"M	c #AFAFAF",
"N	c #A8A8A8",
"O	c #A1A1A0",
"   .+...        ",
"  .@#$%&+++++++ ",
"  +#**@=-;>,')!+",
" +~~#*#+{]^/(_:+",
"+++~*#+<+[}|12:+",
"  +~*#+....345:+",
"..+~*#+6789+0a:+",
" .+++++bcdefgh:+",
"  ijklmnopqrs+:+",
"   tuvwxyzABCD@+",
"    EFGHIJKLMNO+",
"     ++++++++++ "};
