/* XPM */
static char * category_xpm[] = {
"16 16 188 2",
"  	c None",
". 	c #ACACAD",
"+ 	c #949597",
"@ 	c #939396",
"# 	c #9A9B9E",
"$ 	c #BEBEBF",
"% 	c #C0C0C0",
"& 	c #93949B",
"* 	c #8D8FA5",
"= 	c #8C90A8",
"- 	c #8B8EA8",
"; 	c #888CA7",
"> 	c #727392",
", 	c #848593",
"' 	c #C0C0C1",
") 	c #BFBFC1",
"! 	c #BEBEC1",
"~ 	c #C0C0C2",
"{ 	c #BFBFBF",
"] 	c #868796",
"^ 	c #626697",
"/ 	c #5D6299",
"( 	c #5C6199",
"_ 	c #585D96",
": 	c #55588C",
"< 	c #505277",
"[ 	c #4F5166",
"} 	c #4F5066",
"| 	c #4D4E65",
"1 	c #444562",
"2 	c #505166",
"3 	c #B0B0B2",
"4 	c #74748C",
"5 	c #404381",
"6 	c #3B3E81",
"7 	c #3A3E80",
"8 	c #3B3D7F",
"9 	c #686A91",
"0 	c #8F91A4",
"a 	c #9191A5",
"b 	c #9191A4",
"c 	c #9091A4",
"d 	c #9090A3",
"e 	c #8E8FA2",
"f 	c #85869C",
"g 	c #66677C",
"h 	c #ADADB0",
"i 	c #67697F",
"j 	c #4E5075",
"k 	c #585B7C",
"l 	c #585A7C",
"m 	c #717395",
"n 	c #B5B7C9",
"o 	c #B1B5C6",
"p 	c #AAADC1",
"q 	c #A7A9BF",
"r 	c #A3A6BD",
"s 	c #9EA1BA",
"t 	c #9A9CB7",
"u 	c #8F91B0",
"v 	c #6D6F8B",
"w 	c #ADADB1",
"x 	c #92939A",
"y 	c #B3B4C2",
"z 	c #BEBFCC",
"A 	c #BCBDCA",
"B 	c #BBBDCD",
"C 	c #B1B3C6",
"D 	c #AAACC2",
"E 	c #A5A7BF",
"F 	c #A2A4BD",
"G 	c #9A9CB8",
"H 	c #9597B5",
"I 	c #8B8DAE",
"J 	c #6A6B89",
"K 	c #ACADB1",
"L 	c #9FA1A2",
"M 	c #B2B4C2",
"N 	c #B3B5C6",
"O 	c #B0B2C5",
"P 	c #ACAEC3",
"Q 	c #A9AAC1",
"R 	c #A5A8BF",
"S 	c #A1A2BB",
"T 	c #9D9FB9",
"U 	c #999CB7",
"V 	c #9598B4",
"W 	c #9092B1",
"X 	c #8587AB",
"Y 	c #666787",
"Z 	c #ACACB1",
"` 	c #9D9EA1",
" .	c #A9ABBC",
"..	c #A9ABC0",
"+.	c #A5A7BE",
"@.	c #A2A3BB",
"#.	c #9EA1B9",
"$.	c #9B9EB8",
"%.	c #9597B4",
"&.	c #9294B2",
"*.	c #8E90AF",
"=.	c #898AAD",
"-.	c #8384AB",
";.	c #787AA6",
">.	c #5F6184",
",.	c #ACACB0",
"'.	c #9A9A9E",
").	c #A1A3B7",
"!.	c #A0A3BA",
"~.	c #9C9FB8",
"{.	c #999AB5",
"].	c #9598B3",
"^.	c #9194B1",
"/.	c #8C8DAE",
"(.	c #8789AC",
"_.	c #8385AB",
":.	c #7E7FA9",
"<.	c #7879A8",
"[.	c #6E70A4",
"}.	c #5A5C82",
"|.	c #AAAAAF",
"1.	c #BCBCBC",
"2.	c #95979B",
"3.	c #9A9CB1",
"4.	c #989AB4",
"5.	c #9497B2",
"6.	c #9092AF",
"7.	c #8C8FAE",
"8.	c #888AAC",
"9.	c #8284AA",
"0.	c #7E80A9",
"a.	c #7A7CA8",
"b.	c #7576A7",
"c.	c #6E70A6",
"d.	c #6668A1",
"e.	c #555880",
"f.	c #A4A5A9",
"g.	c #B6B6B6",
"h.	c #8E8F93",
"i.	c #9194AB",
"j.	c #8E91AE",
"k.	c #8B8DAC",
"l.	c #8688AB",
"m.	c #8184A9",
"n.	c #7D7FA8",
"o.	c #7779A7",
"p.	c #7375A6",
"q.	c #7071A5",
"r.	c #6A6CA4",
"s.	c #6466A3",
"t.	c #5D5FA0",
"u.	c #50527C",
"v.	c #9B9B9F",
"w.	c #B4B4B4",
"x.	c #88898F",
"y.	c #8588A3",
"z.	c #8284A5",
"A.	c #7E80A4",
"B.	c #797CA3",
"C.	c #7577A2",
"D.	c #7172A0",
"E.	c #6B6DA0",
"F.	c #67699F",
"G.	c #63659E",
"H.	c #5D5F9D",
"I.	c #5A5B9C",
"J.	c #575A9A",
"K.	c #4C4F78",
"L.	c #97979C",
"M.	c #8F8F95",
"N.	c #68697E",
"O.	c #63637A",
"P.	c #606179",
"Q.	c #5F6078",
"R.	c #5D5F77",
"S.	c #5C5D76",
"T.	c #5A5B74",
"U.	c #595A74",
"V.	c #595974",
"W.	c #585874",
"X.	c #575974",
"Y.	c #575973",
"Z.	c #686878",
"`.	c #ABABAC",
" +	c #BABABA",
".+	c #B7B7B7",
"++	c #B5B5B5",
"@+	c #BBBBBB",
"                                ",
"  . + @ @ @ # $                 ",
"% & * = - ; > , ' ' ' ' ) ! ~   ",
"{ ] ^ / ( _ : < [ [ [ } | 1 2 3 ",
"{ 4 5 6 7 8 9 0 a b c d e f g h ",
"{ i j k l m n o p q r s t u v w ",
"{ x y z A B C D E F s G H I J K ",
"{ L M N O P Q R S T U V W X Y Z ",
"{ `  ...+.@.#.$.%.&.*.=.-.;.>.,.",
"{ '.).!.~.{.].^./.(._.:.<.[.}.|.",
"1.2.3.4.5.6.7.8.9.0.a.b.c.d.e.f.",
"g.h.i.j.k.l.m.n.o.p.q.r.s.t.u.v.",
"w.x.y.z.A.B.C.D.E.F.G.H.I.J.K.L.",
"  M.N.O.P.Q.R.S.T.U.V.W.X.Y.Z.`.",
"     +.+.+.+g.g.++++++++++g.@+  ",
"                                "};
