/* XPM */
static char *close[]={
"24 24 3 1",
". c None",
"# c #002149",
"a c #00306a",
"........................",
"........................",
"........................",
"........................",
"........................",
"........................",
"........................",
".......#a.....a#........",
".......a#a...a#a........",
"........a#a.a#a.........",
".........a#a#a..........",
"..........a#a...........",
".........a#a#a..........",
"........a#a.a#a.........",
".......a#a...a#a........",
".......#a.....a#........",
"........................",
"........................",
"........................",
"........................",
"........................",
"........................",
"........................",
"........................"};
