/* XPM */
static char * mime_message_xpm[] = {
"24 23 115 2",
"  	c None",
". 	c #030303",
"+ 	c #050505",
"@ 	c #040404",
"# 	c #010101",
"$ 	c #131313",
"% 	c #848484",
"& 	c #ABABAB",
"* 	c #ACACAC",
"= 	c #AAAAAA",
"- 	c #A9A9A9",
"; 	c #A8A8A8",
"> 	c #A7A7A7",
", 	c #A4A4A4",
"' 	c #9D9D9D",
") 	c #959595",
"! 	c #8F8F8F",
"~ 	c #818181",
"{ 	c #4B4B4B",
"] 	c #696969",
"^ 	c #F4F4F4",
"/ 	c #F1F1F1",
"( 	c #F3F3F3",
"_ 	c #F0F0F0",
": 	c #EFEFEF",
"< 	c #EEEEEE",
"[ 	c #EDEDED",
"} 	c #ECECEC",
"| 	c #EBEBEB",
"1 	c #EAEAEA",
"2 	c #E8E8E8",
"3 	c #E7E7E7",
"4 	c #E6E6E6",
"5 	c #C6C6C6",
"6 	c #1A1A1A",
"7 	c #8C8C8C",
"8 	c #F2F2F2",
"9 	c #E9E9E9",
"0 	c #D8D8D8",
"a 	c #232323",
"b 	c #8B8B8B",
"c 	c #E5E5E5",
"d 	c #D6D6D6",
"e 	c #8A8A8A",
"f 	c #E3E3E3",
"g 	c #E0E0E0",
"h 	c #E1E1E1",
"i 	c #DFDFDF",
"j 	c #DEDEDE",
"k 	c #E4E4E4",
"l 	c #CDCDCD",
"m 	c #DADADA",
"n 	c #CCCCCC",
"o 	c #CBCBCB",
"p 	c #C0C0C0",
"q 	c #C5C5C5",
"r 	c #C1C1C1",
"s 	c #BDBDBD",
"t 	c #D5D5D5",
"u 	c #B5B5B5",
"v 	c #D2D2D2",
"w 	c #909090",
"x 	c #858585",
"y 	c #E2E2E2",
"z 	c #D4D4D4",
"A 	c #898989",
"B 	c #BEBEBE",
"C 	c #BABABA",
"D 	c #DDDDDD",
"E 	c #757575",
"F 	c #727272",
"G 	c #DCDCDC",
"H 	c #888888",
"I 	c #ADADAD",
"J 	c #949494",
"K 	c #A1A1A1",
"L 	c #B0B0B0",
"M 	c #808080",
"N 	c #C8C8C8",
"O 	c #BBBBBB",
"P 	c #C9C9C9",
"Q 	c #C4C4C4",
"R 	c #AFAFAF",
"S 	c #717171",
"T 	c #878787",
"U 	c #D7D7D7",
"V 	c #999999",
"W 	c #797979",
"X 	c #828282",
"Y 	c #D0D0D0",
"Z 	c #D3D3D3",
"` 	c #C3C3C3",
" .	c #919191",
"..	c #CFCFCF",
"+.	c #868686",
"@.	c #DBDBDB",
"#.	c #CECECE",
"$.	c #D9D9D9",
"%.	c #838383",
"&.	c #CACACA",
"*.	c #545454",
"=.	c #D1D1D1",
"-.	c #0D0D0D",
";.	c #484848",
">.	c #676767",
",.	c #707070",
"'.	c #6F6F6F",
").	c #6E6E6E",
"!.	c #6D6D6D",
"~.	c #6C6C6C",
"{.	c #6B6B6B",
"].	c #656565",
"^.	c #3B3B3B",
"/.	c #000000",
"(.	c #020202",
"                                                ",
"        . + + + + + + + + + + + @ @ . #         ",
"      $ % & * * & = = - ; > , ' ) ! ~ { +       ",
"      ] ^ / ( / _ : < [ } | 1 1 2 3 4 5 6       ",
"      7 ^ : 8 : < < [ [ } | 1 1 9 9 2 0 a       ",
"      7 ( < / < [ } } | | 1 9 9 2 3 3 0 a       ",
"      b 8 [ _ [ } } | 1 9 9 2 2 3 4 c d a       ",
"      e < 1 : } 1 f g h i j j j i c k d a       ",
"      e l m < n o p q l 5 r r s = k f t a       ",
"      e 4 c [ u v 9 ^ ^ _ | v w x y y z a       ",
"      A < 2 } d B o C 5 D 5 E b F G h z a       ",
"      H } 4 1 4 s [ n p I J K L M N g v a       ",
"      H | c 1 4 O | D D v P Q R S O j v a       ",
"      T f g 9 k 5 v U Q = V W X K 0 D Y a       ",
"      T 5 Z 2 f ` ! w A  .* Y j D D G ..a       ",
"      +.y g 3 y j Z v d j j j G G @.m #.a       ",
"      x c g 4 h g i i j D D G @.@.m $.l a       ",
"      % k i k i i j j D G @.@.m m $.U n a       ",
"      %.y D f j j D G G @.m m $.0 0 d &.a       ",
"      *.Z 0 g m $.U d t z Z v =...#.o L 6       ",
"      -.;.>.E F S ,.,.'.).!.!.~.~.{.].^.+       ",
"        /.(.(.(.(.(.(.(.(.(.(.(.(.(.(.#         ",
"                                                "};
