/* XPM */
static char * mail_receive_xpm[] = {
"24 24 71 1",
" 	c None",
".	c #000000",
"+	c #E9EEF2",
"@	c #E4EAEF",
"#	c #DBE3EA",
"$	c #DCE4EB",
"%	c #94ACC1",
"&	c #88A4BB",
"*	c #5B7F9E",
"=	c #EAEFF3",
"-	c #A3B8CA",
";	c #B0C2D1",
">	c #4F6F8A",
",	c #425D73",
"'	c #B2C4D3",
")	c #B9C9D6",
"!	c #E1E8EE",
"~	c #9BB2C6",
"{	c #ABBECE",
"]	c #557794",
"^	c #364C5F",
"/	c #7F9DB6",
"(	c #456178",
"_	c #C2C2C2",
":	c #FFFFFF",
"<	c #FAFAFA",
"[	c #C8CACB",
"}	c #90A9BF",
"|	c #496780",
"1	c #868A8C",
"2	c #AEAEAE",
"3	c #E0E0E0",
"4	c #515151",
"5	c #EEEEEE",
"6	c #4F4F4F",
"7	c #F5F5F5",
"8	c #F6F6F6",
"9	c #C0C2C3",
"0	c #4D6C86",
"a	c #828689",
"b	c #AAAAAA",
"c	c #D7D7D7",
"d	c #4D4D4D",
"e	c #E4E4E4",
"f	c #434343",
"g	c #F0F0F0",
"h	c #4C6B85",
"i	c #818588",
"j	c #A7A7A7",
"k	c #ACACAC",
"l	c #C8C8C8",
"m	c #8AA5BB",
"n	c #414141",
"o	c #A0A0A0",
"p	c #D4D4D4",
"q	c #FBFBFB",
"r	c #959595",
"s	c #3E3E3E",
"t	c #D8D8D8",
"u	c #B5B5B5",
"v	c #4B4B4B",
"w	c #818181",
"x	c #C6C6C6",
"y	c #6A6A6A",
"z	c #F1F1F1",
"A	c #E9E9E9",
"B	c #636363",
"C	c #B9B9B9",
"D	c #737373",
"E	c #7C7C7C",
"F	c #BCBCBC",
"                        ",
"       .........        ",
"       .+@#$%&*.        ",
"       .=--;>>,.        ",
"       .+--;>>,.        ",
"       .=--;>>,.        ",
"    ....=--'>>,....     ",
"     .)$!~-{>],^^.      ",
"   ..../---'>>>(....    ",
"  ._:<[.}--;>>|.1234.   ",
"  .56789.}-;>0.abcd2.   ",
"  .:ef7g9.};h.ijcdkl.   ",
"  .:7e67g9.m.ijcnopl.   ",
"  .:q7ef7g9.ajcdrpel.   ",
"  .:777es7gtutvwxeel.   ",
"  .:q777yf7zAdyoe7el.   ",
"  .:777BCC676rxDx7el.   ",
"  .:q7Bx7ep6kxe7Eeel.   ",
"  .:7Dp7777ee7777Eel.   ",
"  .:EpeeeeeeeeeeeeEl.   ",
"  .DFFFFFFFFFFFFFFFB.   ",
"   .................    ",
"                        ",
"                        "};
