/* XPM */
static char * mail_reply_xpm[] = {
"25 21 11 1",
" 	c None",
".	c #9999FF",
"+	c #6666CC",
"@	c #FFFFFF",
"#	c #C0C0C0",
"$	c #333366",
"%	c #FF0000",
"&	c #222222",
"*	c #808080",
"=	c #0000FF",
"-	c #00FFFF",
"                         ",
"                         ",
"   ...++++++++           ",
"   .@@@@@@@@@+           ",
"   .@@#@#@#@#+           ",
"   .@#######@+           ",
"   .@@#@#@#@#+           ",
"   .@#######@+   ###$    ",
"  %+.@#@#@#@#++& #..$$   ",
"  .@.#@####@@+#&$#..$$*  ",
"  =@@.#@#@##+@#&&#..$$*  ",
"  %@@@.#@##+@#####..$$*  ",
"  .@#@@.#@+@........$$*  ",
"  =@@#+...+.........$$*  ",
"  %@#+@@#@$+..++++++$$*  ",
"  +#+@@#@#@$+.+$$$$$$$*  ",
"  +=###-####$++$&&&&&&*  ",
"  %+=%+=.%-#%$+$&******  ",
"    ****+++=+%$$&*       ",
"          **+++$&*       ",
"                         "};
