/* XPM */
static char * mail_reply_to_author_xpm[] = {
"52 33 263 2",
"  	c None",
". 	c #C3C3C3",
"+ 	c #D2D2D2",
"@ 	c #757575",
"# 	c #202020",
"$ 	c #191919",
"% 	c #161616",
"& 	c #262626",
"* 	c #404040",
"= 	c #4C4C4C",
"- 	c #4F4F4F",
"; 	c #5E5E5E",
"> 	c #868686",
", 	c #C6C6C6",
"' 	c #D7D7D7",
") 	c #BDBDBD",
"! 	c #C9C9C9",
"~ 	c #CACACA",
"{ 	c #D6D6D6",
"] 	c #BBBBBB",
"^ 	c #69696A",
"/ 	c #F2F3F4",
"( 	c #FFFFFF",
"_ 	c #595959",
": 	c #8F8F8F",
"< 	c #CDCDCD",
"[ 	c #C1C1C1",
"} 	c #B2B2B2",
"| 	c #A3A3A3",
"1 	c #9B9B9B",
"2 	c #C2C2C2",
"3 	c #D0D0D0",
"4 	c #717171",
"5 	c #606162",
"6 	c #A5A5A5",
"7 	c #6A6A6A",
"8 	c #BFBFBF",
"9 	c #B0B0B0",
"0 	c #A1A1A1",
"a 	c #707070",
"b 	c #535353",
"c 	c #6C6C6C",
"d 	c #9A9A9A",
"e 	c #C5C5C5",
"f 	c #CCCCCC",
"g 	c #B8B8B9",
"h 	c #FEFEFE",
"i 	c #F1F1F1",
"j 	c #545454",
"k 	c #B7B7B7",
"l 	c #AEAEAE",
"m 	c #9C9C9C",
"n 	c #3B3B3B",
"o 	c #656565",
"p 	c #8E8E8E",
"q 	c #313131",
"r 	c #A4A4A4",
"s 	c #B5B5B5",
"t 	c #FCFCFD",
"u 	c #DADBDC",
"v 	c #D3D4D5",
"w 	c #F3F3F3",
"x 	c #B4B4B4",
"y 	c #BABABA",
"z 	c #ACACAC",
"A 	c #959595",
"B 	c #343434",
"C 	c #C4C4C4",
"D 	c #EFEFEF",
"E 	c #DCDCDC",
"F 	c #484848",
"G 	c #444444",
"H 	c #7B7B7B",
"I 	c #A2A2A2",
"J 	c #F9FAFA",
"K 	c #8F9196",
"L 	c #8E9095",
"M 	c #E6E6E7",
"N 	c #FDFDFD",
"O 	c #4B4B4B",
"P 	c #B3B3B3",
"Q 	c #B8B8B8",
"R 	c #A9A9A9",
"S 	c #2D2D2D",
"T 	c #7A7A7A",
"U 	c #F9F9F9",
"V 	c #ECECEC",
"W 	c #232323",
"X 	c #555555",
"Y 	c #8D8D8D",
"Z 	c #A7A7A7",
"` 	c #F8F9F9",
" .	c #8E9197",
"..	c #898A91",
"+.	c #E2E2E4",
"@.	c #B6B6B6",
"#.	c #878787",
"$.	c #575757",
"%.	c #383838",
"&.	c #858585",
"*.	c #EDEDED",
"=.	c #FBFBFB",
"-.	c #D5D5D5",
";.	c #363636",
">.	c #969696",
",.	c #F7F7F8",
"'.	c #94969D",
").	c #8C8E95",
"!.	c #E1E2E3",
"~.	c #808080",
"{.	c #505050",
"].	c #434343",
"^.	c #909090",
"/.	c #DDDDDD",
"(.	c #EEEEEE",
"_.	c #FAFAFA",
":.	c #DEDEDE",
"<.	c #1F1F1F",
"[.	c #9D9EA5",
"}.	c #9B9CA2",
"|.	c #E5E6E7",
"1.	c #FCFCFC",
"2.	c #797979",
"3.	c #494949",
"4.	c #4E4E4E",
"5.	c #E4E4E4",
"6.	c #F0F0F0",
"7.	c #DBDBDB",
"8.	c #E1E1E1",
"9.	c #F2F2F2",
"0.	c #2B2B2B",
"a.	c #373737",
"b.	c #6D6D6D",
"c.	c #FAFAFB",
"d.	c #DBDBDD",
"e.	c #D6D7D9",
"f.	c #F2F2F3",
"g.	c #BEBEBE",
"h.	c #727272",
"i.	c #424242",
"j.	c #5B5B5B",
"k.	c #E8E8E8",
"l.	c #ABABAB",
"m.	c #E2E2E2",
"n.	c #222222",
"o.	c #525252",
"p.	c #A0A0A0",
"q.	c #6B6B6B",
"r.	c #686868",
"s.	c #F5F5F5",
"t.	c #E5E5E5",
"u.	c #1D1D1D",
"v.	c #393939",
"w.	c #5D5D5D",
"x.	c #737373",
"y.	c #E7E7E7",
"z.	c #EBEBEB",
"A.	c #C7C7C7",
"B.	c #9E9E9E",
"C.	c #CBCBCB",
"D.	c #252525",
"E.	c #CFCFCF",
"F.	c #CECECE",
"G.	c #F8F8F8",
"H.	c #939393",
"I.	c #D1D1D1",
"J.	c #101010",
"K.	c #181818",
"L.	c #F7F7F7",
"M.	c #D1D1D2",
"N.	c #838383",
"O.	c #565656",
"P.	c #8B8B8B",
"Q.	c #606060",
"R.	c #57585A",
"S.	c #AAACB1",
"T.	c #A0A1A6",
"U.	c #818285",
"V.	c #636466",
"W.	c #D8D8D8",
"X.	c #C8C8C8",
"Y.	c #9F9F9F",
"Z.	c #999999",
"`.	c #979797",
" +	c #BCBCBC",
".+	c #E0E0E0",
"++	c #A6A6A6",
"@+	c #E9E9E9",
"#+	c #D4D4D4",
"$+	c #696969",
"%+	c #616161",
"&+	c #6D6D6F",
"*+	c #D4D5D8",
"=+	c #D1D2D4",
"-+	c #C8C9CA",
";+	c #4D4D4D",
">+	c #DFDFDF",
",+	c #B9B9B9",
"'+	c #787878",
")+	c #919191",
"!+	c #D3D3D3",
"~+	c #E3E3E3",
"{+	c #5A5A5A",
"]+	c #B1B1B1",
"^+	c #666666",
"/+	c #8C8C8C",
"(+	c #5F5F5F",
"_+	c #F4F4F4",
":+	c #929292",
"<+	c #F6F6F6",
"[+	c #DADADA",
"}+	c #151515",
"|+	c #2E2E2E",
"1+	c #5C5C5C",
"2+	c #585858",
"3+	c #AFAFAF",
"4+	c #474747",
"5+	c #828282",
"6+	c #818181",
"7+	c #7F7F7F",
"8+	c #414141",
"9+	c #3A3A3A",
"0+	c #1B1B1B",
"a+	c #303030",
"b+	c #454545",
"c+	c #C0C0C0",
"d+	c #D9D9D9",
"e+	c #1E1E1E",
"f+	c #333333",
"g+	c #646464",
"h+	c #7E7E7E",
"i+	c #AAAAAA",
"j+	c #000000",
"k+	c #E6E6E6",
"l+	c #212121",
"m+	c #9D9D9D",
"n+	c #668154",
"o+	c #6F6F6F",
"p+	c #949494",
"q+	c #ADADAD",
"r+	c #58833C",
"s+	c #748C64",
"t+	c #989898",
"u+	c #5E8A41",
"v+	c #669447",
"w+	c #65894C",
"x+	c #557C3B",
"y+	c #6F9059",
"z+	c #639144",
"A+	c #6E9952",
"B+	c #7D9A69",
"C+	c #E0EADB",
"D+	c #AECCA1",
"E+	c #A9C79C",
"F+	c #B9C9B1",
"G+	c #E1EBDC",
"H+	c #BDCEB6",
"I+	c #D0E1C9",
"J+	c #D3E3CB",
"K+	c #D7E5D0",
"L+	c #D8E6D2",
"M+	c #DBE7D6",
"N+	c #B9C3B5",
"                                              . . +         . @ # $ % % % & * = - ; > , '               ",
"                                          . . ) ! ~ {     ] @ ^ / ( ( ( ( ( ( ( ( ) _ : <               ",
"                                      . [ } | 1 2 ~ 3   ] 4 5 ( ( ( ( ( ( ( ( ( ( ( 6 7 8               ",
"                                  . 8 9 0 a b c d ] e f } * g ( ( h h ( ( ( ( ( ( ( i j k               ",
"                              . ) l m c n o p q c r s e } * 8 ( t u v w h ( ( ( ( ( ( = x               ",
"                          . y z A o B 4 C D E F G H I k } * 8 ( J K L M N ( ( ( ( ( ( O P               ",
"                      . Q R p ; S T ~ D U V 3 A W X Y Z } * 8 ( `  ...+.N ( ( ( ( ( ( O }               ",
"                . . @.Z #.$.%.&.+ *.U ( =.-.[ E %.;.c >.} * 8 ( ,.'.).!.=.( ( ( ( ( ( O }               ",
"            . . x 6 ~.{.].^./.(._.( ( ( (.] 2 :.A <.- &.} * 8 ( ,.[.}.|.1.( ( ( ( ( ( O }               ",
"        . [ } | 2.3.4.1 5.6.=.( ( ( ( ( 7.z , 8.9.0.a.b.} * 8 ( c.d.e.f.h ( ( ( ( ( ( O }               ",
"      g.9 0 h.i.j.R k.9.N ( ( ( ( ( ( h g.l.~ m.9.Y n.o.} * 8 ( ( h 1.h ( ( ( ( ( ( ( O }               ",
"    ) p.q.n r.y (.s.( ( ( ( ( ( ( ( ( t.6 Z ! 8.(.*.u.v.} * 8 ( ( ( ( ( ( ( ( ( ( ( ( O }               ",
"    . l.w.x.y.z.N ( ( ( ( ( ( ( ( ( _.A.T B.g.C.m.V H D.} * 8 ( ( ( ( ( ( m.U ( ( ( ( O }               ",
"      y p %.E.F.F./.*.G.( ( ( ( ( ( G.R T H.r ] < 7.I.J.} {.# K.~.( h L.M.N.*.( ( ( ( O }               ",
"      . R O.P.I.[ @.P g.{ L.G.( ( ( y.l x k 9 l.@.C -.o ] 0 0 Q.R.S.T.U.V.C.( ( ( ( ( O }               ",
"        Q #.].5.W.X.@.Y.Z.`. +.+L.1.f ++f y.@+8.#+! < @.i.$+Q %+&+*+=+-+W.( ( ( ( ( ( ;+P               ",
"        . Z - I @+>+X.,+Z.'+)+z }  +p I !+(.G.N h U y.~+{+G ]+^+/+( ( ( ( ( ( ( ( ( @.(+,+              ",
"          @.~.o._+*.  e r 1 g.g.0 Y ^.x .+s.=.h L.6.e r.<.{.x 7 :+( ( ( ( ( ( ( <+2 ^+~.,               ",
"          . 6 F P 6.8.X.R Q k.>+E.] [ [+(._.9.@+]+O.}+|+= A 2 '+o.w.j.{+{+{+{+1+(+2+$+3+#+              ",
"          . x 2.; i .+e ++W.s.i V k.@+9.V 5.p.4+K.S ].%+5+Q X.9 H.#.6+7+7+~.6+> : p.y !+[+              ",
"            . | 8+,+E 8  +*.1.=.U <+z.8.:+9+0+a+b+Q.H p Y.C 3 C.X.. 8 g.g.8 c+. ! E.-.d+[+              ",
"            . } h.o d+2 -.N h U (.>+&.S e+f+3.g+h+Y m i+k F.[+W.{ #+!++ + !+!+#+j+d+[+            k+    ",
"              c+0 9+} < *.=.6.{ H l+l+;.;+r.6+: m+i+@.g.                      j+j+                      ",
"              . 9 q.7 E D 3 h.}+D.v.o.c N.)+Y.z Q g.                        j+n+j+                      ",
"                g.1 f+l.o+u.q i.2+4 > p+0 q+y g.                          j+r+s+j+j+j+j+j+              ",
"                . q+g+B O j.c 7+Y t+r 9 ] g.                            j+u+v+w+x+x+x+y+j+              ",
"                  ) q+^.H.B.++i+z x 8 8                               j+z+v+v+A+v+v+v+B+j+              ",
"                  . 8 Q g.c+. C e [                                   j+C+D+D+E+D+D+D+F+j+              ",
"                      [ . C .                                           j+G+D+H+I+J+K+L+j+              ",
"                      !+                                                  j+M+N+j+j+j+j+j+              ",
"                                                                            j+M+j+                      ",
"                                                                              j+j+                      ",
"                                                                                j+                      "};
