/* XPM */
static char * close_xpm[] = {
"24 24 90 1",
" 	c None",
".	c #4A4A4A",
"+	c #484848",
"@	c #464646",
"#	c #424242",
"$	c #404040",
"%	c #3C3C3C",
"&	c #3A3A3A",
"*	c #353535",
"=	c #696969",
"-	c #E4E4E4",
";	c #E2E2E2",
">	c #DADADA",
",	c #D2D2D2",
"'	c #C8C8C8",
")	c #BCBCBC",
"!	c #B0B0B0",
"~	c #7D7D7D",
"{	c #CACACA",
"]	c #F0F0F0",
"^	c #EDEDED",
"/	c #E5E5E5",
"(	c #DCDCDC",
"_	c #B1B1B1",
":	c #626262",
"<	c #333333",
"[	c #E6E6E6",
"}	c #898989",
"|	c #D3D3D3",
"1	c #EAEAEA",
"2	c #E3E3E3",
"3	c #5B5B5B",
"4	c #8D8D8D",
"5	c #343434",
"6	c #E7E7E7",
"7	c #959595",
"8	c #DFDFDF",
"9	c #D5D5D5",
"0	c #A8A8A8",
"a	c #929292",
"b	c #F2F2F2",
"c	c #CECECE",
"d	c #BFBFBF",
"e	c #D7D7D7",
"f	c #BDBDBD",
"g	c #6B6B6B",
"h	c #B3B3B3",
"i	c #A7A7A7",
"j	c #323232",
"k	c #616161",
"l	c #878787",
"m	c #A0A0A0",
"n	c #E1E1E1",
"o	c #EEEEEE",
"p	c #B6B6B6",
"q	c #656565",
"r	c #9F9F9F",
"s	c #636363",
"t	c #9B9B9B",
"u	c #313131",
"v	c #DEDEDE",
"w	c #E8E8E8",
"x	c #BBBBBB",
"y	c #BEBEBE",
"z	c #848484",
"A	c #939393",
"B	c #303030",
"C	c #D6D6D6",
"D	c #CBCBCB",
"E	c #ABABAB",
"F	c #565656",
"G	c #2F2F2F",
"H	c #D9D9D9",
"I	c #C7C7C7",
"J	c #BABABA",
"K	c #AAAAAA",
"L	c #797979",
"M	c #2E2E2E",
"N	c #AEAEAE",
"O	c #C2C2C2",
"P	c #B4B4B4",
"Q	c #A4A4A4",
"R	c #2D2D2D",
"S	c #555555",
"T	c #C3C3C3",
"U	c #969696",
"V	c #757575",
"W	c #515151",
"X	c #3F3F3F",
"Y	c #373737",
"                        ",
"                        ",
"                        ",
"                        ",
"                        ",
"     . + @ # $ % & *    ",
"   = - ; > , ' ) ! ~    ",
"   { > ] ^ / ( , _ : <  ",
"   [ } | 1 2 > { 3 4 5  ",
"   6 / 7 - 8 9 0 a 0 <  ",
"   / b c d e f g h i j  ",
"   2 ] 2 = ! k l _ m j  ",
"   n o ' p q r s i t u  ",
"   v w l 9 x y a z A B  ",
"   > { f C D y E F } G  ",
"   , } H | I J K L = M  ",
"   N d H c O P Q 4 + R  ",
"   S T f _ Q U l V W    ",
"     X % & Y 5 j B R    ",
"                        ",
"                        ",
"                        ",
"                        ",
"                        "};
