/* XPM */
static char * outbox_open_xpm[] = {
"16 16 7 1",
" 	c None",
".	c #333366",
"+	c #6666CC",
"@	c #FF00FF",
"#	c #9999FF",
"$	c #FFFFFF",
"%	c #222222",
"                ",
"                ",
"                ",
"                ",
"   ##########.##",
"  ##..####...###",
" #####.#..##.#$#",
" $$$$$$$$$$$$##$",
" ############$$%",
"$$$$$$$$$$$$$%%%",
"++++++++++++%%%%",
"++++++++++++%%%%",
"++++++++++++%%% ",
"............%%  ",
"                ",
"                "};
