/* XPM */
static char * mail_forward_xpm[] = {
"23 18 122 2",
"  	c None",
". 	c #D98906",
"+ 	c #DA8E10",
"@ 	c #FFFFFD",
"# 	c #F1F5FF",
"$ 	c #FFFFCB",
"% 	c #3B3139",
"& 	c #894904",
"* 	c #DC8F10",
"= 	c #FFFFD0",
"- 	c #FFFFFC",
"; 	c #FFFFF9",
"> 	c #FFFFF4",
", 	c #FFFEE8",
"' 	c #FFFEDB",
") 	c #FFFFBD",
"! 	c #9C5920",
"~ 	c #D4B437",
"{ 	c #DC9116",
"] 	c #F9F3A6",
"^ 	c #FFFEEB",
"/ 	c #FFFEF3",
"( 	c #C08D03",
"_ 	c #8D4B02",
": 	c #DC9114",
"< 	c #EBDA73",
"[ 	c #F7E97C",
"} 	c #FBF097",
"| 	c #FFFEF2",
"1 	c #A65B23",
"2 	c #B58D0F",
"3 	c #D29708",
"4 	c #F6CC0C",
"5 	c #D98E0E",
"6 	c #FEFDF2",
"7 	c #FFFFF6",
"8 	c #FFFDB5",
"9 	c #E7D753",
"0 	c #F5EB92",
"a 	c #061212",
"b 	c #050F0F",
"c 	c #E8BE10",
"d 	c #EDD036",
"e 	c #DEBD1E",
"f 	c #723C01",
"g 	c #DA8F11",
"h 	c #FEF9E4",
"i 	c #FDF8D7",
"j 	c #FBF9DD",
"k 	c #FCF8D0",
"l 	c #F2DD60",
"m 	c #F8DF40",
"n 	c #F1E47B",
"o 	c #B95F25",
"p 	c #103232",
"q 	c #CFBA3F",
"r 	c #C5AC28",
"s 	c #6C3901",
"t 	c #DB9013",
"u 	c #FFFDF1",
"v 	c #FBF5D1",
"w 	c #F8EEBA",
"x 	c #FDF9DC",
"y 	c #FBF8CD",
"z 	c #F4E253",
"A 	c #E2C00B",
"B 	c #F3EBAD",
"C 	c #B14D19",
"D 	c #886910",
"E 	c #DA8F0F",
"F 	c #FFFDED",
"G 	c #FDF8CE",
"H 	c #FCF9BF",
"I 	c #FDF8D6",
"J 	c #F5E778",
"K 	c #EFD94B",
"L 	c #F9F092",
"M 	c #1D5757",
"N 	c #7F4201",
"O 	c #D98D0B",
"P 	c #FDFBED",
"Q 	c #FFFCD5",
"R 	c #FFFFEE",
"S 	c #FBF08D",
"T 	c #ECD033",
"U 	c #F9F1B8",
"V 	c #246464",
"W 	c #7EACAC",
"X 	c #77A7A7",
"Y 	c #699D9D",
"Z 	c #206060",
"` 	c #D98C08",
" .	c #FAF398",
"..	c #E8CB29",
"+.	c #FAF4B1",
"@.	c #FFFFAE",
"#.	c #458181",
"$.	c #3B7979",
"%.	c #347272",
"&.	c #2F6E6E",
"*.	c #2C6B6B",
"=.	c #DA8C0A",
"-.	c #FCF48C",
";.	c #E7CA24",
">.	c #FCF8C3",
",.	c #FFFEB1",
"'.	c #FFFDA1",
").	c #4A8585",
"!.	c #DA8C09",
"~.	c #FFFFFA",
"{.	c #E3C518",
"].	c #FFFED2",
"^.	c #FFFEB9",
"/.	c #FFFEA7",
"(.	c #DE8E06",
"_.	c #FFFED9",
":.	c #FFFFB9",
"<.	c #FFF672",
"[.	c #FFF571",
"}.	c #FFF56F",
"|.	c #FFF56A",
"1.	c #FFF266",
"                                              ",
"  . . . . . . . . . . . . . . . . . . . . .   ",
"  + @ @ @ @ @ @ @ @ @ @ @ @ # @ @ @ @ $ % &   ",
"  * = @ - ; > @ @ , ' ' ) ) $ $ $ $ $ ! ~ &   ",
"  { = ] ^ ; / @ @ , ' $ $ $ $ $ $ $ ! ~ ( _   ",
"  : @ < [ } | @ , ' ' $ $ $ $ $ $ 1 2 3 4 _   ",
"  5 6 7 8 9 0 ' , ' $ ) $ $ $ $ a b c d e f   ",
"  g h i j k l m n , $ ) $ $ $ o a p a q r s   ",
"  t u v w x y z A z B $ $ $ C D a p p b r f   ",
"  E F G H I J K L b b b b b b b b M p p a N   ",
"  O P Q R S T U $ V W X X X X Y Y Z M p p b   ",
"  ` ; >  ...+.$ @.V #.#.$.#.$.%.&.*.Z M p p a ",
"  =.; -.;.>.,.@.'.V ).#.#.#.#.$.%.&.V Z M p b ",
"  !.~.{.].^./.'.'.V ).).).).).#.$.$.&.*.V a   ",
"  (._.:.<.[.}.|.1.V V V V V V V V W %.&.b _   ",
"  _ _ & _ _ _ _ _ _ _ _ _ _ _ _ V W $.a & &   ",
"                                V ).b         ",
"                                V b           "};
