/* XPM */
static char * dir_open_hrm_xpm[] = {
"16 12 84 1",
" 	c None",
".	c #000000",
"+	c #F0E7D3",
"@	c #EDDFC9",
"#	c #E6D3B6",
"$	c #DEC5A3",
"%	c #DABE9B",
"&	c #0D0C0B",
"*	c #080604",
"=	c #040201",
"-	c #F2EAD5",
";	c #EDDFC7",
">	c #E7D5B9",
",	c #E2CAAB",
"'	c #DCC09D",
")	c #D7B58F",
"!	c #D2AB80",
"~	c #CCA072",
"{	c #C69665",
"]	c #C08D57",
"^	c #BC8249",
"/	c #826945",
"(	c #F2EAD6",
"_	c #EDDFC8",
":	c #E7D5BA",
"<	c #E2CBAB",
"[	c #DDC09D",
"}	c #D6B68E",
"|	c #D2AB81",
"1	c #CCA172",
"2	c #C79665",
"3	c #C18C56",
"4	c #BB8248",
"5	c #F3E9D6",
"6	c #E8D5BA",
"7	c #D7B68F",
"8	c #D1AB81",
"9	c #CBA173",
"0	c #C69764",
"a	c #C08C56",
"b	c #BB8148",
"c	c #F0E5D0",
"d	c #EDE0CA",
"e	c #E4D0B4",
"f	c #C69866",
"g	c #BB8147",
"h	c #FDF6EA",
"i	c #C18D58",
"j	c #BB8247",
"k	c #E3CCAC",
"l	c #E2C9AB",
"m	c #E1C8A8",
"n	c #E0C7A6",
"o	c #E5D1B3",
"p	c #E4CFB0",
"q	c #E3CDAE",
"r	c #E2CCAC",
"s	c #E2C9AA",
"t	c #E0C8A7",
"u	c #E0C6A5",
"v	c #DEC4A2",
"w	c #030303",
"x	c #F6CFCE",
"y	c #F2BEBD",
"z	c #F0AFAE",
"A	c #EF9FA0",
"B	c #EC9191",
"C	c #EA8281",
"D	c #E87273",
"E	c #E56463",
"F	c #E45654",
"G	c #DB4543",
"H	c #030000",
"I	c #0D0B0B",
"J	c #F4BFBF",
"K	c #EDABA9",
"L	c #EA9D9C",
"M	c #E78E8D",
"N	c #E57F7D",
"O	c #E3706E",
"P	c #E16360",
"Q	c #DE5452",
"R	c #DB4644",
"S	c #D53A36",
"   .....        ",
"  .+@#$%&*=.... ",
"  .-;>,')!~{]^/.",
"  .(_:<[}|1234/.",
"  .5_6<'7890ab/.",
"  .cde.....fag/.",
"......hhhh/.ij/.",
" .hhhhhklmn/.j/.",
"  .hopqrstuv/./.",
"   wxyzABCDEFGH.",
"    IJKLMNOPQRS.",
"     .......... "};
