/* XPM */
static char * delete_xpm[] = {
"23 18 160 2",
"  	c None",
". 	c #D98906",
"+ 	c #DA8E10",
"@ 	c #FFFFFD",
"# 	c #F1F5FF",
"$ 	c #FFFFCB",
"% 	c #3B3139",
"& 	c #894904",
"* 	c #DC8F10",
"= 	c #FFFFD0",
"- 	c #FFFFFC",
"; 	c #FFFFF9",
"> 	c #FFFFF4",
", 	c #FFFEE8",
"' 	c #FFFEDB",
") 	c #FFFFBD",
"! 	c #9C5920",
"~ 	c #D4B437",
"{ 	c #DC9116",
"] 	c #F9F3A6",
"^ 	c #FFFEEB",
"/ 	c #FFFEF3",
"( 	c #C08D03",
"_ 	c #8D4B02",
": 	c #DC9114",
"< 	c #EBDA73",
"[ 	c #F7E97C",
"} 	c #FBF097",
"| 	c #FFFEF2",
"1 	c #000000",
"2 	c #F6CC0C",
"3 	c #D98E0E",
"4 	c #FEFDF2",
"5 	c #FFFFF6",
"6 	c #FFFDB5",
"7 	c #E7D753",
"8 	c #F5EB92",
"9 	c #252525",
"0 	c #A8BA9E",
"a 	c #B4C1AB",
"b 	c #909F86",
"c 	c #484E43",
"d 	c #A0AD94",
"e 	c #9EAB91",
"f 	c #DA8F11",
"g 	c #FEF9E4",
"h 	c #FDF8D7",
"i 	c #FBF9DD",
"j 	c #FCF8D0",
"k 	c #F2DD60",
"l 	c #F8DF40",
"m 	c #F1E47B",
"n 	c #94A08D",
"o 	c #BFCCB7",
"p 	c #A7B69B",
"q 	c #BEC9B5",
"r 	c #353931",
"s 	c #242622",
"t 	c #9BAA8F",
"u 	c #9AA78E",
"v 	c #7C8672",
"w 	c #DB9013",
"x 	c #FFFDF1",
"y 	c #FBF5D1",
"z 	c #F8EEBA",
"A 	c #FDF9DC",
"B 	c #FBF8CD",
"C 	c #F4E253",
"D 	c #E2C00B",
"E 	c #F3EBAD",
"F 	c #7C9674",
"G 	c #B0C0AB",
"H 	c #CED6C8",
"I 	c #DAE1D6",
"J 	c #98A58C",
"K 	c #5B6B57",
"L 	c #DA8F0F",
"M 	c #FFFDED",
"N 	c #FDF8CE",
"O 	c #FCF9BF",
"P 	c #FDF8D6",
"Q 	c #F5E778",
"R 	c #EFD94B",
"S 	c #F9F092",
"T 	c #F8DB36",
"U 	c #EDD036",
"V 	c #637354",
"W 	c #748C6B",
"X 	c #94AA8D",
"Y 	c #8FA58A",
"Z 	c #6F8668",
"` 	c #667961",
" .	c #5D6E58",
"..	c #4D5A4B",
"+.	c #485245",
"@.	c #D98D0B",
"#.	c #FDFBED",
"$.	c #FFFCD5",
"%.	c #FFFFEE",
"&.	c #FBF08D",
"*.	c #ECD033",
"=.	c #F9F1B8",
"-.	c #FFFFAE",
";.	c #F7E86B",
">.	c #E3C72C",
",.	c #738B6E",
"'.	c #687B63",
").	c #576452",
"!.	c #495345",
"~.	c #4F5B4B",
"{.	c #3F453D",
"].	c #D98C08",
"^.	c #FAF398",
"/.	c #E8CB29",
"(.	c #FAF4B1",
"_.	c #FFFDA1",
":.	c #FCF388",
"<.	c #586953",
"[.	c #DA8C0A",
"}.	c #FCF48C",
"|.	c #E7CA24",
"1.	c #FCF8C3",
"2.	c #FFFEB1",
"3.	c #FFFA8E",
"4.	c #C3CEBF",
"5.	c #556550",
"6.	c #879B83",
"7.	c #424D40",
"8.	c #84967F",
"9.	c #414A3D",
"0.	c #DA8C09",
"a.	c #FFFFFA",
"b.	c #E3C518",
"c.	c #FFFED2",
"d.	c #FFFEB9",
"e.	c #FFFEA7",
"f.	c #84957F",
"g.	c #DE8E06",
"h.	c #FFFED9",
"i.	c #FFFFB9",
"j.	c #FFF672",
"k.	c #FFF571",
"l.	c #FFF56F",
"m.	c #FFF56A",
"n.	c #FFF266",
"o.	c #FFF15E",
"p.	c #FFEA47",
"q.	c #84957E",
"r.	c #809A78",
"s.	c #AEBDA9",
"t.	c #879B81",
"u.	c #83957E",
"v.	c #4A5846",
"w.	c #677A61",
"x.	c #7D9775",
"y.	c #7A9472",
"z.	c #728A6B",
"A.	c #5E7058",
"B.	c #6D8267",
"C.	c #697D64",
"                                              ",
"  . . . . . . . . . . . . . . . . . . . . .   ",
"  + @ @ @ @ @ @ @ @ @ @ @ @ # @ @ @ @ $ % &   ",
"  * = @ - ; > @ @ , ' ' ) ) $ $ $ $ $ ! ~ &   ",
"  { = ] ^ ; / @ @ , ' $ $ $ $ $ $ $ ! ~ ( _   ",
"  : @ < [ } | @ , ' ' $ $ $ 1 1 1 1 1 1 2 _   ",
"  3 4 5 6 7 8 ' , ' $ ) 9 1 0 a b c d e 1 1   ",
"  f g h i j k l m , $ 1 n o p q r s e t u v 1 ",
"  w x y z A B C D C E 1 F G H I e t u J F K 1 ",
"  L M N O P Q R S T U 1 V W X Y F Z `  ...+.1 ",
"  @.#.$.%.&.*.=.$ -.;.>.1 9 ,.'.).!.~.{.9 1   ",
"  ].; > ^./.(.$ -.-._.:.1 <.9 9 9 9 9 9 '.1   ",
"  [.; }.|.1.2.-._._.3.3.1 <.4.5.6.7.8.9.'.1   ",
"  0.a.b.c.d.e._._._.3.3.1 <.4.5.6.7.f.9.'.1   ",
"  g.h.i.j.k.l.m.n.o.o.p.1 <.4.5.6.7.q.9.'.1   ",
"  _ _ & _ _ _ _ _ _ _ _ 1 r.s.5.t.7.u.v.w.1   ",
"                          1 x.y.z.A.B.C.1     ",
"                            1 1 1 1 1 1       "};
