/* XPM */
static char * privacy_unknown_xpm[] = {
"24 24 123 2",
"  	c None",
". 	c #828282",
"+ 	c #000000",
"@ 	c #D7D7D7",
"# 	c #6D6D6D",
"$ 	c #545454",
"% 	c #949494",
"& 	c #FDFDFD",
"* 	c #A89A59",
"= 	c #CBAF35",
"- 	c #D6D6D6",
"; 	c #666666",
"> 	c #373737",
", 	c #878787",
"' 	c #F9F9F9",
") 	c #DEDEDE",
"! 	c #E7C118",
"~ 	c #888888",
"{ 	c #F6F6F6",
"] 	c #CDCDCD",
"^ 	c #F8CC06",
"/ 	c #656565",
"( 	c #363636",
"_ 	c #818181",
": 	c #F4F4F4",
"< 	c #E9E9E9",
"[ 	c #FFCF00",
"} 	c #616161",
"| 	c #383838",
"1 	c #868686",
"2 	c #EBEBEB",
"3 	c #C2C2C2",
"4 	c #5F5F5F",
"5 	c #9F9F9F",
"6 	c #FFFFFF",
"7 	c #898989",
"8 	c #343434",
"9 	c #3B3B3B",
"0 	c #9E9E9E",
"a 	c #DADADA",
"b 	c #FEFEFE",
"c 	c #353535",
"d 	c #3A3A3A",
"e 	c #8A8A8A",
"f 	c #E1E1E1",
"g 	c #DDDDDD",
"h 	c #424242",
"i 	c #3C3C3C",
"j 	c #9B9B9B",
"k 	c #D8D8D8",
"l 	c #555555",
"m 	c #4D4D4D",
"n 	c #9C9C9C",
"o 	c #767676",
"p 	c #3F3F3F",
"q 	c #B7B7B7",
"r 	c #D2D2D2",
"s 	c #4F4F4F",
"t 	c #5C5C5C",
"u 	c #AAAAAA",
"v 	c #CBCBCB",
"w 	c #3E3E3E",
"x 	c #6C6C6C",
"y 	c #D0D0D0",
"z 	c #BABABA",
"A 	c #484848",
"B 	c #6A6A6A",
"C 	c #B9B9B9",
"D 	c #EFEFEF",
"E 	c #393939",
"F 	c #3D3D3D",
"G 	c #AEAEAE",
"H 	c #7A7A7A",
"I 	c #414141",
"J 	c #404040",
"K 	c #777777",
"L 	c #C8C8C8",
"M 	c #F8F8F8",
"N 	c #7F7F7F",
"O 	c #515151",
"P 	c #525252",
"Q 	c #626262",
"R 	c #4E4E4E",
"S 	c #FCFCFC",
"T 	c #979797",
"U 	c #7D7D7D",
"V 	c #4A4A4A",
"W 	c #8F8F8F",
"X 	c #ACACAC",
"Y 	c #D1D1D1",
"Z 	c #CCCCCC",
"` 	c #B8B8B8",
" .	c #7B7B7B",
"..	c #969696",
"+.	c #5A5A5A",
"@.	c #4C4C4C",
"#.	c #F3F3F3",
"$.	c #BCBCBC",
"%.	c #323232",
"&.	c #606060",
"*.	c #AFAFAF",
"=.	c #686868",
"-.	c #D9D9D9",
";.	c #727272",
">.	c #E7E7E7",
",.	c #A0A0A0",
"'.	c #737373",
").	c #444444",
"!.	c #B6B6B6",
"~.	c #F7F7F7",
"{.	c #717171",
"].	c #454545",
"^.	c #BEBEBE",
"/.	c #BDBDBD",
"(.	c #5D5D5D",
"_.	c #6F6F6F",
":.	c #696969",
"<.	c #4B4B4B",
"[.	c #595959",
"}.	c #B1B1B1",
"|.	c #505050",
"1.	c #ABABAB",
"2.	c #797979",
". + + + + + + + + .                   @ # $ % & ",
"+ * * * * * * * = +                 - ; > , ' ) ",
"+ * = = = = = ! = +               - ; > ~ { ) ] ",
"+ * = ! ! ! ^ ! = +             @ / ( _ : ) ] < ",
"+ * = ! ^ [ ^ ! = +             } | 1 2 ) ] < 3 ",
"+ * = ! [ [ ^ ! = +           4 | 5 ' ) ] < 3 6 ",
"+ * = ^ ^ ^ ^ ! = +         7 8 9 0 a ] < 3 b ] ",
"+ * ! ! ! ! ! ! = +         _ c d c e f 3 6 ] g ",
"+ = = = = = = = = +         e h ( i ( j & ] ) k ",
". + + + + + + + + .     5 l c m n f o p q ) k r ",
"                    1 s d t u 2 b 6 v w x y r { ",
"              z # A w B C D 6 6 6 D B E F G v H ",
"              I J K L : 6 6 6 6 M N | E E O h P ",
"            Q R @ S 6 6 6 6 6 & T > U 4 9 9 V W ",
"            E X S Y Z { 6 6 b ` 8  .    1 ..    ",
"          +.@.#.$.c %.5 6 6 y i &.              ",
"          E *.'  .| 8 1 6 a A A                 ",
"        l =.-.; c ;._ g >.t p ,.                ",
"      '.).T m ).!.~.#.a {.9 T                   ",
"      h ].h } ^./., (.h F _.                    ",
"    l E d A :.<.F s [.~ }.                      ",
"  x | E E p |.7 1.                              ",
"H | E m  .                                      ",
"W t 2.                                          "};
