/* XPM */
static char * mail_forward_xpm[] = {
"28 28 222 2",
"  	c None",
". 	c #3B3B3B",
"+ 	c #575555",
"@ 	c #DDDCDD",
"# 	c #D5D5D6",
"$ 	c #D9D8D8",
"% 	c #D5D6D6",
"& 	c #CECDCE",
"* 	c #D3D3D3",
"= 	c #D1D0D1",
"- 	c #CFCFCF",
"; 	c #CAC9CA",
"> 	c #C3C3C3",
", 	c #C4C4C3",
"' 	c #C2C1C2",
") 	c #C0BFC0",
"! 	c #BEBEBE",
"~ 	c #BCBBBC",
"{ 	c #4B4949",
"] 	c #9E9D9E",
"^ 	c #545252",
"/ 	c #F4F4F4",
"( 	c #EBEBEB",
"_ 	c #EAE9E9",
": 	c #E3E3E3",
"< 	c #E1E1E1",
"[ 	c #DFE0E0",
"} 	c #DCDCDD",
"| 	c #D9D9D9",
"1 	c #D8D8D8",
"2 	c #CDCCCD",
"3 	c #C4C4C4",
"4 	c #C3C2C3",
"5 	c #C2C2C2",
"6 	c #BDBDBD",
"7 	c #514F4F",
"8 	c #818080",
"9 	c #DFDFDF",
"0 	c #9E9E9E",
"a 	c #F0F0F1",
"b 	c #EDEDED",
"c 	c #EAEAEA",
"d 	c #E7E6E6",
"e 	c #E0E0E0",
"f 	c #DDDDDC",
"g 	c #D9DADA",
"h 	c #D6D6D6",
"i 	c #CECECE",
"j 	c #C1C0C1",
"k 	c #C5C4C5",
"l 	c #C5C5C5",
"m 	c #747372",
"n 	c #848282",
"o 	c #F7F8F8",
"p 	c #E8E8E8",
"q 	c #B4B3B3",
"r 	c #EAEBEA",
"s 	c #E7E7E8",
"t 	c #E4E5E4",
"u 	c #DEDDDD",
"v 	c #DADADA",
"w 	c #D7D7D7",
"x 	c #D4D4D3",
"y 	c #C6C6C6",
"z 	c #C4C3C4",
"A 	c #CACACA",
"B 	c #8B8989",
"C 	c #B9B8B8",
"D 	c #A09F9F",
"E 	c #F5F5F6",
"F 	c #F2F3F2",
"G 	c #E0E0DF",
"H 	c #959494",
"I 	c #E5E5E5",
"J 	c #E2E2E1",
"K 	c #DFDFDE",
"L 	c #DBDBDB",
"M 	c #D5D5D5",
"N 	c #CCCCCC",
"O 	c #C6C7C6",
"P 	c #919191",
"Q 	c #C0C0C0",
"R 	c #B7B7B8",
"S 	c #A5A4A5",
"T 	c #F2F3F3",
"U 	c #F0F0F0",
"V 	c #EDECEC",
"W 	c #D5D4D4",
"X 	c #A6A6A6",
"Y 	c #DFE0DF",
"Z 	c #DCDCDC",
"` 	c #D4D5D5",
" .	c #C6C5C5",
"..	c #A1A1A1",
"+.	c #C1C2C2",
"@.	c #BFBFBE",
"#.	c #B5B6B6",
"$.	c #A3A2A2",
"%.	c #F1F0F0",
"&.	c #EDEDEE",
"*.	c #E6E6E7",
"=.	c #C9C8C9",
"-.	c #919090",
";.	c #D0CFD0",
">.	c #C6C5C6",
",.	c #4F4D4D",
"'.	c #888787",
").	c #C2C3C3",
"!.	c #BFBFBF",
"~.	c #BCBDBC",
"{.	c #B0B0B0",
"].	c #969494",
"^.	c #EEEEEE",
"/.	c #EBEAEB",
"(.	c #E8E7E8",
"_.	c #E3E4E3",
":.	c #9A9999",
"<.	c #8D8B8B",
"[.	c #C8C8C8",
"}.	c #504E4E",
"|.	c #858484",
"1.	c #979797",
"2.	c #BCBDBD",
"3.	c #B9B9BA",
"4.	c #B2B3B2",
"5.	c #A5A4A4",
"6.	c #ECEBEC",
"7.	c #E9E8E8",
"8.	c #E5E5E6",
"9.	c #DCDBDB",
"0.	c #D4D4D4",
"a.	c #797777",
"b.	c #8C8B8B",
"c.	c #828181",
"d.	c #A9A9A9",
"e.	c #B7B8B7",
"f.	c #999999",
"g.	c #E9E9EA",
"h.	c #3E3E3E",
"i.	c #DBDCDC",
"j.	c #4E4C4C",
"k.	c #949393",
"l.	c #B3B2B2",
"m.	c #777676",
"n.	c #808080",
"o.	c #828080",
"p.	c #B6B6B6",
"q.	c #8F8E8E",
"r.	c #8E8D8D",
"s.	c #9C9B9B",
"t.	c #A9AAAA",
"u.	c #959595",
"v.	c #E4E4E4",
"w.	c #000000",
"x.	c #0A0A0A",
"y.	c #4C4A4A",
"z.	c #8D8C8C",
"A.	c #BEBDBD",
"B.	c #D3D4D3",
"C.	c #CFCFCE",
"D.	c #949493",
"E.	c #939191",
"F.	c #B0AFB0",
"G.	c #B9B8B9",
"H.	c #B9B9B9",
"I.	c #898888",
"J.	c #838282",
"K.	c #D2D1D2",
"L.	c #668154",
"M.	c #080707",
"N.	c #CDCDCC",
"O.	c #D1D1D1",
"P.	c #CACACB",
"Q.	c #BCBBBB",
"R.	c #B7B6B7",
"S.	c #B9BABA",
"T.	c #B7B7B7",
"U.	c #858383",
"V.	c #6A6968",
"W.	c #748C64",
"X.	c #58833C",
"Y.	c #0F0F0F",
"Z.	c #D2D2D2",
"`.	c #CECFCE",
" +	c #C9C9CA",
".+	c #BAB9B9",
"++	c #B8B7B8",
"@+	c #B4B4B5",
"#+	c #B1B1B1",
"$+	c #AEAEAE",
"%+	c #706E6E",
"&+	c #6F9059",
"*+	c #557C3B",
"=+	c #65894C",
"-+	c #669447",
";+	c #5E8A41",
">+	c #171717",
",+	c #C9C9C9",
"'+	c #C3C3C4",
")+	c #BCBCBC",
"!+	c #B9BAB9",
"~+	c #B5B5B5",
"{+	c #B2B2B2",
"]+	c #AFAFAF",
"^+	c #ACABAB",
"/+	c #A8A7A8",
"(+	c #7D9A69",
"_+	c #6E9952",
":+	c #639144",
"<+	c #0D0D0D",
"[+	c #B9C9B1",
"}+	c #AECCA1",
"|+	c #A9C79C",
"1+	c #E0EADB",
"2+	c #D8E6D2",
"3+	c #D7E5D0",
"4+	c #D3E3CB",
"5+	c #D0E1C9",
"6+	c #BDCEB6",
"7+	c #E1EBDC",
"8+	c #B9C3B5",
"9+	c #DBE7D6",
"                                                        ",
"                                                        ",
"                                                        ",
"      . . . . . . . . . . . . . . . . . . . . .         ",
"      . + @ # $ % & * = - & ; > , ' ) ! ~ ! { .         ",
"      . ] ^ / ( _ : < [ } | 1 2 3 4 5 6 6 7 8 .         ",
"      . 9 0 { a b c d : e f g h i j k l { m n .         ",
"      . o p q { r s t < u v w x y z A { B C D .         ",
"      . E F G H { I J K L 1 M N 4 O { P Q R S .         ",
"      . T U V W X { Y Z | `  .5 l { ..+.@.#.$..         ",
"      . %.&.c *.=.-.{ g ;.l >.k ,.'.).!.~.{.]..         ",
"      . ^./.(._.v :.<.{ [.4 l }.|.1.2.6 3.4.5..         ",
"      . 6.7.8.9.0.{ a.b.{ ! { c.B { P d.e.{.f..         ",
"      . g.h.i.M j.k.l.m.n.{ m.o.p.q.{ r.s.t.u..         ",
"      . v.w.x.y.z.A.B.C.D.B E.F.G.~.H.{ I.q.J..         ",
"      . K.w.L.M.N.0.O.P.Q.E.G.R.G.S.T.q { U.V..         ",
"  w.w.w.w.w.W.X.Y.Z.`. +!..+G.C G.++@+#+$+{ %+.         ",
"  w.&+*+*+*+=+-+;+>+N ,+'+! )+!+G.~+{+]+^+/+{ .         ",
"  w.(+-+-+-+_+-+-+:+<+. . . . . . . . . . . . .         ",
"  w.[+}+}+}+|+}+}+1+w.                                  ",
"  w.2+3+4+5+6+}+7+w.                                    ",
"  w.w.w.w.w.8+9+w.                                      ",
"          w.9+w.                                        ",
"          w.w.                                          ",
"          w.                                            ",
"                                                        ",
"                                                        ",
"                                                        "};
