/* XPM */
static char * inbox_open_xpm[] = {
"17 15 20 1",
" 	c None",
".	c #43517F",
"+	c #000000",
"@	c #6589FF",
"#	c #8689C5",
"$	c #FF0000",
"%	c #9295CC",
"&	c #E74747",
"*	c #010103",
"=	c #4F5EF0",
"-	c #04050B",
";	c #313645",
">	c #070912",
",	c #698AFA",
"'	c #05070E",
")	c #020307",
"!	c #020306",
"~	c #03050A",
"{	c #010204",
"]	c #848484",
"                 ",
"   .....   ++++++",
"  @#####@  +$$$$+",
" .#%%%%%#...+&&+ ",
" .#%%%%%%%##+&+* ",
" .#%%%%%%%%%%+=- ",
";;;;;;;;;;;;=%=> ",
";#%%%%%%,%,=+==' ",
";#%%%%,%%,%=+==) ",
" ;#%%%%%,%,,@+@! ",
" ;#%%,%,%,,,=+@- ",
"  ;#,%,%,,,,=@+~ ",
"  ;@@@@@@@@@@@+{ ",
"   +++++++++++!+ ",
"       ]         "};
