/* XPM */
static char * close_xpm[] = {
"28 28 27 1",
" 	c None",
".	c #D79190",
"+	c #E31514",
"@	c #F45F5F",
"#	c #E8E7E8",
"$	c #FAFAFA",
"%	c #8B9AA7",
"&	c #758995",
"*	c #3B4751",
"=	c #161B25",
"-	c #83909C",
";	c #566268",
">	c #A3B1BC",
",	c #B9C3CE",
"'	c #C9D2DA",
")	c #F3F7FB",
"!	c #E4EDF5",
"~	c #E7D5C9",
"{	c #AEBBC6",
"]	c #303338",
"^	c #657683",
"/	c #C6CAD6",
"(	c #DAE3EB",
"_	c #DFE0E1",
":	c #98A7B4",
"<	c #D0D9E4",
"[	c #C7C8C9",
"                            ",
"                            ",
"               .++++++++.   ",
"               +@#@++@#@+   ",
"               +.#$@@$#@+   ",
"               ++@#$$#+++   ",
"    %&**=======+++@$$.+++   ",
"  -=;->,'$$$)!!++.$~~$@++   ",
"  *;{$$$$)!!!!!+.$~++~$@+   ",
"  ]^;/$!!!!!!#(++.++++.++   ",
"  =-^;#!!!!((__.++++++++.   ",
"  =:-^>$!((_((<<<<<<%^&%=   ",
"  =,::^:!(((<<<<<<'>^&&:=   ",
"  =,,:^^'<<<<<<<'',^&&::=   ",
"  =[,{%;-<<<<'''//^;--,:=   ",
"  ='[[,;;&&-%%-&^;;]^,,:=   ",
"  =!_':,>&-&&&&&&-&*;<,:=   ",
"  =!(,%(({&&&&&-&-&%&:,:=   ",
"  =!<-'<<<,%&&&&&-><<^>:=   ",
"  *{%{//////,{{{,////,;-]   ",
"  *^%{{{{{{{{{{{{{{{{{%*]   ",
"  -=*;^&-:::::::::-&^;]=&   ",
"   >-^;*]=========]**^-:    ",
"                            ",
"                            ",
"                            ",
"                            ",
"                            "};
