/* XPM */ 
static char * outbox_open_hrm_xpm[] = {
"16 16 165 2",
"  	c None",
"! 	c black",
"# 	c #247CD5",
"$ 	c #0166CC",
"% 	c #076ACD",
"& 	c #2079D3",
"' 	c #0066CC",
"( 	c #0569CD",
") 	c #297FD4",
"* 	c #4891DA",
"+ 	c #6BA9E7",
", 	c #529AE1",
"- 	c #1F79D3",
". 	c #DBE9F8",
"/ 	c #CCE0F5",
"0 	c #B9D5F1",
"1 	c #8AB9E8",
"2 	c #1572D0",
"3 	c #0167CE",
"4 	c #0267CC",
"5 	c #93C0ED",
"6 	c #CDE4FB",
"7 	c #3F8DDB",
"8 	c #C3DBF3",
"9 	c #C6DDF4",
": 	c #B4D2F0",
"; 	c #7BB0E5",
"< 	c #086ACE",
"= 	c #BFD9F5",
"> 	c #DAEBFB",
"? 	c #217AD3",
"@ 	c #1A76D1",
"A 	c #98C1EA",
"B 	c #CCE1F5",
"C 	c #BED8F2",
"D 	c #ABCDEE",
"E 	c #2C80D5",
"F 	c #0268CC",
"G 	c #1572D1",
"H 	c #DDECFB",
"I 	c #F9FCFF",
"J 	c #4E95DC",
"K 	c #1E78D2",
"L 	c #ACCDEF",
"M 	c #5699DD",
"N 	c #0C6ECF",
"O 	c #237BD3",
"P 	c #82B4E6",
"Q 	c #0167CD",
"R 	c #0D6ECF",
"S 	c #E2F0FD",
"T 	c #F4F9FF",
"U 	c #FCFDFF",
"V 	c #0368CD",
"W 	c #5E9EDF",
"X 	c #1271D0",
"Y 	c #0468CD",
"Z 	c #529AE3",
"[ 	c #1070CF",
"\ 	c #096DD1",
"] 	c #0066CD",
"^ 	c #0267CD",
"_ 	c #B7D6F5",
"` 	c #BEDAF5",
"a 	c #C2DCF5",
"b 	c #066ACD",
"c 	c #1371D0",
"d 	c #1C77D3",
"e 	c #AFD7FF",
"f 	c #4695E4",
"g 	c #0A6ED4",
"h 	c #0067CD",
"i 	c #1F70C3",
"j 	c #4E98E2",
"k 	c #A1D0FF",
"l 	c #77B9FA",
"m 	c #0E70D3",
"n 	c #0367CB",
"o 	c #5481AD",
"p 	c #778DA2",
"q 	c #8598AB",
"r 	c #428BD4",
"s 	c #0E6FCF",
"t 	c #9DC7F2",
"u 	c #AFD3F6",
"v 	c #C9E3FD",
"w 	c #2A80D7",
"x 	c #62A4E7",
"y 	c #A6D3FF",
"z 	c #80BDFA",
"{ 	c #1977D6",
"| 	c #0B6CCD",
"} 	c #7B9CBF",
"~ 	c #7B90A6",
" !	c #748AA0",
"!!	c #DCE1E8",
"#!	c #EFF5FB",
"$!	c #3E8DDC",
"%!	c #C3E1FF",
"&!	c #BDDEFF",
"'!	c #B3D9FF",
"(!	c #A4D2FF",
")!	c #75B6F6",
"*!	c #1070D1",
"+!	c #1A74CF",
",!	c #A2B9D1",
"-!	c #AEBBC7",
".!	c #95A5B6",
"/!	c #DFE4E9",
"0!	c #F7F9FA",
"1!	c #BAD5EF",
"2!	c #69ABEB",
"3!	c #9ACDFF",
"4!	c #62A9F1",
"5!	c #076ACE",
"6!	c #3282D1",
"7!	c #B9C9D8",
"8!	c #BBC6D0",
"9!	c #ACB9C6",
":!	c #92A4B5",
";!	c #DBE0E6",
"<!	c #F3F5F7",
"=!	c #6BA5DE",
">!	c #066ACE",
"?!	c #4B99E8",
"@!	c #358BE2",
"A!	c #5092D5",
"B!	c #C9D3DE",
"C!	c #C4CDD7",
"D!	c #B7C3CE",
"E!	c #A8B5C3",
"F!	c #8EA0B2",
"G!	c #D7DDE4",
"H!	c #EEF0F3",
"I!	c #EDF0F3",
"J!	c #E6ECF1",
"K!	c #629FDB",
"L!	c #0E6ECF",
"M!	c #1F78D1",
"N!	c #85B1DC",
"O!	c #D3DAE1",
"P!	c #CAD2DB",
"Q!	c #BFC9D3",
"R!	c #B2BECA",
"S!	c #A2B1BF",
"T!	c #889BAE",
"U!	c #758BA1",
"V!	c #8699AC",
"W!	c #BEC9D3",
"X!	c #D0D8DF",
"Y!	c #CFD7DE",
"Z!	c #CDD5DD",
"[!	c #CAD3DB",
"\!	c #C6D0D8",
"]!	c #C2CCD5",
"^!	c #BBC6D1",
"_!	c #B4C0CB",
"`!	c #ABB8C6",
"a!	c #A0AFBE",
"b!	c #8C9EB1",
"c!	c #768BA1",
"d!	c #758AA1",
"e!	c #758AA0",
"f!	c #748BA1",
"g!	c #748BA0",
"              # $ % & &         "
"            # ' ( ) * & ' ' & & "
"          # ' + , - . / 0 1 2 3 "
"        # 4 5 6 7 ' 8 9 : ; '   "
"      ' < = > ? @ A B C D E F   "
"    ' G H I J K L M N O P ' Q   "
"  Q R S T U V W X Y Z Y [ \ ]   "
"  ^ # _ ` a R b c d e f ' g h   "
"  i ' ' ' ' ' ' ' j k l m n o   "
"p q r s t u v w x y z { | } ~  !"
" !!!#!K $!%!&!'!(!)!*!+!,!-!.! !"
" !/!0!1!^ 2!y 3!4!5!6!7!8!9!:! !"
" !;!<!<!=!>!?!@!4 A!B!C!D!E!F! !"
" !G!H!I!J!K!L!M!N!O!P!Q!R!S!T! !"
"U!V!W!X!Y!Z![!\!]!^!_!`!a!b!c!d!"
"  e!f! ! ! ! ! ! ! ! ! ! !g!e!  "};