/* XPM */ 
static char * mail_attach_xpm[] = {
"24 24 194 2",
"  	c None",
"! 	c black",
"# 	c #748BA1",
"$ 	c #748AA0",
"% 	c #748BA0",
"& 	c #73899F",
"' 	c #758AA0",
"( 	c #798EA4",
") 	c #8094A8",
"* 	c #7E92A7",
"+ 	c #7A8FA4",
", 	c #74899F",
"- 	c #768BA2",
". 	c #899CAE",
"/ 	c #8C9EB0",
"0 	c #7B8FA5",
"1 	c #778DA2",
"2 	c #7A90A5",
"3 	c #768CA1",
"4 	c #758CA1",
"5 	c #9EAEBC",
"6 	c #8FA1B3",
"7 	c #738A9F",
"8 	c #738AA0",
"9 	c #748AA1",
": 	c #7489A1",
"; 	c #A1B0BF",
"< 	c #899BAE",
"= 	c #A0AFBE",
"> 	c #788DA4",
"? 	c #788EA3",
"@ 	c #9BABBA",
"A 	c #96A6B7",
"B 	c #8195A9",
"C 	c #AEBBC8",
"D 	c #768CA2",
"E 	c #778CA2",
"F 	c #7D91A6",
"G 	c #758BA1",
"H 	c #91A3B4",
"I 	c #A5B3C2",
"J 	c #7C91A5",
"K 	c #BBC6D1",
"L 	c #758BA2",
"M 	c #758AA1",
"N 	c #7B90A5",
"O 	c #8799AD",
"P 	c #AFBCC9",
"Q 	c #768DA2",
"R 	c #BFC9D3",
"S 	c #8598AB",
"T 	c #778CA1",
"U 	c #7C92A6",
"V 	c #A4B2C1",
"W 	c #8B9EB0",
"X 	c #B1BDCA",
"Y 	c #788DA3",
"Z 	c #BCC6D1",
"[ 	c #718B9B",
"\ 	c #129917",
"] 	c #199E1C",
"^ 	c #6E9191",
"_ 	c #8B9DB0",
"` 	c #8598AC",
"a 	c #AFBCC8",
"b 	c #7E93A7",
"c 	c #ACB9C7",
"d 	c #A6B4C2",
"e 	c #628D89",
"f 	c #009900",
"g 	c #12A012",
"h 	c #7D9BA0",
"i 	c #93A4B5",
"j 	c #738AA1",
"k 	c #758BA0",
"l 	c #A5B3C1",
"m 	c #8396AA",
"n 	c #99A9B9",
"o 	c #B5C1CC",
"p 	c #748B9F",
"q 	c #92B7A6",
"r 	c #96D596",
"s 	c #19A21A",
"t 	c #229F28",
"u 	c #6E8B97",
"v 	c #98A8B8",
"w 	c #8B9DAF",
"x 	c #8A9CAF",
"y 	c #8DB3A2",
"z 	c #A9DDA9",
"{ 	c #A3DAA3",
"| 	c #119F12",
"} 	c #17981F",
"~ 	c #899CAF",
" !	c #7D92A6",
"!!	c #B4BFCC",
"#!	c #688D8D",
"$!	c #5D8F80",
"%!	c #78A493",
"&!	c #98BFA8",
"'!	c #4C8F69",
"(!	c #A8DDA8",
")!	c #BDE5BD",
"*!	c #8ED28E",
"+!	c #079B07",
",!	c #019A01",
"-!	c #7D92A7",
".!	c #24972F",
"/!	c #A5DBA5",
"0!	c #BAE3BA",
"1!	c #A9DCA9",
"2!	c #70C670",
"3!	c #039B03",
"4!	c #009A00",
"5!	c #8EA0B2",
"6!	c #638D88",
"7!	c #81CD81",
"8!	c #B5E1B5",
"9!	c #B8E3B8",
":!	c #B9E3B9",
";!	c #B7E3B7",
"<!	c #B3E0B3",
"=!	c #ADDEAD",
">!	c #BBE4BB",
"?!	c #B3E1B3",
"@!	c #A2DAA2",
"A!	c #8CD18C",
"B!	c #4EB84E",
"C!	c #009800",
"D!	c #748A9F",
"E!	c #768BA1",
"F!	c #8C9EB1",
"G!	c #8295AA",
"H!	c #558E77",
"I!	c #ACDEAC",
"J!	c #D8EFD8",
"K!	c #DBF1DB",
"L!	c #DCF1DC",
"M!	c #D6EFD6",
"N!	c #CFECCF",
"O!	c #C5E8C5",
"P!	c #ABDDAB",
"Q!	c #99D699",
"R!	c #82CD82",
"S!	c #67C267",
"T!	c #20A620",
"U!	c #8195A8",
"V!	c #608E84",
"W!	c #CCEBCC",
"X!	c #D0ECD0",
"Y!	c #CEECCE",
"Z!	c #CAEACA",
"[!	c #C4E7C4",
"\!	c #AEDFAE",
"]!	c #9FD99F",
"^!	c #74C874",
"_!	c #58BC58",
"`!	c #16A216",
"a!	c #7DA59A",
"b!	c #95D495",
"c!	c #BEE5BE",
"d!	c #C1E6C1",
"e!	c #C2E7C2",
"f!	c #BCE4BC",
"g!	c #ABDEAB",
"h!	c #90D290",
"i!	c #7BCA7B",
"j!	c #62C062",
"k!	c #29AA29",
"l!	c #778EA1",
"m!	c #0B990F",
"n!	c #31AA33",
"o!	c #8AD08A",
"p!	c #8DD18D",
"q!	c #89D089",
"r!	c #83CE83",
"s!	c #7CCB7C",
"t!	c #88D088",
"u!	c #7DCB7D",
"v!	c #34AE34",
"w!	c #08980C",
"x!	c #62C162",
"y!	c #63C163",
"z!	c #38B038",
"{!	c #019901",
"|!	c #719D8F",
"}!	c #659486",
"~!	c #5C8F7F",
" #	c #49B749",
"!#	c #38AF38",
"##	c #029902",
"$#	c #8498AB",
"%#	c #25A825",
"&#	c #7489A0",
"                                # $ $ % &       "
"                      &     ' $ ( ) * + % $ ,   "
"                    ' - $ % $ . / 0 - 1 2 3 $   "
"                  ' 4 5 + $ / 6 $ 7 8 % $ + 9 $ "
"                : $ ; . $ < = $ '       ' > ? $ "
"                ' @ A $ B C D '     8   % E F $ "
"              G H I $ J K 0 '     L E $ M N * $ "
"            D O P # Q R S T     3 U V # $ W 1 # "
"          - U X Y $ Z A D     [ \ ] ^ $ _ ` 9   "
"        # Y a b $ c d G     % e f g \ h i $ &   "
"      j k l m $ n o $ p   p $ q f r s t u j     "
"    p $ v w $ x K # %     G d y f z { | }       "
"    M ~ 6 $  !!!Y #!    $!%!&!'!f (!)!*!+!,!    "
"  $ -!6 $ D c b .!f f f f f f f f /!0!1!2!3!4!  "
"8 G . k $ x 5!6!f 7!8!9!:!;!<!=!/!>!?!@!A!B!,!C!"
"D!+ F k E!F!G!H!f I!J!K!L!K!M!N!O!:!P!Q!R!S!T!f "
"$ + E!, ' U!6 V!f { W!X!X!Y!Z![!0!\!]!A!^!_!`!f "
"$ 1 M : # $ H a!f b!c!d!e!d!f!8!g!]!h!i!j!k!f 4!"
"$ $ G $   ' $ l!m!n!o!*!*!p!q!r!s!t!u!S!v!f 4!  "
"$ $ $ #       8 '!w!f f f f f f f x!y!z!{!4!    "
", $ $ $ $ 8 8 8 % ' |!}!~!    C!f  #!###f       "
"  $ ' $ $ % $ E!N $#N $         f %###f         "
"  M $ &#8 $ $ D 1 9 $           f f f           "
"      7 $ $ $ % # #             f 4!            "};