/* XPM */
static char *dir_close_hrm[]={
"16 16 8 1",
". c None",
"# c #002149",
"b c #0058c0",
"d c #0080ff",
"f c #58a8ff",
"a c #c00000",
"c c #ff0000",
"e c #ffc0c0",
"................",
"................",
"................",
"................",
"................",
"................",
"................",
"..#..........#..",
"..#aaaabbbbbb#..",
"..#ccccdddddd#..",
"..#eeeeffffff#..",
"..############..",
"................",
"................",
"................",
"................"};
