/* XPM */
static char * checkbox_off_xpm[] = {
"13 13 5 1",
" 	c None",
".	c #BBBBBB",
"+	c #727272",
"@	c #FFFFFF",
"#	c #DDDDDD",
"             ",
" ..........  ",
" .+++++++++@ ",
" .+#######+@ ",
" .+#@@@@@@+@ ",
" .+#@@@@@@+@ ",
" .+#@@@@@@+@ ",
" .+#@@@@@@+@ ",
" .+#@@@@@@+@ ",
" .+#@@@@@@+@ ",
" .+++++++++@ ",
"  @@@@@@@@@@ ",
"             "};
