/* XPM */
static char * outbox_close_xpm[] = {
"16 16 201 2",
"  	c None",
". 	c #B6B6B6",
"+ 	c #B8B8B8",
"@ 	c #BBBBBB",
"# 	c #BCBCBC",
"$ 	c #B9B9B9",
"% 	c #BABCBD",
"& 	c #B5B5B5",
"* 	c #646464",
"= 	c #737373",
"- 	c #777777",
"; 	c #787979",
"> 	c #787B7E",
", 	c #787878",
"' 	c #7F8589",
") 	c #6A7880",
"! 	c #828485",
"~ 	c #767676",
"{ 	c #828282",
"] 	c #707070",
"^ 	c #858585",
"/ 	c #606060",
"( 	c #878787",
"_ 	c #C4C4C4",
": 	c #B8B9B9",
"< 	c #A0A5A9",
"[ 	c #9EA4A8",
"} 	c #B2B4B5",
"| 	c #627580",
"1 	c #818C93",
"2 	c #D0D0D0",
"3 	c #B1B1B1",
"4 	c #D3D3D3",
"5 	c #A7A7A7",
"6 	c #595959",
"7 	c #8A8A8A",
"8 	c #797979",
"9 	c #C6C6C6",
"0 	c #DCDCDC",
"a 	c #D2D2D3",
"b 	c #CACBCC",
"c 	c #A0A9AE",
"d 	c #CFD0D0",
"e 	c #788891",
"f 	c #85939B",
"g 	c #D7D7D7",
"h 	c #DADADA",
"i 	c #E3E3E3",
"j 	c #E2E2E2",
"k 	c #868686",
"l 	c #7A7A7A",
"m 	c #D2D2D2",
"n 	c #595A5B",
"o 	c #575A5B",
"p 	c #4D565C",
"q 	c #5B5D5E",
"r 	c #44525A",
"s 	c #49575F",
"t 	c #636461",
"u 	c #5F5F5D",
"v 	c #B0B0B0",
"w 	c #DBDBDB",
"x 	c #6D6D6D",
"y 	c #838383",
"z 	c #727476",
"A 	c #A9ACAE",
"B 	c #C0C3C5",
"C 	c #676C6D",
"D 	c #666A6B",
"E 	c #77746F",
"F 	c #485962",
"G 	c #616A6C",
"H 	c #8C887C",
"I 	c #767168",
"J 	c #ABABAA",
"K 	c #DFDFDF",
"L 	c #757575",
"M 	c #8B8B8B",
"N 	c #6F777D",
"O 	c #8A9298",
"P 	c #97A1A8",
"Q 	c #4E595E",
"R 	c #616968",
"S 	c #74756E",
"T 	c #6F716C",
"U 	c #505E63",
"V 	c #928B7B",
"W 	c #9E8D74",
"X 	c #8C7D66",
"Y 	c #AFAEAB",
"Z 	c #818181",
"` 	c #767A7D",
" .	c #868E93",
"..	c #9CA6AB",
"+.	c #6A6559",
"@.	c #A68D69",
"#.	c #92846B",
"$.	c #606966",
"%.	c #616863",
"&.	c #A28F6D",
"*.	c #BFA172",
"=.	c #B89E70",
"-.	c #B4B2AE",
";.	c #E1E1E1",
">.	c #6F6F6F",
",.	c #B7B7B7",
"'.	c #7E7F80",
").	c #A1A9AE",
"!.	c #7D6549",
"~.	c #A98150",
"{.	c #6B6759",
"].	c #646356",
"^.	c #957949",
"/.	c #76694B",
"(.	c #9D8656",
"_.	c #A28349",
":.	c #B1B0A9",
"<.	c #E2E3E3",
"[.	c #8D8E8E",
"}.	c #7E7F7F",
"|.	c #84898D",
"1.	c #687780",
"2.	c #71828C",
"3.	c #414C50",
"4.	c #444A4B",
"5.	c #394247",
"6.	c #363029",
"7.	c #422E17",
"8.	c #312616",
"9.	c #343028",
"0.	c #3A3933",
"a.	c #7D878C",
"b.	c #9CA7AD",
"c.	c #636B70",
"d.	c #919394",
"e.	c #B8BABB",
"f.	c #636F77",
"g.	c #687984",
"h.	c #788893",
"i.	c #819098",
"j.	c #9FA9AE",
"k.	c #A6AEB3",
"l.	c #7C888F",
"m.	c #858B8F",
"n.	c #A2A4A6",
"o.	c #9A9A9A",
"p.	c #BABBBC",
"q.	c #D3D5D6",
"r.	c #DDDFE0",
"s.	c #848788",
"t.	c #7D7E7E",
"u.	c #838687",
"v.	c #9DA1A3",
"w.	c #D0D4D6",
"x.	c #DADCDD",
"y.	c #E4E5E5",
"z.	c #E7E7E7",
"A.	c #DADCDE",
"B.	c #80888E",
"C.	c #6C777E",
"D.	c #70797E",
"E.	c #898C8F",
"F.	c #D7D7D8",
"G.	c #DDDDDD",
"H.	c #666666",
"I.	c #929292",
"J.	c #D4D4D4",
"K.	c #E8E8E8",
"L.	c #E9E9E9",
"M.	c #EAEAEA",
"N.	c #EBEBEB",
"O.	c #7F8080",
"P.	c #A7AAAC",
"Q.	c #838D93",
"R.	c #7B8890",
"S.	c #9FAAB0",
"T.	c #A9B3B9",
"U.	c #616B70",
"V.	c #7C8082",
"W.	c #A9A9A9",
"X.	c #E0E0E0",
"Y.	c #E1E2E2",
"Z.	c #CDD0D2",
"`.	c #D3D6D9",
" +	c #BABEC1",
".+	c #5E6163",
"++	c #919293",
"@+	c #7B7B7B",
"#+	c #717171",
"$+	c #7C7C7C",
"%+	c #686868",
"&+	c #888888",
"*+	c #696969",
"=+	c #515151",
"-+	c #7E7E7E",
";+	c #808080",
">+	c #8E8E8E",
",+	c #919191",
"'+	c #7D7D7D",
")+	c #909090",
"!+	c #939393",
"  .   + @ # $   %   .   &   &   ",
". * = - ; > , ' ) ! ~ { ] ^ / ( ",
"  = = _ : < [ } | 1 2 3 4 5 6 7 ",
"  8 9 0 a b c d e f g h i j { k ",
"  l @ m n o p q r s t u v w x y ",
"  z A B o C D E F G H I J K L M ",
"  N O P Q R S T U V W X Y K y Z ",
"  `  ...+.@.#.$.%.&.*.=.-.;.>.M ",
",.'...).!.~.{.].^./.(._.:.<.[.}.",
"  |.1.2.3.4.5.6.7.8.9.0.a.b.c.d.",
"e.f.g.h.i.j.k.l.m.n.o.p.q.r.s.t.",
"  u.v.w.x.y.z.A.B.C.D.E.F.G.H.I.",
"& = J.K.L.M.N.N.O.P.Q.R.S.T.U.V.",
"  k W.X.0 j i ;.h 0 Y.Z.`. +.+++",
"& / 6 @+#+- $+%+&+*+7 *+M *+=+-+",
"  &+7 k y M ;+>+-+,+@+I.'+)+-+!+"};
