/* XPM */
static char * trash_open_xpm[] = {
"16 16 11 1",
" 	c None",
".	c #000000",
"+	c #333366",
"@	c #6666CC",
"#	c #C0C0C0",
"$	c #FF00FF",
"%	c #808080",
"&	c #9999FF",
"*	c #FFFFFF",
"=	c #FFFF00",
"-	c #222222",
"                ",
"        @.-%    ",
"    %%@+.+%-%   ",
" %%---&-+%+%-@  ",
"%+&+@*++%@%+%-  ",
"-&@&*+%++@+%+-  ",
"+@-*@#+.++%@%-  ",
".+#+#+#.+%==@-  ",
"..+%+%+.@*@=*@  ",
" @..%+%.@@*%=*+ ",
"   %+=+%@*%*%==+",
"    @*=+.@*%*%*@",
"   @*===@%+***+%",
"   @@**=+% +*+%%",
"     @++%   +%  ",
"                "};
