/* XPM */
static char * ldap_xpm[] = {
"16 16 85 1",
" 	c None",
".	c #212121",
"+	c #3C3C3C",
"@	c #404040",
"#	c #3D3D3D",
"$	c #373737",
"%	c #252525",
"&	c #525252",
"*	c #AEAEAE",
"=	c #BBBBBB",
"-	c #ACACAC",
";	c #858585",
">	c #4A4A4A",
",	c #272727",
"'	c #383838",
")	c #969696",
"!	c #BCBCBC",
"~	c #B8B8B8",
"{	c #A0A0A0",
"]	c #7D7D7D",
"^	c #9F9F9F",
"/	c #3E3E3E",
"(	c #434343",
"_	c #5F5F5F",
":	c #626262",
"<	c #5A5A5A",
"[	c #595959",
"}	c #B4B4B4",
"|	c #C3C3C3",
"1	c #B2B2B2",
"2	c #CBCBCB",
"3	c #C6C6C6",
"4	c #A7A7A7",
"5	c #5B5B5B",
"6	c #BEBEBE",
"7	c #C1C1C1",
"8	c #414141",
"9	c #C9C9C9",
"0	c #E5E5E5",
"a	c #DEDEDE",
"b	c #B9B9B9",
"c	c #5D5D5D",
"d	c #B0B0B0",
"e	c #A5A5A5",
"f	c #3B3B3B",
"g	c #C0C0C0",
"h	c #D9D9D9",
"i	c #D0D0D0",
"j	c #ADADAD",
"k	c #575757",
"l	c #959595",
"m	c #606060",
"n	c #2A2A2A",
"o	c #3F3F3F",
"p	c #B5B5B5",
"q	c #CACACA",
"r	c #9E9E9E",
"s	c #949494",
"t	c #8B8B8B",
"u	c #363636",
"v	c #8D8D8D",
"w	c #4B4B4B",
"x	c #898989",
"y	c #8E8E8E",
"z	c #393939",
"A	c #989898",
"B	c #979797",
"C	c #7A7A7A",
"D	c #747474",
"E	c #727272",
"F	c #313131",
"G	c #353535",
"H	c #7F7F7F",
"I	c #656565",
"J	c #2F2F2F",
"K	c #686868",
"L	c #6B6B6B",
"M	c #4C4C4C",
"N	c #2B2B2B",
"O	c #292929",
"P	c #232323",
"Q	c #2E2E2E",
"R	c #2C2C2C",
"S	c #282828",
"T	c #222222",
"             .  ",
"      +@#$%. .  ",
"     &*=-;>, .  ",
"    ')!~{]^/ .  ",
"   ,(_:<[}|( .  ",
"   /12345678 .  ",
"   (90abcdef .. ",
"   8ghijklmn... ",
"   opqgr&stu .. ",
"   +4bjvwxy$ .  ",
"   zAeBC(DEF .  ",
"   G;yHIz&z  .  ",
"   JKL_MNO   .  ",
"   PQJRST    .  ",
"             .  ",
"             .  "};
