/* XPM */
static char * checkbox_on_xpm[] = {
"11 11 7 1",
" 	c None",
".	c #000000",
"+	c #AEBBC6",
"@	c #D0D9E4",
"#	c #5F6975",
"$	c #3B4751",
"%	c #ECF2F5",
" ......... ",
".+++++++++.",
".+@@@@@#$+.",
".+@%%%#$$+.",
".+$#%#$$%+.",
".+$$#$$%%+.",
".+@$$$%%%+.",
".+@%$%%%%+.",
".+@%%%%%%+.",
".+++++++++.",
" ......... "};
