/* XPM */
static char *new[]={
"13 10 2 1",
". c None",
"# c #0000ff",
".###########.",
"#############",
"###.......###",
"####.....####",
"##.##...##.##",
"##.#######.##",
"####.###.####",
"###.......###",
"#############",
".###########."};
