/* XPM */
static char * mail_xpm[] = {
"36 36 166 2",
"  	c None",
". 	c #131313",
"+ 	c #3B3B3B",
"@ 	c #1A1A1A",
"# 	c #000000",
"$ 	c #8A8A8A",
"% 	c #CECECE",
"& 	c #969696",
"* 	c #3E3E3E",
"= 	c #A7A7A7",
"- 	c #DEDEDE",
"; 	c #E0E0E0",
"> 	c #CCCCCC",
", 	c #6D6D6D",
"' 	c #323232",
") 	c #747474",
"! 	c #E1E1E1",
"~ 	c #D4D4D4",
"{ 	c #D9D9D9",
"] 	c #D0D0D0",
"^ 	c #B4B4B4",
"/ 	c #414141",
"( 	c #0B0B0B",
"_ 	c #565656",
": 	c #BEBEBE",
"< 	c #DCDCDC",
"[ 	c #D2D2D2",
"} 	c #D7D7D7",
"| 	c #D8D8D8",
"1 	c #D3D3D3",
"2 	c #D1D1D1",
"3 	c #999999",
"4 	c #232323",
"5 	c #C9C9C9",
"6 	c #CFCFCF",
"7 	c #757575",
"8 	c #3C3C3C",
"9 	c #C1C1C1",
"0 	c #C7C7C7",
"a 	c #AAAAAA",
"b 	c #C8C8C8",
"c 	c #CDCDCD",
"d 	c #DDDDDD",
"e 	c #D6D6D6",
"f 	c #2D2D2D",
"g 	c #2C2C2C",
"h 	c #454545",
"i 	c #1C1C1C",
"j 	c #686868",
"k 	c #ECECEC",
"l 	c #E6E6E6",
"m 	c #C2C2C2",
"n 	c #B7B7B7",
"o 	c #B2B2B2",
"p 	c #D5D5D5",
"q 	c #ACACAC",
"r 	c #333333",
"s 	c #2F2F2F",
"t 	c #464646",
"u 	c #B8B8B8",
"v 	c #727272",
"w 	c #4A4A4A",
"x 	c #7D7D7D",
"y 	c #F2F2F2",
"z 	c #EAEAEA",
"A 	c #E5E5E5",
"B 	c #C5C5C5",
"C 	c #A6A6A6",
"D 	c #C6C6C6",
"E 	c #646464",
"F 	c #0A0A0A",
"G 	c #AEAEAE",
"H 	c #DADADA",
"I 	c #B9B9B9",
"J 	c #858585",
"K 	c #CBCBCB",
"L 	c #EDEDED",
"M 	c #DBDBDB",
"N 	c #BBBBBB",
"O 	c #737373",
"P 	c #DFDFDF",
"Q 	c #B1B1B1",
"R 	c #E3E3E3",
"S 	c #8D8D8D",
"T 	c #141414",
"U 	c #CACACA",
"V 	c #E2E2E2",
"W 	c #A5A5A5",
"X 	c #898989",
"Y 	c #BFBFBF",
"Z 	c #787878",
"` 	c #4B4B4B",
" .	c #0C0C0C",
"..	c #959595",
"+.	c #B3B3B3",
"@.	c #9B9B9B",
"#.	c #A2A2A2",
"$.	c #828282",
"%.	c #292929",
"&.	c #E7E7E7",
"*.	c #AFAFAF",
"=.	c #9D9D9D",
"-.	c #989898",
";.	c #A8A8A8",
">.	c #C0C0C0",
",.	c #A4A4A4",
"'.	c #2B2B2B",
").	c #505050",
"!.	c #838383",
"~.	c #525252",
"{.	c #E4E4E4",
"].	c #BDBDBD",
"^.	c #C4C4C4",
"/.	c #C3C3C3",
"(.	c #595959",
"_.	c #040404",
":.	c #7A7A7A",
"<.	c #EFEFEF",
"[.	c #F6F6F6",
"}.	c #8E8E8E",
"|.	c #EEEEEE",
"1.	c #A3A3A3",
"2.	c #939393",
"3.	c #A0A0A0",
"4.	c #BABABA",
"5.	c #5F5F5F",
"6.	c #5B5B5B",
"7.	c #7C7C7C",
"8.	c #BCBCBC",
"9.	c #616161",
"0.	c #B5B5B5",
"a.	c #ABABAB",
"b.	c #B0B0B0",
"c.	c #070707",
"d.	c #7E7E7E",
"e.	c #8B8B8B",
"f.	c #B6B6B6",
"g.	c #6C6C6C",
"h.	c #E9E9E9",
"i.	c #050505",
"j.	c #606060",
"k.	c #919191",
"l.	c #1E1E1E",
"m.	c #030303",
"n.	c #7B7B7B",
"o.	c #535353",
"p.	c #717171",
"q.	c #585858",
"r.	c #7F7F7F",
"s.	c #9E9E9E",
"t.	c #777777",
"u.	c #9A9A9A",
"v.	c #1B1B1B",
"w.	c #878787",
"x.	c #3D3D3D",
"y.	c #474747",
"z.	c #080808",
"A.	c #888888",
"B.	c #010101",
"C.	c #868686",
"D.	c #0E0E0E",
"E.	c #181818",
"F.	c #020202",
"G.	c #060606",
"H.	c #343434",
"I.	c #1F1F1F",
"                                                                        ",
"                                                                        ",
"                                                                        ",
"                        . + @                                           ",
"                      # $ % & #                                         ",
"                  # * = - ; > , #                                       ",
"                ' ) ! ~ ~ { ] ^ / #                                     ",
"            ( _ : < [ % } | 1 2 3 4                                     ",
"        # # $ > 5 5 2 6 - { % } > 7 #                                   ",
"        8 9 0 ^ a : b c d 5 > [ e > f #   g h i                         ",
"        j < k l 6 m n o b m c > ~ p q r s t u v w #                     ",
"          x y z l A e B n C D > % p 5 E F G H a I J i                   ",
"          # K L ; } M ; ; } C c > 6 1 N O z P Q ] R b S r T             ",
"            * U V { p 1 ~ H W % > U c X : R - Y I 6 | e u Z ` #         ",
"             ...k M } 1 ~ ~ +.- - { Y @.- M < [ +.D 0 B I : #.$.%.      ",
"          T . ( @.&.M p e Y *.m K 2 =.-.&.p { p ;.>.B U ~ d M ,.'.      ",
"        ).$ $ !.~.L {.} } ].^ ^.5 /.O &.- p p | u Y e | 1 1 D (.#       ",
"      _.:.<.[.z >.}.|.d | ].o c U _ D A { ~ 1 p b 1.^.> 6 e 3 @ #       ",
"      _.Z : - z P 2.3.z H : 4.] 4.5.L M } p | M 5 = ].c ~ % 6.#         ",
"      _.7.D ].K ; B S M - N 8.Y 9.0.&.d P ! < D q a.Y 6 ~ b.# #         ",
"      c.d.2 B 8.U - a e.{.f.=./ g.! h.&.- K 0.f.+.n /.e % ` #           ",
"      i.7.H 2 c : 0 ] J W ).8 j.o z d B N N U M Y >.c p k.l.#           ",
"      m.n.{ ] H l U 4.I o.p...6.p >.u = ^ U [ R e c e D q.#             ",
"      i.r.| p - } ~ [ 9 ^ f.f.s.t.$.u.4.5 2 6 P - ] ~ 3 v.#             ",
"      _.x ; h.d e { } < } e K 0 >.w.x.X 4.M ~ 1 {.] > y.#               ",
"      m.x <.- ~ p p e e p 1 ~ ] K b n.z.6.A.~ ~ A ~ ,.# #               ",
"      B.v ^.>.^.B B : I : ^ 0.C s.;.C.D.# E.+ 3 p B / #                 ",
"        # # # # # # # # F._.F._.G._.i.#       # H.) I.#                 ",
"                                                  # #                   ",
"                                                                        ",
"                                                                        ",
"                                                                        ",
"                                                                        ",
"                                                                        ",
"                                                                        ",
"                                                                        "};
