/* XPM */
static char *forwarded[]={
"10 10 2 1",
"# c None",
". c #000000",
".####.####",
"..###..###",
"...##...##",
"....#....#",
"..........",
"..........",
"....#....#",
"...##...##",
"..###..###",
".####.####"};
