/* XPM */
static char * brief_xpm[] = {
"27 23 12 1",
" 	c None",
".	c #CC0204",
"+	c #0402CC",
"@	c #6666CC",
"#	c #FCFECC",
"$	c #9999FF",
"%	c #CCCCFF",
"&	c #FFFFFF",
"*	c #999999",
"=	c #FCFEFC",
"-	c #6466CC",
";	c #E0DADE",
"                           ",
"                           ",
"               ..+.        ",
"             .@###$.       ",
"           .@%#&*&#+$      ",
"        $.$#%#%***%#$.     ",
"      .$+=#%#%#%#%#%#$.    ",
"    .$+&&#%#%#%*&#%#%#%+   ",
"  @@$&&&%*#%#%*##*&%#%$.$  ",
"  ..%&&*%#%#*#%%*#%#%$+-*  ",
"   @@+&%#%#%#%*%#%#$$.*-   ",
"    .%$&%#%#%#%#%#@$+*     ",
"     @-+&%#%#%#%$.%.       ",
"      .%$&%#%#%$.$+  *     ",
"    @  @@+&&#$.$+$  *;* *  ",
"   @@   .%+&$.@+$;**;* *   ",
"      @  -%+.+$$**@***     ",
"     @@   -.-$@-@***       ",
"    @      @+-****         ",
"       @@    **            ",
"      @@                   ",
"     @                     ",
"                           "};
