/* XPM */
static char * down_arrow_xpm[] = {
"16 16 19 1",
" 	c None",
".	c #1F1F1F",
"+	c #2D3A5D",
"@	c #324372",
"#	c #364D8A",
"$	c #374E8F",
"%	c #293249",
"&	c #2A344D",
"*	c #34467C",
"=	c #272E40",
"-	c #2D395B",
";	c #282F43",
">	c #374E8D",
",	c #252A36",
"'	c #2B3654",
")	c #364B88",
"!	c #35477E",
"~	c #252B38",
"{	c #262C3B",
"                ",
"                ",
"                ",
"     ......     ",
"     .+@#$.     ",
"     .%&*$.     ",
"     .=-*$.     ",
"  ....;&*>....  ",
"   .,'&-*)$!.   ",
"    .~-&**-.    ",
"     .~-*-.     ",
"      .{-.      ",
"       ..       ",
"                ",
"                ",
"                "};
