/* XPM */
static char *address[]={
"16 16 5 1",
". c None",
"# c #002149",
"c c #00306a",
"b c #a8dcff",
"a c #ffffff",
"................",
"................",
"................",
".#############..",
".#aaaa#bbbbbb#..",
".#accc#bb#bbb#..",
".#abbb#bbbbbb#..",
".#accc###bbbb#..",
".#abbba#bb#bb#..",
".#accca###bbb#..",
".#abbba#bbbbb#..",
".#############..",
"................",
"................",
"................",
"................"};
