/* XPM */
static char * trash_close_hrm_xpm[] = {
"16 12 45 1",
" 	c None",
".	c #303030",
"+	c #F9F0E2",
"@	c #F6EBDA",
"#	c #F3E5D2",
"$	c #F0E0CB",
"%	c #ECDBC3",
"&	c #E9D5BB",
"*	c #E6D0B3",
"=	c #000000",
"-	c #F7ECDD",
";	c #F6EAD9",
">	c #F4E6D4",
",	c #F2E3D0",
"'	c #F0E0CC",
")	c #EFDEC7",
"!	c #EDDAC3",
"~	c #F5E9D9",
"{	c #7C7B7B",
"]	c #EEDDC8",
"^	c #EAD7BE",
"/	c #F3E6D4",
"(	c #E9D4BB",
"_	c #EFDDC7",
":	c #EAD7BF",
"<	c #E7D2B6",
"[	c #F0E1CC",
"}	c #ECDAC3",
"|	c #E9D4BA",
"1	c #E5CFB2",
"2	c #EBD7BF",
"3	c #E7D1B6",
"4	c #E3CBAD",
"5	c #F1B2B0",
"6	c #ED9C9B",
"7	c #EB8686",
"8	c #E87170",
"9	c #E45C5A",
"0	c #E14645",
"a	c #DE302F",
"b	c #EE9C9B",
"c	c #EA8686",
"d	c #E77170",
"e	c #E45B5A",
"f	c #E24644",
"     .......    ",
"    .+@#$%&*.   ",
"    =========   ",
"    =-;>,')!=   ",
"    =~{,']{^=   ",
"    =/{${!{(=   ",
"    =,{_{:{<=   ",
"    =[{}{|{1=   ",
"    =]{2{3{4=   ",
"    =567890a=   ",
"    =5bcdefa=   ",
"     =======    "};
