/* XPM */
static char * up_arrow_xpm[] = {
"26 24 10 1",
" 	c None",
".	c #34FE9C",
"+	c #848284",
"@	c #048284",
"#	c #CCCEFC",
"$	c #048204",
"%	c #04FE04",
"&	c #04363C",
"*	c #242224",
"=	c #449AA4",
"                          ",
"                          ",
"             .+           ",
"            ..@           ",
"           ..#$+          ",
"          ..#%$&          ",
"         ..#.#$&+         ",
"        ..#.#%$*@         ",
"       ..#.#.#$**+        ",
"      ..#.#.#%#%#&        ",
"     ..#.#.#%#%#%@&       ",
"    ..#.#.#%#%#%#**       ",
"    %.....%.%.%.%**       ",
"     $===========*&       ",
"      $=$=$=$$$$$*&       ",
"       $=$=$$$$$$&@       ",
"        $=$=$$$$$&+       ",
"         $=$$$****        ",
"       +++$=$$&&&@++++    ",
"        +++&=$&&+++++++   ",
"          ++&=&&++++++    ",
"           ++&&++++       ",
"                          ",
"                          "};
