/* XPM */
static char * watchthread_xpm[] = {
"16 16 7 1",
" 	c None",
".	c #333366",
"+	c #FF6633",
"@	c #FFFF00",
"#	c #FF0000",
"$	c #808080",
"%	c #808000",
"                ",
"                ",
"                ",
"    .+@@+       ",
"    .+@@+       ",
"    .+@@+#@     ",
"    .+@@+#@+    ",
"    .++++#@+    ",
"    .$ %%#@+    ",
"    .    #++    ",
"    .           ",
"    .           ",
"    .           ",
"                ",
"                ",
"                "};
