/* XPM */
static char * exec_xpm[] = {
"16 16 15 1",
" 	c None",
".	c #1F1F1F",
"+	c #364985",
"@	c #31426E",
"#	c #2B3654",
"$	c #324372",
"%	c #2D395B",
"&	c #293249",
"*	c #324270",
"=	c #2E3B60",
"-	c #2B3651",
";	c #262D3E",
">	c #334578",
",	c #2C3757",
"'	c #282F43",
"                ",
"                ",
"     ......     ",
"     .+@@#.     ",
"     .$%%&.     ",
"     .$%%&.     ",
"     .$%%&.     ",
"     .*%%&.     ",
"     .=--;.     ",
"      ....      ",
"                ",
"       ..       ",
"      .>,.      ",
"      .,'.      ",
"      ....      ",
"                "};
