%!PS-Adobe-2.0
%%Title: reccycla.ps
%%Creator: fig2dev Version 3.2 Patchlevel 0-beta3
%%CreationDate: Mon Mar  2 20:51:08 1998
%%For: koren@yedi.vm.stuba.sk (Ludo &)
%%Orientation: Landscape
%%BoundingBox: 23 -99 571 941
%%Pages: 1
%%BeginSetup
%%IncludeFeature: *PageSize A4
%%EndSetup
%%Magnification: 0.8247
%%EndComments
/$F2psDict 200 dict def
$F2psDict begin
$F2psDict /mtrx matrix put
/col-1 {0 setgray} bind def
/col0 {0.000 0.000 0.000 srgb} bind def
/col1 {0.000 0.000 1.000 srgb} bind def
/col2 {0.000 1.000 0.000 srgb} bind def
/col3 {0.000 1.000 1.000 srgb} bind def
/col4 {1.000 0.000 0.000 srgb} bind def
/col5 {1.000 0.000 1.000 srgb} bind def
/col6 {1.000 1.000 0.000 srgb} bind def
/col7 {1.000 1.000 1.000 srgb} bind def
/col8 {0.000 0.000 0.560 srgb} bind def
/col9 {0.000 0.000 0.690 srgb} bind def
/col10 {0.000 0.000 0.820 srgb} bind def
/col11 {0.530 0.810 1.000 srgb} bind def
/col12 {0.000 0.560 0.000 srgb} bind def
/col13 {0.000 0.690 0.000 srgb} bind def
/col14 {0.000 0.820 0.000 srgb} bind def
/col15 {0.000 0.560 0.560 srgb} bind def
/col16 {0.000 0.690 0.690 srgb} bind def
/col17 {0.000 0.820 0.820 srgb} bind def
/col18 {0.560 0.000 0.000 srgb} bind def
/col19 {0.690 0.000 0.000 srgb} bind def
/col20 {0.820 0.000 0.000 srgb} bind def
/col21 {0.560 0.000 0.560 srgb} bind def
/col22 {0.690 0.000 0.690 srgb} bind def
/col23 {0.820 0.000 0.820 srgb} bind def
/col24 {0.500 0.190 0.000 srgb} bind def
/col25 {0.630 0.250 0.000 srgb} bind def
/col26 {0.750 0.380 0.000 srgb} bind def
/col27 {1.000 0.500 0.500 srgb} bind def
/col28 {1.000 0.630 0.630 srgb} bind def
/col29 {1.000 0.750 0.750 srgb} bind def
/col30 {1.000 0.880 0.880 srgb} bind def
/col31 {1.000 0.840 0.000 srgb} bind def

end
save
9.5 -110.0 translate
 90 rotate
1 -1 scale

/cp {closepath} bind def
/ef {eofill} bind def
/gr {grestore} bind def
/gs {gsave} bind def
/sa {save} bind def
/rs {restore} bind def
/l {lineto} bind def
/m {moveto} bind def
/rm {rmoveto} bind def
/n {newpath} bind def
/s {stroke} bind def
/sh {show} bind def
/slc {setlinecap} bind def
/slj {setlinejoin} bind def
/slw {setlinewidth} bind def
/srgb {setrgbcolor} bind def
/rot {rotate} bind def
/sc {scale} bind def
/sd {setdash} bind def
/ff {findfont} bind def
/sf {setfont} bind def
/scf {scalefont} bind def
/sw {stringwidth} bind def
/tr {translate} bind def
/tnt {dup dup currentrgbcolor
  4 -2 roll dup 1 exch sub 3 -1 roll mul add
  4 -2 roll dup 1 exch sub 3 -1 roll mul add
  4 -2 roll dup 1 exch sub 3 -1 roll mul add srgb}
  bind def
/shd {dup dup currentrgbcolor 4 -2 roll mul 4 -2 roll mul
  4 -2 roll mul srgb} bind def
/reencdict 12 dict def /ReEncode { reencdict begin
/newcodesandnames exch def /newfontname exch def /basefontname exch def
/basefontdict basefontname findfont def /newfont basefontdict maxlength dict def
basefontdict { exch dup /FID ne { dup /Encoding eq
{ exch dup length array copy newfont 3 1 roll put }
{ exch newfont 3 1 roll put } ifelse } { pop pop } ifelse } forall
newfont /FontName newfontname put newcodesandnames aload pop
128 1 255 { newfont /Encoding get exch /.notdef put } for
newcodesandnames length 2 idiv { newfont /Encoding get 3 1 roll put } repeat
newfontname newfont definefont pop end } def
/isovec [
8#200 /grave 8#201 /acute 8#202 /circumflex 8#203 /tilde
8#204 /macron 8#205 /breve 8#206 /dotaccent 8#207 /dieresis
8#210 /ring 8#211 /cedilla 8#212 /hungarumlaut 8#213 /ogonek 8#214 /caron
8#220 /dotlessi 8#230 /oe 8#231 /OE
8#240 /space 8#241 /exclamdown 8#242 /cent 8#243 /sterling
8#244 /currency 8#245 /yen 8#246 /brokenbar 8#247 /section 8#250 /dieresis
8#251 /copyright 8#252 /ordfeminine 8#253 /guillemotleft 8#254 /logicalnot
8#255 /endash 8#256 /registered 8#257 /macron 8#260 /degree 8#261 /plusminus
8#262 /twosuperior 8#263 /threesuperior 8#264 /acute 8#265 /mu 8#266 /paragraph
8#267 /periodcentered 8#270 /cedilla 8#271 /onesuperior 8#272 /ordmasculine
8#273 /guillemotright 8#274 /onequarter 8#275 /onehalf
8#276 /threequarters 8#277 /questiondown 8#300 /Agrave 8#301 /Aacute
8#302 /Acircumflex 8#303 /Atilde 8#304 /Adieresis 8#305 /Aring
8#306 /AE 8#307 /Ccedilla 8#310 /Egrave 8#311 /Eacute
8#312 /Ecircumflex 8#313 /Edieresis 8#314 /Igrave 8#315 /Iacute
8#316 /Icircumflex 8#317 /Idieresis 8#320 /Eth 8#321 /Ntilde 8#322 /Ograve
8#323 /Oacute 8#324 /Ocircumflex 8#325 /Otilde 8#326 /Odieresis 8#327 /multiply
8#330 /Oslash 8#331 /Ugrave 8#332 /Uacute 8#333 /Ucircumflex
8#334 /Udieresis 8#335 /Yacute 8#336 /Thorn 8#337 /germandbls 8#340 /agrave
8#341 /aacute 8#342 /acircumflex 8#343 /atilde 8#344 /adieresis 8#345 /aring
8#346 /ae 8#347 /ccedilla 8#350 /egrave 8#351 /eacute
8#352 /ecircumflex 8#353 /edieresis 8#354 /igrave 8#355 /iacute
8#356 /icircumflex 8#357 /idieresis 8#360 /eth 8#361 /ntilde 8#362 /ograve
8#363 /oacute 8#364 /ocircumflex 8#365 /otilde 8#366 /odieresis 8#367 /divide
8#370 /oslash 8#371 /ugrave 8#372 /uacute 8#373 /ucircumflex
8#374 /udieresis 8#375 /yacute 8#376 /thorn 8#377 /ydieresis] def
/Courier /Courier-iso isovec ReEncode
/Courier-Bold /Courier-Bold-iso isovec ReEncode
/$F2psBegin {$F2psDict begin /$F2psEnteredState save def} def
/$F2psEnd {$F2psEnteredState restore end} def
%%EndProlog

$F2psBegin
10 setmiterlimit
n -1000 11801 m -1000 -1000 l 21217 -1000 l 21217 11801 l cp clip
 0.05195 0.05195 sc
%%Page: 1 1
% Polyline
7.500 slw
gs  clippath
5085 5498 m 5250 5535 l 5085 5573 l 5295 5573 l 5295 5498 l cp
clip
n 5070 5535 m 5280 5535 l gs col-1 s gr gr

% arrowhead
n 5085 5498 m 5250 5535 l 5085 5573 l 5085 5535 l 5085 5498 l  cp gs 0.00 setgray ef gr  col-1 s
% Polyline
gs  clippath
7733 7290 m 7695 7455 l 7658 7290 l 7658 7500 l 7733 7500 l cp
clip
n 7695 7185 m 7695 7485 l gs col-1 s gr gr

% arrowhead
n 7733 7290 m 7695 7455 l 7658 7290 l 7695 7290 l 7733 7290 l  cp gs 0.00 setgray ef gr  col-1 s
% Polyline
gs  clippath
10125 5498 m 10290 5535 l 10125 5573 l 10335 5573 l 10335 5498 l cp
clip
n 10110 5535 m 10320 5535 l gs col-1 s gr gr

% arrowhead
n 10125 5498 m 10290 5535 l 10125 5573 l 10125 5535 l 10125 5498 l  cp gs 0.00 setgray ef gr  col-1 s
% Polyline
gs  clippath
10125 9098 m 10290 9135 l 10125 9173 l 10335 9173 l 10335 9098 l cp
clip
n 10110 9135 m 10320 9135 l gs col-1 s gr gr

% arrowhead
n 10125 9098 m 10290 9135 l 10125 9173 l 10125 9135 l 10125 9098 l  cp gs 0.00 setgray ef gr  col-1 s
% Polyline
gs  clippath
15165 9098 m 15330 9135 l 15165 9173 l 15375 9173 l 15375 9098 l cp
clip
n 15150 9135 m 15360 9135 l gs col-1 s gr gr

% arrowhead
n 15165 9098 m 15330 9135 l 15165 9173 l 15165 9135 l 15165 9098 l  cp gs 0.00 setgray ef gr  col-1 s
% Polyline
gs  clippath
2693 3690 m 2655 3855 l 2618 3690 l 2618 3900 l 2693 3900 l cp
clip
n 2655 3585 m 2655 3885 l gs col-1 s gr gr

% arrowhead
n 2693 3690 m 2655 3855 l 2618 3690 l 2655 3690 l 2693 3690 l  cp gs 0.00 setgray ef gr  col-1 s
% Polyline
0.000 slw
n 10320 7485 m 15165 7485 l 15165 10800 l 10320 10800 l cp gs col7 1.00 shd ef gr 
% Polyline
n 240 285 m 5085 285 l 5085 3600 l 240 3600 l cp gs col7 1.00 shd ef gr 
% Polyline
n 15360 7485 m 20205 7485 l 20205 10800 l 15360 10800 l cp gs col7 1.00 shd ef gr 
% Polyline
n 240 3885 m 5085 3885 l 5085 7200 l 240 7200 l cp gs col7 1.00 shd ef gr 
% Polyline
n 5280 3885 m 10125 3885 l 10125 7200 l 5280 7200 l cp gs col7 1.00 shd ef gr 
% Polyline
n 5280 7485 m 10125 7485 l 10125 10800 l 5280 10800 l cp gs col7 1.00 shd ef gr 
% Polyline
n 10320 3885 m 15165 3885 l 15165 7200 l 10320 7200 l cp gs col7 1.00 shd ef gr 
% Polyline
7.500 slw
n 2100 3015 m 4935 3015 l gs col-1 s gr 
% Polyline
n 4965 1410 m 4965 3285 l gs col-1 s gr 
% Polyline
n 1875 3285 m 4980 3285 l gs col-1 s gr 
% Polyline
n 5010 585 m 5010 3525 l gs col-1 s gr 
% Polyline
n 285 3525 m 5025 3525 l gs col-1 s gr 
% Polyline
n 5055 300 m 5055 3570 l gs col-1 s gr 
% Polyline
n 240 3570 m 5070 3570 l gs col-1 s gr 
% Polyline
n 5070 300 m 5070 3585 l gs col-1 s gr 
% Polyline
n 255 3585 m 5085 3585 l gs col-1 s gr 
/Courier-iso ff 150.00 scf sf
285 495 m
gs 1 -1 sc (1) col-1 sh gr
/Courier-iso ff 150.00 scf sf
390 495 m
gs 1 -1 sc (: ) col-1 sh gr
/Courier-Bold-iso ff 150.00 scf sf
600 495 m
gs 1 -1 sc (*type) col-1 sh gr
/Courier-iso ff 150.00 scf sf
510 780 m
gs 1 -1 sc (input) col-1 sh gr
/Courier-iso ff 150.00 scf sf
1560 780 m
gs 1 -1 sc ( = ) col-1 sh gr
/Courier-iso ff 150.00 scf sf
1875 780 m
gs 1 -1 sc (0x0) col-1 sh gr
/Courier-iso ff 150.00 scf sf
510 975 m
gs 1 -1 sc (arity) col-1 sh gr
/Courier-iso ff 150.00 scf sf
1560 975 m
gs 1 -1 sc ( = ) col-1 sh gr
/Courier-iso ff 150.00 scf sf
1875 975 m
gs 1 -1 sc (0x0) col-1 sh gr
/Courier-iso ff 150.00 scf sf
510 1170 m
gs 1 -1 sc (field_name) col-1 sh gr
/Courier-iso ff 150.00 scf sf
1560 1170 m
gs 1 -1 sc ( = ) col-1 sh gr
/Courier-iso ff 150.00 scf sf
1875 1170 m
gs 1 -1 sc (0x0) col-1 sh gr
/Courier-iso ff 150.00 scf sf
510 1365 m
gs 1 -1 sc (offset) col-1 sh gr
/Courier-iso ff 150.00 scf sf
1560 1365 m
gs 1 -1 sc ( = ) col-1 sh gr
/Courier-iso ff 150.00 scf sf
1875 1365 m
gs 1 -1 sc (0) col-1 sh gr
/Courier-iso ff 150.00 scf sf
510 2415 m
gs 1 -1 sc (attribute) col-1 sh gr
/Courier-iso ff 150.00 scf sf
1560 2415 m
gs 1 -1 sc ( = ) col-1 sh gr
/Courier-iso ff 150.00 scf sf
2100 1605 m
gs 1 -1 sc (function_class = POINTER) col-1 sh gr
/Courier-iso ff 150.00 scf sf
2100 1875 m
gs 1 -1 sc (export_type = 0) col-1 sh gr
/Courier-iso ff 150.00 scf sf
2100 2145 m
gs 1 -1 sc (type_qualifier = 0) col-1 sh gr
/Courier-iso ff 150.00 scf sf
2100 2415 m
gs 1 -1 sc (storage_class_specifier = 0) col-1 sh gr
/Courier-iso ff 150.00 scf sf
2100 2685 m
gs 1 -1 sc (arit_class = 0x0) col-1 sh gr
/Courier-iso ff 150.00 scf sf
2100 2955 m
gs 1 -1 sc (memory_size = 0) col-1 sh gr
/Courier-iso ff 150.00 scf sf
2100 3225 m
gs 1 -1 sc (domain = 0x0) col-1 sh gr
/Courier-iso ff 150.00 scf sf
510 3465 m
gs 1 -1 sc (output) col-1 sh gr
/Courier-iso ff 150.00 scf sf
1575 3465 m
gs 1 -1 sc ( = ) col-1 sh gr
/Courier-Bold-iso ff 150.00 scf sf
1890 3465 m
gs 1 -1 sc (0x1f6718) col-1 sh gr
% Polyline
n 240 3885 m 5070 3885 l gs col-1 s gr 
% Polyline
n 240 3900 m 240 7170 l gs col-1 s gr 
% Polyline
n 285 4125 m 5025 4125 l gs col-1 s gr 
% Polyline
n 285 4170 m 5025 4170 l gs col-1 s gr 
% Polyline
n 285 4185 m 285 7125 l gs col-1 s gr 
% Polyline
n 1875 4995 m 4980 4995 l gs col-1 s gr 
% Polyline
n 1875 5010 m 1875 6885 l gs col-1 s gr 
% Polyline
n 2100 5265 m 4935 5265 l gs col-1 s gr 
% Polyline
n 2100 5535 m 4935 5535 l gs col-1 s gr 
% Polyline
n 2100 5805 m 4935 5805 l gs col-1 s gr 
% Polyline
n 2100 6075 m 4935 6075 l gs col-1 s gr 
% Polyline
n 2100 6345 m 4935 6345 l gs col-1 s gr 
% Polyline
n 2100 6615 m 4935 6615 l gs col-1 s gr 
% Polyline
n 4965 5010 m 4965 6885 l gs col-1 s gr 
% Polyline
n 1875 6885 m 4980 6885 l gs col-1 s gr 
% Polyline
n 5010 4185 m 5010 7125 l gs col-1 s gr 
% Polyline
n 285 7125 m 5025 7125 l gs col-1 s gr 
% Polyline
n 5055 3900 m 5055 7170 l gs col-1 s gr 
% Polyline
n 240 7170 m 5070 7170 l gs col-1 s gr 
% Polyline
n 5070 3900 m 5070 7185 l gs col-1 s gr 
% Polyline
n 255 7185 m 5085 7185 l gs col-1 s gr 
/Courier-iso ff 150.00 scf sf
285 4095 m
gs 1 -1 sc (2) col-1 sh gr
/Courier-iso ff 150.00 scf sf
390 4095 m
gs 1 -1 sc (: ) col-1 sh gr
/Courier-Bold-iso ff 150.00 scf sf
600 4095 m
gs 1 -1 sc (*type->output) col-1 sh gr
/Courier-iso ff 150.00 scf sf
510 4380 m
gs 1 -1 sc (input) col-1 sh gr
/Courier-iso ff 150.00 scf sf
1575 4380 m
gs 1 -1 sc ( = ) col-1 sh gr
/Courier-Bold-iso ff 150.00 scf sf
1890 4380 m
gs 1 -1 sc (0x1f67b8) col-1 sh gr
/Courier-iso ff 150.00 scf sf
510 4575 m
gs 1 -1 sc (arity) col-1 sh gr
/Courier-iso ff 150.00 scf sf
1560 4575 m
gs 1 -1 sc ( = ) col-1 sh gr
/Courier-iso ff 150.00 scf sf
1875 4575 m
gs 1 -1 sc (0x0) col-1 sh gr
/Courier-iso ff 150.00 scf sf
510 4770 m
gs 1 -1 sc (field_name) col-1 sh gr
/Courier-iso ff 150.00 scf sf
1560 4770 m
gs 1 -1 sc ( = ) col-1 sh gr
/Courier-iso ff 150.00 scf sf
1875 4770 m
gs 1 -1 sc (0x0) col-1 sh gr
/Courier-iso ff 150.00 scf sf
510 4965 m
gs 1 -1 sc (offset) col-1 sh gr
/Courier-iso ff 150.00 scf sf
1560 4965 m
gs 1 -1 sc ( = ) col-1 sh gr
/Courier-iso ff 150.00 scf sf
1875 4965 m
gs 1 -1 sc (0) col-1 sh gr
/Courier-iso ff 150.00 scf sf
510 6015 m
gs 1 -1 sc (attribute) col-1 sh gr
/Courier-iso ff 150.00 scf sf
1560 6015 m
gs 1 -1 sc ( = ) col-1 sh gr
/Courier-iso ff 150.00 scf sf
2100 5205 m
gs 1 -1 sc (function_class = STRUCT_FC) col-1 sh gr
/Courier-iso ff 150.00 scf sf
2100 5475 m
gs 1 -1 sc (export_type = 0) col-1 sh gr
/Courier-iso ff 150.00 scf sf
2100 5745 m
gs 1 -1 sc (type_qualifier = UNDEF_TQ) col-1 sh gr
/Courier-iso ff 150.00 scf sf
2100 6015 m
gs 1 -1 sc (storage_class_specifier = 0) col-1 sh gr
/Courier-iso ff 150.00 scf sf
2100 6285 m
gs 1 -1 sc (arit_class = 0x29dac) col-1 sh gr
/Courier-iso ff 150.00 scf sf
2100 6555 m
gs 1 -1 sc (memory_size = 8) col-1 sh gr
/Courier-iso ff 150.00 scf sf
2100 6825 m
gs 1 -1 sc (domain = 0x0) col-1 sh gr
/Courier-iso ff 150.00 scf sf
510 7065 m
gs 1 -1 sc (output) col-1 sh gr
/Courier-iso ff 150.00 scf sf
1560 7065 m
gs 1 -1 sc ( = ) col-1 sh gr
/Courier-iso ff 150.00 scf sf
1875 7065 m
gs 1 -1 sc (0x0) col-1 sh gr
% Polyline
n 5280 3885 m 10110 3885 l gs col-1 s gr 
% Polyline
n 5280 3900 m 5280 7170 l gs col-1 s gr 
% Polyline
n 5325 4125 m 10065 4125 l gs col-1 s gr 
% Polyline
n 5325 4170 m 10065 4170 l gs col-1 s gr 
% Polyline
n 5325 4185 m 5325 7125 l gs col-1 s gr 
% Polyline
n 6915 4995 m 10020 4995 l gs col-1 s gr 
% Polyline
n 6915 5010 m 6915 6885 l gs col-1 s gr 
% Polyline
n 7140 5265 m 9975 5265 l gs col-1 s gr 
% Polyline
n 7140 5535 m 9975 5535 l gs col-1 s gr 
% Polyline
n 7140 5805 m 9975 5805 l gs col-1 s gr 
% Polyline
n 7140 6075 m 9975 6075 l gs col-1 s gr 
% Polyline
n 7140 6345 m 9975 6345 l gs col-1 s gr 
% Polyline
n 7140 6615 m 9975 6615 l gs col-1 s gr 
% Polyline
n 10005 5010 m 10005 6885 l gs col-1 s gr 
% Polyline
n 6915 6885 m 10020 6885 l gs col-1 s gr 
% Polyline
n 10050 4185 m 10050 7125 l gs col-1 s gr 
% Polyline
n 5325 7125 m 10065 7125 l gs col-1 s gr 
% Polyline
n 10095 3900 m 10095 7170 l gs col-1 s gr 
% Polyline
n 5280 7170 m 10110 7170 l gs col-1 s gr 
% Polyline
n 10110 3900 m 10110 7185 l gs col-1 s gr 
% Polyline
n 5295 7185 m 10125 7185 l gs col-1 s gr 
/Courier-iso ff 150.00 scf sf
5325 4095 m
gs 1 -1 sc (3) col-1 sh gr
/Courier-iso ff 150.00 scf sf
5430 4095 m
gs 1 -1 sc (: ) col-1 sh gr
/Courier-Bold-iso ff 150.00 scf sf
5640 4095 m
gs 1 -1 sc (*type->output->input) col-1 sh gr
/Courier-iso ff 150.00 scf sf
5550 4380 m
gs 1 -1 sc (input) col-1 sh gr
/Courier-iso ff 150.00 scf sf
6600 4380 m
gs 1 -1 sc ( = ) col-1 sh gr
/Courier-iso ff 150.00 scf sf
6915 4380 m
gs 1 -1 sc (0x0) col-1 sh gr
/Courier-iso ff 150.00 scf sf
5550 4575 m
gs 1 -1 sc (arity) col-1 sh gr
/Courier-iso ff 150.00 scf sf
6615 4575 m
gs 1 -1 sc ( = ) col-1 sh gr
/Courier-Bold-iso ff 150.00 scf sf
6930 4575 m
gs 1 -1 sc (0x1f68e0) col-1 sh gr
/Courier-iso ff 150.00 scf sf
5550 4770 m
gs 1 -1 sc (field_name) col-1 sh gr
/Courier-iso ff 150.00 scf sf
6600 4770 m
gs 1 -1 sc ( = ) col-1 sh gr
/Courier-iso ff 150.00 scf sf
6915 4770 m
gs 1 -1 sc (0x4a0fd "a") col-1 sh gr
/Courier-iso ff 150.00 scf sf
5550 4965 m
gs 1 -1 sc (offset) col-1 sh gr
/Courier-iso ff 150.00 scf sf
6600 4965 m
gs 1 -1 sc ( = ) col-1 sh gr
/Courier-iso ff 150.00 scf sf
6915 4965 m
gs 1 -1 sc (0) col-1 sh gr
/Courier-iso ff 150.00 scf sf
5550 6015 m
gs 1 -1 sc (attribute) col-1 sh gr
/Courier-iso ff 150.00 scf sf
6600 6015 m
gs 1 -1 sc ( = ) col-1 sh gr
/Courier-iso ff 150.00 scf sf
7140 5205 m
gs 1 -1 sc (function_class = POINTER) col-1 sh gr
/Courier-iso ff 150.00 scf sf
7140 5475 m
gs 1 -1 sc (export_type = 0) col-1 sh gr
/Courier-iso ff 150.00 scf sf
7140 5745 m
gs 1 -1 sc (type_qualifier = 0) col-1 sh gr
/Courier-iso ff 150.00 scf sf
7140 6015 m
gs 1 -1 sc (storage_class_specifier = 0) col-1 sh gr
/Courier-iso ff 150.00 scf sf
7140 6285 m
gs 1 -1 sc (arit_class = 0x0) col-1 sh gr
/Courier-iso ff 150.00 scf sf
7140 6555 m
gs 1 -1 sc (memory_size = 4) col-1 sh gr
/Courier-iso ff 150.00 scf sf
7140 6825 m
gs 1 -1 sc (domain = 0x0) col-1 sh gr
/Courier-iso ff 150.00 scf sf
5550 7065 m
gs 1 -1 sc (output) col-1 sh gr
/Courier-iso ff 150.00 scf sf
6615 7065 m
gs 1 -1 sc ( = ) col-1 sh gr
/Courier-Bold-iso ff 150.00 scf sf
6930 7065 m
gs 1 -1 sc (0x1f67e8) col-1 sh gr
% Polyline
n 5280 7485 m 10110 7485 l gs col-1 s gr 
% Polyline
n 5280 7500 m 5280 10770 l gs col-1 s gr 
% Polyline
n 5325 7725 m 10065 7725 l gs col-1 s gr 
% Polyline
n 5325 7770 m 10065 7770 l gs col-1 s gr 
% Polyline
n 5325 7785 m 5325 10725 l gs col-1 s gr 
% Polyline
n 6915 8595 m 10020 8595 l gs col-1 s gr 
% Polyline
n 6915 8610 m 6915 10485 l gs col-1 s gr 
% Polyline
n 7140 8865 m 9975 8865 l gs col-1 s gr 
% Polyline
n 7140 9135 m 9975 9135 l gs col-1 s gr 
% Polyline
n 7140 9405 m 9975 9405 l gs col-1 s gr 
% Polyline
n 7140 9675 m 9975 9675 l gs col-1 s gr 
% Polyline
n 7140 9945 m 9975 9945 l gs col-1 s gr 
% Polyline
n 7140 10215 m 9975 10215 l gs col-1 s gr 
% Polyline
n 10005 8610 m 10005 10485 l gs col-1 s gr 
% Polyline
n 6915 10485 m 10020 10485 l gs col-1 s gr 
% Polyline
n 10050 7785 m 10050 10725 l gs col-1 s gr 
% Polyline
n 5325 10725 m 10065 10725 l gs col-1 s gr 
% Polyline
n 10095 7500 m 10095 10770 l gs col-1 s gr 
% Polyline
n 5280 10770 m 10110 10770 l gs col-1 s gr 
% Polyline
n 10110 7500 m 10110 10785 l gs col-1 s gr 
% Polyline
n 5295 10785 m 10125 10785 l gs col-1 s gr 
/Courier-iso ff 150.00 scf sf
5325 7695 m
gs 1 -1 sc (4) col-1 sh gr
/Courier-iso ff 150.00 scf sf
5430 7695 m
gs 1 -1 sc (: ) col-1 sh gr
/Courier-Bold-iso ff 150.00 scf sf
5640 7695 m
gs 1 -1 sc (*type->ou...->output) col-1 sh gr
/Courier-iso ff 150.00 scf sf
5550 7980 m
gs 1 -1 sc (input) col-1 sh gr
/Courier-iso ff 150.00 scf sf
6615 7980 m
gs 1 -1 sc ( = ) col-1 sh gr
/Courier-Bold-iso ff 150.00 scf sf
6930 7980 m
gs 1 -1 sc (0x1f6818) col-1 sh gr
/Courier-iso ff 150.00 scf sf
5550 8175 m
gs 1 -1 sc (arity) col-1 sh gr
/Courier-iso ff 150.00 scf sf
6600 8175 m
gs 1 -1 sc ( = ) col-1 sh gr
/Courier-iso ff 150.00 scf sf
6915 8175 m
gs 1 -1 sc (0x0) col-1 sh gr
/Courier-iso ff 150.00 scf sf
5550 8370 m
gs 1 -1 sc (field_name) col-1 sh gr
/Courier-iso ff 150.00 scf sf
6600 8370 m
gs 1 -1 sc ( = ) col-1 sh gr
/Courier-iso ff 150.00 scf sf
6915 8370 m
gs 1 -1 sc (0x0) col-1 sh gr
/Courier-iso ff 150.00 scf sf
5550 8565 m
gs 1 -1 sc (offset) col-1 sh gr
/Courier-iso ff 150.00 scf sf
6600 8565 m
gs 1 -1 sc ( = ) col-1 sh gr
/Courier-iso ff 150.00 scf sf
6915 8565 m
gs 1 -1 sc (0) col-1 sh gr
/Courier-iso ff 150.00 scf sf
5550 9615 m
gs 1 -1 sc (attribute) col-1 sh gr
/Courier-iso ff 150.00 scf sf
6600 9615 m
gs 1 -1 sc ( = ) col-1 sh gr
/Courier-iso ff 150.00 scf sf
7140 8805 m
gs 1 -1 sc (function_class = STRUCT_FC) col-1 sh gr
/Courier-iso ff 150.00 scf sf
7140 9075 m
gs 1 -1 sc (export_type = 0) col-1 sh gr
/Courier-iso ff 150.00 scf sf
7140 9345 m
gs 1 -1 sc (type_qualifier = UNDEF_TQ) col-1 sh gr
/Courier-iso ff 150.00 scf sf
7140 9615 m
gs 1 -1 sc (storage_class_specifier = 0) col-1 sh gr
/Courier-iso ff 150.00 scf sf
7140 9885 m
gs 1 -1 sc (arit_class = 0x29dac) col-1 sh gr
/Courier-iso ff 150.00 scf sf
7140 10155 m
gs 1 -1 sc (memory_size = 8) col-1 sh gr
/Courier-iso ff 150.00 scf sf
7140 10425 m
gs 1 -1 sc (domain = 0x0) col-1 sh gr
/Courier-iso ff 150.00 scf sf
5550 10665 m
gs 1 -1 sc (output) col-1 sh gr
/Courier-iso ff 150.00 scf sf
6600 10665 m
gs 1 -1 sc ( = ) col-1 sh gr
/Courier-iso ff 150.00 scf sf
6915 10665 m
gs 1 -1 sc (0x0) col-1 sh gr
% Polyline
n 10320 7485 m 15150 7485 l gs col-1 s gr 
% Polyline
n 10320 7500 m 10320 10770 l gs col-1 s gr 
% Polyline
n 10365 7725 m 15105 7725 l gs col-1 s gr 
% Polyline
n 10365 7770 m 15105 7770 l gs col-1 s gr 
% Polyline
n 10365 7785 m 10365 10725 l gs col-1 s gr 
% Polyline
n 11955 8595 m 15060 8595 l gs col-1 s gr 
% Polyline
n 11955 8610 m 11955 10485 l gs col-1 s gr 
% Polyline
n 12180 8865 m 15015 8865 l gs col-1 s gr 
% Polyline
n 12180 9135 m 15015 9135 l gs col-1 s gr 
% Polyline
n 12180 9405 m 15015 9405 l gs col-1 s gr 
% Polyline
n 12180 9675 m 15015 9675 l gs col-1 s gr 
% Polyline
n 12180 9945 m 15015 9945 l gs col-1 s gr 
% Polyline
n 12180 10215 m 15015 10215 l gs col-1 s gr 
% Polyline
n 15045 8610 m 15045 10485 l gs col-1 s gr 
% Polyline
n 11955 10485 m 15060 10485 l gs col-1 s gr 
% Polyline
n 15090 7785 m 15090 10725 l gs col-1 s gr 
% Polyline
n 10365 10725 m 15105 10725 l gs col-1 s gr 
% Polyline
n 15135 7500 m 15135 10770 l gs col-1 s gr 
% Polyline
n 10320 10770 m 15150 10770 l gs col-1 s gr 
% Polyline
n 15150 7500 m 15150 10785 l gs col-1 s gr 
% Polyline
n 10335 10785 m 15165 10785 l gs col-1 s gr 
/Courier-iso ff 150.00 scf sf
10365 7695 m
gs 1 -1 sc (6) col-1 sh gr
/Courier-iso ff 150.00 scf sf
10470 7695 m
gs 1 -1 sc (: ) col-1 sh gr
/Courier-Bold-iso ff 150.00 scf sf
10680 7695 m
gs 1 -1 sc (*type->ou...t->input) col-1 sh gr
/Courier-iso ff 150.00 scf sf
10590 7980 m
gs 1 -1 sc (input) col-1 sh gr
/Courier-iso ff 150.00 scf sf
11640 7980 m
gs 1 -1 sc ( = ) col-1 sh gr
/Courier-iso ff 150.00 scf sf
11955 7980 m
gs 1 -1 sc (0x0) col-1 sh gr
/Courier-iso ff 150.00 scf sf
10590 8175 m
gs 1 -1 sc (arity) col-1 sh gr
/Courier-iso ff 150.00 scf sf
11655 8175 m
gs 1 -1 sc ( = ) col-1 sh gr
/Courier-Bold-iso ff 150.00 scf sf
11970 8175 m
gs 1 -1 sc (0x1f6848) col-1 sh gr
/Courier-iso ff 150.00 scf sf
10590 8370 m
gs 1 -1 sc (field_name) col-1 sh gr
/Courier-iso ff 150.00 scf sf
11640 8370 m
gs 1 -1 sc ( = ) col-1 sh gr
/Courier-iso ff 150.00 scf sf
11955 8370 m
gs 1 -1 sc (0x4a0fd "a") col-1 sh gr
/Courier-iso ff 150.00 scf sf
10590 8565 m
gs 1 -1 sc (offset) col-1 sh gr
/Courier-iso ff 150.00 scf sf
11640 8565 m
gs 1 -1 sc ( = ) col-1 sh gr
/Courier-iso ff 150.00 scf sf
11955 8565 m
gs 1 -1 sc (0) col-1 sh gr
/Courier-iso ff 150.00 scf sf
10590 9615 m
gs 1 -1 sc (attribute) col-1 sh gr
/Courier-iso ff 150.00 scf sf
11640 9615 m
gs 1 -1 sc ( = ) col-1 sh gr
/Courier-iso ff 150.00 scf sf
12180 8805 m
gs 1 -1 sc (function_class = SIMPLE) col-1 sh gr
/Courier-iso ff 150.00 scf sf
12180 9075 m
gs 1 -1 sc (export_type = 0) col-1 sh gr
/Courier-iso ff 150.00 scf sf
12180 9345 m
gs 1 -1 sc (type_qualifier = UNDEF_TQ) col-1 sh gr
/Courier-iso ff 150.00 scf sf
12180 9615 m
gs 1 -1 sc (storage_class_specifier = 0) col-1 sh gr
/Courier-iso ff 150.00 scf sf
12180 9885 m
gs 1 -1 sc (arit_class = 0x29dac) col-1 sh gr
/Courier-iso ff 150.00 scf sf
12180 10155 m
gs 1 -1 sc (memory_size = 4) col-1 sh gr
/Courier-iso ff 150.00 scf sf
12180 10425 m
gs 1 -1 sc (domain = 0x0) col-1 sh gr
/Courier-iso ff 150.00 scf sf
10590 10665 m
gs 1 -1 sc (output) col-1 sh gr
/Courier-iso ff 150.00 scf sf
11640 10665 m
gs 1 -1 sc ( = ) col-1 sh gr
/Courier-iso ff 150.00 scf sf
11955 10665 m
gs 1 -1 sc (0x0) col-1 sh gr
% Polyline
n 15360 7485 m 20190 7485 l gs col-1 s gr 
% Polyline
n 15360 7500 m 15360 10770 l gs col-1 s gr 
% Polyline
n 15405 7725 m 20145 7725 l gs col-1 s gr 
% Polyline
n 15405 7770 m 20145 7770 l gs col-1 s gr 
% Polyline
n 15405 7785 m 15405 10725 l gs col-1 s gr 
% Polyline
n 16995 8595 m 20100 8595 l gs col-1 s gr 
% Polyline
n 16995 8610 m 16995 10485 l gs col-1 s gr 
% Polyline
n 17220 8865 m 20055 8865 l gs col-1 s gr 
% Polyline
n 17220 9135 m 20055 9135 l gs col-1 s gr 
% Polyline
n 17220 9405 m 20055 9405 l gs col-1 s gr 
% Polyline
n 17220 9675 m 20055 9675 l gs col-1 s gr 
% Polyline
n 17220 9945 m 20055 9945 l gs col-1 s gr 
% Polyline
n 17220 10215 m 20055 10215 l gs col-1 s gr 
% Polyline
n 20085 8610 m 20085 10485 l gs col-1 s gr 
% Polyline
n 16995 10485 m 20100 10485 l gs col-1 s gr 
% Polyline
n 20130 7785 m 20130 10725 l gs col-1 s gr 
% Polyline
n 15405 10725 m 20145 10725 l gs col-1 s gr 
% Polyline
n 20175 7500 m 20175 10770 l gs col-1 s gr 
% Polyline
n 15360 10770 m 20190 10770 l gs col-1 s gr 
% Polyline
n 20190 7500 m 20190 10785 l gs col-1 s gr 
% Polyline
n 15375 10785 m 20205 10785 l gs col-1 s gr 
/Courier-iso ff 150.00 scf sf
15405 7695 m
gs 1 -1 sc (7) col-1 sh gr
/Courier-iso ff 150.00 scf sf
15510 7695 m
gs 1 -1 sc (: ) col-1 sh gr
/Courier-Bold-iso ff 150.00 scf sf
15720 7695 m
gs 1 -1 sc (*type->ou...t->arity) col-1 sh gr
/Courier-iso ff 150.00 scf sf
15630 7980 m
gs 1 -1 sc (input) col-1 sh gr
/Courier-iso ff 150.00 scf sf
16680 7980 m
gs 1 -1 sc ( = ) col-1 sh gr
/Courier-iso ff 150.00 scf sf
16995 7980 m
gs 1 -1 sc (0x0) col-1 sh gr
/Courier-iso ff 150.00 scf sf
15630 8175 m
gs 1 -1 sc (arity) col-1 sh gr
/Courier-iso ff 150.00 scf sf
16680 8175 m
gs 1 -1 sc ( = ) col-1 sh gr
/Courier-iso ff 150.00 scf sf
16995 8175 m
gs 1 -1 sc (0x0) col-1 sh gr
/Courier-iso ff 150.00 scf sf
15630 8370 m
gs 1 -1 sc (field_name) col-1 sh gr
/Courier-iso ff 150.00 scf sf
16680 8370 m
gs 1 -1 sc ( = ) col-1 sh gr
/Courier-iso ff 150.00 scf sf
16995 8370 m
gs 1 -1 sc (0x4a101 "b") col-1 sh gr
/Courier-iso ff 150.00 scf sf
15630 8565 m
gs 1 -1 sc (offset) col-1 sh gr
/Courier-iso ff 150.00 scf sf
16680 8565 m
gs 1 -1 sc ( = ) col-1 sh gr
/Courier-iso ff 150.00 scf sf
16995 8565 m
gs 1 -1 sc (4) col-1 sh gr
/Courier-iso ff 150.00 scf sf
15630 9615 m
gs 1 -1 sc (attribute) col-1 sh gr
/Courier-iso ff 150.00 scf sf
16680 9615 m
gs 1 -1 sc ( = ) col-1 sh gr
/Courier-iso ff 150.00 scf sf
17220 8805 m
gs 1 -1 sc (function_class = SIMPLE) col-1 sh gr
/Courier-iso ff 150.00 scf sf
17220 9075 m
gs 1 -1 sc (export_type = 0) col-1 sh gr
/Courier-iso ff 150.00 scf sf
17220 9345 m
gs 1 -1 sc (type_qualifier = UNDEF_TQ) col-1 sh gr
/Courier-iso ff 150.00 scf sf
17220 9615 m
gs 1 -1 sc (storage_class_specifier = 0) col-1 sh gr
/Courier-iso ff 150.00 scf sf
17220 9885 m
gs 1 -1 sc (arit_class = 0x29dac) col-1 sh gr
/Courier-iso ff 150.00 scf sf
17220 10155 m
gs 1 -1 sc (memory_size = 4) col-1 sh gr
/Courier-iso ff 150.00 scf sf
17220 10425 m
gs 1 -1 sc (domain = 0x0) col-1 sh gr
/Courier-iso ff 150.00 scf sf
15630 10665 m
gs 1 -1 sc (output) col-1 sh gr
/Courier-iso ff 150.00 scf sf
16680 10665 m
gs 1 -1 sc ( = ) col-1 sh gr
/Courier-iso ff 150.00 scf sf
16995 10665 m
gs 1 -1 sc (0x0) col-1 sh gr
% Polyline
n 10320 3885 m 15150 3885 l gs col-1 s gr 
% Polyline
n 10320 3900 m 10320 7170 l gs col-1 s gr 
% Polyline
n 10365 4125 m 15105 4125 l gs col-1 s gr 
% Polyline
n 10365 4170 m 15105 4170 l gs col-1 s gr 
% Polyline
n 10365 4185 m 10365 7125 l gs col-1 s gr 
% Polyline
n 11955 4995 m 15060 4995 l gs col-1 s gr 
% Polyline
n 11955 5010 m 11955 6885 l gs col-1 s gr 
% Polyline
n 12180 5265 m 15015 5265 l gs col-1 s gr 
% Polyline
n 12180 5535 m 15015 5535 l gs col-1 s gr 
% Polyline
n 12180 5805 m 15015 5805 l gs col-1 s gr 
% Polyline
n 12180 6075 m 15015 6075 l gs col-1 s gr 
% Polyline
n 12180 6345 m 15015 6345 l gs col-1 s gr 
% Polyline
n 12180 6615 m 15015 6615 l gs col-1 s gr 
% Polyline
n 15045 5010 m 15045 6885 l gs col-1 s gr 
% Polyline
n 11955 6885 m 15060 6885 l gs col-1 s gr 
% Polyline
n 15090 4185 m 15090 7125 l gs col-1 s gr 
% Polyline
n 10365 7125 m 15105 7125 l gs col-1 s gr 
% Polyline
n 15135 3900 m 15135 7170 l gs col-1 s gr 
% Polyline
n 10320 7170 m 15150 7170 l gs col-1 s gr 
% Polyline
n 15150 3900 m 15150 7185 l gs col-1 s gr 
% Polyline
n 10335 7185 m 15165 7185 l gs col-1 s gr 
/Courier-iso ff 150.00 scf sf
10365 4095 m
gs 1 -1 sc (5) col-1 sh gr
/Courier-iso ff 150.00 scf sf
10470 4095 m
gs 1 -1 sc (: ) col-1 sh gr
/Courier-Bold-iso ff 150.00 scf sf
10680 4095 m
gs 1 -1 sc (*type->ou...t->arity) col-1 sh gr
/Courier-iso ff 150.00 scf sf
10590 4380 m
gs 1 -1 sc (input) col-1 sh gr
/Courier-iso ff 150.00 scf sf
11640 4380 m
gs 1 -1 sc ( = ) col-1 sh gr
/Courier-iso ff 150.00 scf sf
11955 4380 m
gs 1 -1 sc (0x0) col-1 sh gr
/Courier-iso ff 150.00 scf sf
10590 4575 m
gs 1 -1 sc (arity) col-1 sh gr
/Courier-iso ff 150.00 scf sf
11640 4575 m
gs 1 -1 sc ( = ) col-1 sh gr
/Courier-iso ff 150.00 scf sf
11955 4575 m
gs 1 -1 sc (0x0) col-1 sh gr
/Courier-iso ff 150.00 scf sf
10590 4770 m
gs 1 -1 sc (field_name) col-1 sh gr
/Courier-iso ff 150.00 scf sf
11640 4770 m
gs 1 -1 sc ( = ) col-1 sh gr
/Courier-iso ff 150.00 scf sf
11955 4770 m
gs 1 -1 sc (0x4a101 "b") col-1 sh gr
/Courier-iso ff 150.00 scf sf
10590 4965 m
gs 1 -1 sc (offset) col-1 sh gr
/Courier-iso ff 150.00 scf sf
11640 4965 m
gs 1 -1 sc ( = ) col-1 sh gr
/Courier-iso ff 150.00 scf sf
11955 4965 m
gs 1 -1 sc (4) col-1 sh gr
/Courier-iso ff 150.00 scf sf
10590 6015 m
gs 1 -1 sc (attribute) col-1 sh gr
/Courier-iso ff 150.00 scf sf
11640 6015 m
gs 1 -1 sc ( = ) col-1 sh gr
/Courier-iso ff 150.00 scf sf
12180 5205 m
gs 1 -1 sc (function_class = POINTER) col-1 sh gr
/Courier-iso ff 150.00 scf sf
12180 5475 m
gs 1 -1 sc (export_type = 0) col-1 sh gr
/Courier-iso ff 150.00 scf sf
12180 5745 m
gs 1 -1 sc (type_qualifier = 0) col-1 sh gr
/Courier-iso ff 150.00 scf sf
12180 6015 m
gs 1 -1 sc (storage_class_specifier = 0) col-1 sh gr
/Courier-iso ff 150.00 scf sf
12180 6285 m
gs 1 -1 sc (arit_class = 0x0) col-1 sh gr
/Courier-iso ff 150.00 scf sf
12180 6555 m
gs 1 -1 sc (memory_size = 4) col-1 sh gr
/Courier-iso ff 150.00 scf sf
12180 6825 m
gs 1 -1 sc (domain = 0x0) col-1 sh gr
/Courier-iso ff 150.00 scf sf
10590 7065 m
gs 1 -1 sc (output) col-1 sh gr
/Courier-iso ff 150.00 scf sf
11655 7065 m
gs 1 -1 sc ( = ) col-1 sh gr
/Courier-iso ff 150.00 scf sf
11970 7065 m
gs 1 -1 sc (0x1f6718) col-1 sh gr
% Polyline
gs  clippath
2310 7302 m 2340 7182 l 2370 7302 l 2370 7140 l 2310 7140 l cp
clip
n 12285 7200 m 12285 7380 l 2340 7380 l 2340 7155 l gs col0 s gr gr

% arrowhead
n 2310 7302 m 2340 7182 l 2370 7302 l 2340 7302 l 2310 7302 l  cp gs 0.00 setgray ef gr  col0 s
% Polyline
n 240 285 m 5070 285 l gs col-1 s gr 
% Polyline
n 240 300 m 240 3570 l gs col-1 s gr 
% Polyline
n 285 525 m 5025 525 l gs col-1 s gr 
% Polyline
n 285 570 m 5025 570 l gs col-1 s gr 
% Polyline
n 285 585 m 285 3525 l gs col-1 s gr 
% Polyline
n 1875 1395 m 4980 1395 l gs col-1 s gr 
% Polyline
n 1875 1410 m 1875 3285 l gs col-1 s gr 
% Polyline
n 2100 1665 m 4935 1665 l gs col-1 s gr 
% Polyline
n 2100 1935 m 4935 1935 l gs col-1 s gr 
% Polyline
n 2100 2205 m 4935 2205 l gs col-1 s gr 
% Polyline
n 2100 2475 m 4935 2475 l gs col-1 s gr 
% Polyline
n 2100 2745 m 4935 2745 l gs col-1 s gr 
$F2psEnd
rs
showpage
