<?xml version="1.0" encoding="UTF-8" standalone="no"?>
<!--
SPDX-License-Identifier: CC-BY-SA-4.0
SPDX-FileCopyrightText: Michael Terry
-->
<svg
   xmlns:osb="http://www.openswatchbook.org/uri/2009/osb"
   xmlns:dc="http://purl.org/dc/elements/1.1/"
   xmlns:cc="http://creativecommons.org/ns#"
   xmlns:rdf="http://www.w3.org/1999/02/22-rdf-syntax-ns#"
   xmlns:svg="http://www.w3.org/2000/svg"
   xmlns="http://www.w3.org/2000/svg"
   xmlns:xlink="http://www.w3.org/1999/xlink"
   xmlns:sodipodi="http://sodipodi.sourceforge.net/DTD/sodipodi-0.dtd"
   xmlns:inkscape="http://www.inkscape.org/namespaces/inkscape"
   width="1280"
   height="720"
   viewBox="0 0 338.66665 190.50001"
   version="1.1"
   id="svg8"
   inkscape:version="1.0.1 (3bc2e813f5, 2020-09-07)"
   sodipodi:docname="location.svg"
   inkscape:export-filename="location.png"
   inkscape:export-xdpi="96"
   inkscape:export-ydpi="96">
  <defs
     id="defs2">
    <marker
       inkscape:stockid="Arrow2Lend"
       orient="auto"
       refY="0.0"
       refX="0.0"
       id="Arrow2Lend"
       style="overflow:visible;"
       inkscape:isstock="true">
      <path
         id="path6152"
         style="fill-rule:evenodd;stroke-width:0.625;stroke-linejoin:round;stroke:#ff82ff;stroke-opacity:1;fill:#ff82ff;fill-opacity:1"
         d="M 8.7185878,4.0337352 L -2.2072895,0.016013256 L 8.7185884,-4.0017078 C 6.9730900,-1.6296469 6.9831476,1.6157441 8.7185878,4.0337352 z "
         transform="scale(1.1) rotate(180) translate(1,0)" />
    </marker>
    <marker
       inkscape:stockid="Arrow1Lend"
       orient="auto"
       refY="0.0"
       refX="0.0"
       id="Arrow1Lend"
       style="overflow:visible;"
       inkscape:isstock="true">
      <path
         id="path6134"
         d="M 0.0,0.0 L 5.0,-5.0 L -12.5,0.0 L 5.0,5.0 L 0.0,0.0 z "
         style="fill-rule:evenodd;stroke:#f30000;stroke-width:1pt;stroke-opacity:1;fill:#f30000;fill-opacity:1"
         transform="scale(0.8) rotate(180) translate(12.5,0)" />
    </marker>
    <linearGradient
       id="linearGradient5980"
       osb:paint="solid">
      <stop
         style="stop-color:#ff0dff;stop-opacity:1;"
         offset="0"
         id="stop5978" />
    </linearGradient>
    <clipPath
       clipPathUnits="userSpaceOnUse"
       id="clipPath8173">
      <rect
         y="114.43746"
         x="7.9375052"
         height="174.625"
         width="322.79166"
         id="rect8175"
         style="opacity:1;fill:none;fill-opacity:1;fill-rule:evenodd;stroke:#ff82ff;stroke-width:1;stroke-miterlimit:4;stroke-dasharray:none;stroke-opacity:1" />
    </clipPath>
    <clipPath
       clipPathUnits="userSpaceOnUse"
       id="clipPath8177">
      <rect
         y="114.43746"
         x="7.9375052"
         height="174.625"
         width="322.79166"
         id="rect8179"
         style="opacity:1;fill:none;fill-opacity:1;fill-rule:evenodd;stroke:#ff82ff;stroke-width:1;stroke-miterlimit:4;stroke-dasharray:none;stroke-opacity:1" />
    </clipPath>
    <clipPath
       clipPathUnits="userSpaceOnUse"
       id="clipPath8181">
      <rect
         y="114.43746"
         x="7.9375052"
         height="174.625"
         width="322.79166"
         id="rect8183"
         style="opacity:1;fill:none;fill-opacity:1;fill-rule:evenodd;stroke:#ff82ff;stroke-width:1;stroke-miterlimit:4;stroke-dasharray:none;stroke-opacity:1" />
    </clipPath>
    <clipPath
       clipPathUnits="userSpaceOnUse"
       id="clipPath8185">
      <rect
         y="114.43746"
         x="7.9375052"
         height="174.625"
         width="322.79166"
         id="rect8187"
         style="opacity:1;fill:none;fill-opacity:1;fill-rule:evenodd;stroke:#ff82ff;stroke-width:1;stroke-miterlimit:4;stroke-dasharray:none;stroke-opacity:1" />
    </clipPath>
    <clipPath
       clipPathUnits="userSpaceOnUse"
       id="clipPath8189">
      <rect
         y="114.43746"
         x="7.9375052"
         height="174.625"
         width="322.79166"
         id="rect8191"
         style="opacity:1;fill:none;fill-opacity:1;fill-rule:evenodd;stroke:#ff82ff;stroke-width:1;stroke-miterlimit:4;stroke-dasharray:none;stroke-opacity:1" />
    </clipPath>
    <clipPath
       clipPathUnits="userSpaceOnUse"
       id="clipPath8193">
      <rect
         y="114.43746"
         x="7.9375052"
         height="174.625"
         width="322.79166"
         id="rect8195"
         style="opacity:1;fill:none;fill-opacity:1;fill-rule:evenodd;stroke:#ff82ff;stroke-width:1;stroke-miterlimit:4;stroke-dasharray:none;stroke-opacity:1" />
    </clipPath>
    <clipPath
       clipPathUnits="userSpaceOnUse"
       id="clipPath8197">
      <rect
         y="114.43746"
         x="7.9375052"
         height="174.625"
         width="322.79166"
         id="rect8199"
         style="opacity:1;fill:none;fill-opacity:1;fill-rule:evenodd;stroke:#ff82ff;stroke-width:1;stroke-miterlimit:4;stroke-dasharray:none;stroke-opacity:1" />
    </clipPath>
    <clipPath
       clipPathUnits="userSpaceOnUse"
       id="clipPath12107">
      <rect
         style="opacity:1;fill:none;fill-opacity:1;fill-rule:evenodd;stroke:#f60fd4;stroke-width:5;stroke-miterlimit:4;stroke-dasharray:none;stroke-opacity:1"
         id="rect12109"
         width="243.92697"
         height="182.22206"
         x="86.802185"
         y="106.84041"
         clip-path="none" />
    </clipPath>
    <clipPath
       clipPathUnits="userSpaceOnUse"
       id="clipPath12111">
      <rect
         style="opacity:1;fill:none;fill-opacity:1;fill-rule:evenodd;stroke:#f60fd4;stroke-width:5;stroke-miterlimit:4;stroke-dasharray:none;stroke-opacity:1"
         id="rect12113"
         width="243.92697"
         height="182.22206"
         x="86.802185"
         y="106.84041"
         clip-path="none" />
    </clipPath>
    <clipPath
       clipPathUnits="userSpaceOnUse"
       id="clipPath12115">
      <rect
         style="opacity:1;fill:none;fill-opacity:1;fill-rule:evenodd;stroke:#f60fd4;stroke-width:5;stroke-miterlimit:4;stroke-dasharray:none;stroke-opacity:1"
         id="rect12117"
         width="243.92697"
         height="182.22206"
         x="86.802185"
         y="106.84041"
         clip-path="none" />
    </clipPath>
    <clipPath
       clipPathUnits="userSpaceOnUse"
       id="clipPath12119">
      <rect
         style="opacity:1;fill:none;fill-opacity:1;fill-rule:evenodd;stroke:#f60fd4;stroke-width:5;stroke-miterlimit:4;stroke-dasharray:none;stroke-opacity:1"
         id="rect12121"
         width="243.92697"
         height="182.22206"
         x="86.802185"
         y="106.84041"
         clip-path="none" />
    </clipPath>
  </defs>
  <sodipodi:namedview
     id="base"
     pagecolor="#ffffff"
     bordercolor="#666666"
     borderopacity="1.0"
     inkscape:pageopacity="0.0"
     inkscape:pageshadow="2"
     inkscape:zoom="0.98994949"
     inkscape:cx="653.03399"
     inkscape:cy="368.51806"
     inkscape:document-units="mm"
     inkscape:current-layer="layer1"
     showgrid="false"
     units="px"
     inkscape:pagecheckerboard="false"
     showborder="false"
     inkscape:window-width="1920"
     inkscape:window-height="1016"
     inkscape:window-x="0"
     inkscape:window-y="27"
     inkscape:window-maximized="1"
     inkscape:document-rotation="0"
     showguides="false" />
  <metadata
     id="metadata5">
    <rdf:RDF>
      <cc:Work
         rdf:about="">
        <dc:format>image/svg+xml</dc:format>
        <dc:type
           rdf:resource="http://purl.org/dc/dcmitype/StillImage" />
        <dc:title />
        <cc:license
           rdf:resource="http://creativecommons.org/licenses/by-sa/4.0/" />
      </cc:Work>
      <cc:License
         rdf:about="http://creativecommons.org/licenses/by-sa/4.0/">
        <cc:permits
           rdf:resource="http://creativecommons.org/ns#Reproduction" />
        <cc:permits
           rdf:resource="http://creativecommons.org/ns#Distribution" />
        <cc:requires
           rdf:resource="http://creativecommons.org/ns#Notice" />
        <cc:requires
           rdf:resource="http://creativecommons.org/ns#Attribution" />
        <cc:permits
           rdf:resource="http://creativecommons.org/ns#DerivativeWorks" />
        <cc:requires
           rdf:resource="http://creativecommons.org/ns#ShareAlike" />
      </cc:License>
    </rdf:RDF>
  </metadata>
  <g
     inkscape:label="Layer 1"
     inkscape:groupmode="layer"
     id="layer1"
     transform="translate(0,-106.49996)">
    <rect
       style="opacity:1;fill:#285a50;fill-opacity:1;fill-rule:evenodd;stroke:none;stroke-width:0.330729;stroke-opacity:1"
       id="rect4518"
       width="338.66666"
       height="190.5"
       x="5.0862632e-06"
       y="106.49996"
       sodipodi:insensitive="true" />
    <rect
       y="114.43746"
       x="7.9375052"
       height="174.625"
       width="322.79166"
       id="rect8139"
       style="opacity:1;fill:none;fill-opacity:1;fill-rule:evenodd;stroke:#ff82ff;stroke-width:1;stroke-miterlimit:4;stroke-dasharray:none;stroke-opacity:0"
       clip-path="url(#clipPath8193)" />
    <rect
       y="114.43746"
       x="7.9375052"
       height="174.625"
       width="322.79166"
       id="rect8135"
       style="opacity:1;fill:none;fill-opacity:1;fill-rule:evenodd;stroke:none;stroke-width:1;stroke-miterlimit:4;stroke-dasharray:none;stroke-opacity:1"
       clip-path="url(#clipPath8185)" />
    <rect
       y="114.43746"
       x="7.9375052"
       height="174.625"
       width="322.79166"
       id="rect8131"
       style="opacity:1;fill:none;fill-opacity:1;fill-rule:evenodd;stroke:none;stroke-width:1;stroke-miterlimit:4;stroke-dasharray:none;stroke-opacity:1"
       clip-path="url(#clipPath8177)" />
    <text
       xml:space="preserve"
       style="font-style:normal;font-variant:normal;font-weight:500;font-stretch:normal;font-size:17.6389px;line-height:125%;font-family:'Quicksand Medium';-inkscape-font-specification:'Quicksand Medium, Medium';font-variant-ligatures:normal;font-variant-caps:normal;font-variant-numeric:normal;font-feature-settings:normal;text-align:center;letter-spacing:0px;word-spacing:0px;writing-mode:lr-tb;text-anchor:middle;fill:#ffffff;fill-opacity:1;stroke:none;stroke-width:0.264583px;stroke-linecap:butt;stroke-linejoin:miter;stroke-opacity:1"
       x="54.963779"
       y="163.41006"
       id="text6101-3"><tspan
         sodipodi:role="line"
         x="54.963779"
         y="163.41006"
         style="font-size:16.9333px;stroke-width:0.264583px"
         id="tspan8230">Back up</tspan><tspan
         sodipodi:role="line"
         x="54.963779"
         y="185.67035"
         style="font-size:16.9333px;stroke-width:0.264583px"
         id="tspan8238">to the</tspan><tspan
         sodipodi:role="line"
         x="54.963779"
         y="207.93062"
         style="font-size:16.9333px;stroke-width:0.264583px"
         id="tspan8244">cloud,</tspan><tspan
         sodipodi:role="line"
         x="54.963779"
         y="230.1909"
         style="font-size:16.9333px;stroke-width:0.264583px"
         id="tspan8250">a server,</tspan><tspan
         sodipodi:role="line"
         x="54.963779"
         y="252.45117"
         style="font-size:16.9333px;stroke-width:0.264583px"
         id="tspan8273">or a drive.</tspan></text>
    <flowRoot
       xml:space="preserve"
       id="flowRoot8254"
       style="font-style:normal;font-weight:normal;font-size:40px;line-height:125%;font-family:sans-serif;letter-spacing:0px;word-spacing:0px;fill:#000000;fill-opacity:1;stroke:none;stroke-width:1px;stroke-linecap:butt;stroke-linejoin:miter;stroke-opacity:1"><flowRegion
         id="flowRegion8256"><rect
           id="rect8258"
           width="0"
           height="62.629459"
           x="211.12189"
           y="609.89337" /></flowRegion><flowPara
         id="flowPara8260" /></flowRoot>
    <rect
       style="opacity:1;fill:none;fill-opacity:1;fill-rule:evenodd;stroke:#ff82ff;stroke-width:1;stroke-miterlimit:4;stroke-dasharray:none;stroke-opacity:0"
       id="rect12081"
       width="238.46483"
       height="170.11433"
       x="86.802185"
       y="106.84041" />
    <image
       width="159.80833"
       height="159.80833"
       preserveAspectRatio="none"
       style="image-rendering:optimizeQuality"
       xlink:href="data:image/png;base64,iVBORw0KGgoAAAANSUhEUgAAAlwAAAJcCAYAAAAsHHqwAAAABHNCSVQICAgIfAhkiAAAABl0RVh0 U29mdHdhcmUAZ25vbWUtc2NyZWVuc2hvdO8Dvz4AAAAtdEVYdENyZWF0aW9uIFRpbWUAU3VuIDE3 IEphbiAyMDIxIDAxOjI5OjQyIFBNIEVTVNNGMLcAACAASURBVHic7N13eFRV/sfxzyTTMmkEEggB QhcERPEnRQVFEFyqXVd0FfvuqotdUVCkiKiAuGCjiCJLFBRpigpGVkTFVRQFRZROJBBKSDKZksz8 /kgYSYO0m0mG9+t57pNk5txzvndInvlw7rl3JAAAAAAAAAAAAAAAAAAAAAAAAAAAAAAAAAAAAAAA AAAAAAAAAAAAAAAAAAAAAAAAAAAAAAAAAADAqcB0io8PAABOHf5gDVyTgaf4WKZi3xO+AABAdfOr aNAqHrpqJISZa2AM0wm+lvY9AABAdTk+cBX/vng7wxgZuMoKWGVtYQbWAgAATk0+/Rm0StuKMyR4 GTWrVFbICivjq0lSuEG1AACAU1e+/gxXvjK+Fg9g1R66jJjhKh62jg9XYSoIVmHFNpNBtQAAgFNb nv4MV8dv+SrIH8eHLxV+b1I1h67qDjmlha3jQ1b4cVsDSfGSYiRFGFALAABAnqRcSUclZUg6qIKw FVb49Vj4kgwMXUbNcBUPW+GFY5klxUpq/u036x9s07p1b4vNZg8PJ2sBKL8dv2+R1WYLdhmoII/b rRat2wW7DJyC8vPz5HW7Xb/9/vtn/9e12/OSdkrKVEEYyyvW/PjQVW2qcw1X8bVax8KW+bgtQdLp e3dvn2M2W6Lz8vKUn58vv89XVp8AUMLendsUERkZ7DJQQbk5OWrSvFWwy8ApyBQWpvDwcJnNZuXl ebOaNGt5i6SfJR3Qn6ErT3/OeBVf21VlRlwZePwi+GOByyKpvqQOf+zdtUAyRbtyc5Xn9RK2AACA ofw+n/K8XrlycyWZoguyiDqoIJtYVJBVjuUWQ25VVV3n8kq7GjFMf85sWSW13LNr25w8r9ecn59f ZkcAgNDl9wftRt+AJMnr8Sg8PNy8Z9e2OU2TW10jKUdFZ7PC9OcarmOq/Itb3TNcpZ1OtEhKWPXR ylslUxRhCwAABFNBFjFFFWQTJajoLNfxd1CoNtUZuI6f4Sp+OrFh29Pa9s/zeqtxOAAAgMrJ83rV 9rS2/SU1VNmnFastdBk9wxWugoOoFxamqGoeCwAAoNIKs0k9FWSVY7mlVs9wlbaG6/grFB2+fB+f lQgAAGqNwmzi0J955VjgKp5rqqw6Fs2XdbPT40NXuN/P1YgAABbNo/YovIgjkFVU8lNwjs84Vfrl NeJO88fPcP258TcGAOC9ALVPeLGteNiqFkbdFqLEWi7+xgAAvBegFipt7VbxrdbcFqK0tVsWFdx/ y1b4PQAAQG1jUUFWsark7SGqbabLiDvNAwAA4Dg1+KnRTCQDAHgvwKmp5gIXf2MAAN4LcIqqwRku ILQ9Pu5pmUwmjR81Mtil1Aqvz1+gpklJ6nfRhcEuRZI0/vl/a+u27SUeb5ncTPffdbtiomvHvZm/ +maD9vzxhy44r7saxjcotU2206lftvymbGeOep9/bg1XCKAyamwNl5+NLcS2DRt/0n0jn1B6RoZ8 fr+279ytbTt2yef3Kz0jQ/eNfEIbNv4U9DqDtX31zXdKP3DAkL4ro7SwJUnbd+3W01NnKDPzaCV7 rl6z3lqgZStXKSsru8w2mzZv0b9nztXHn35eg5VVj2D/XrKxFd9qCjNcQCX5/D5t27FDj42ZoMaN GyknJ0eS9MTTk/THH+nKOHhQvire8Nfldmvx0hVa++XXSj9wQFarVclNktTv4ovU94Je1XEYkPTH vnT9a+SYEo+3adlCox/6V7n7eWzcs9r7x74Sj5tMJs2dMbkKFQKo61g0D1RSl86dlNiokfalF4Sr Y378abMkKbFRI3Xp3EmV/d3Pdbn02JgJ2r03TYP/0k/tTztNLpdLu3bvVk52TqX7rXl1pc6Sftu+ o1L7WcxmmS1/3g0nPIwLwv9Ud38fgKpghguooI9Wf6YfN22WIyJC+9LTZTabNeyaK9W753mSpNTP v9CChe9pX3q6Xp41V87cXJ3RsYMu6du7QuP85+13tXP3Hk0cM0rt2rYus53P51PKovf133VfKfPo UbVp3VJ33HSDmjVtIkmaOXeevvvhRx3JPKq8vDy1apGsu++4NfD8yfZfsPA9rVv/P2VkFITKO2+5 Sb17naePVqcqZdH7ysrOVv169dSvz4W6+vKhFX05a9zj99+j09q0NHSMywddokGX9C3xuN/vV+rn 6/Th6jU6dPiIEhrU19ABF+u8buecsD+Xy6X5C9/Xtz/8qHxfvuJi65Vo4/P59MEnqUr9/Esdzc5W 40YNNfiSvup29pmBNm8vXqZNv2zVwUOH5fa4ldgwQeMee1CbftmqRUs/0N4/9slsDldiw4Z68O47 FOmIqPqLAVTCZdfdpNPbn6aR992jmJgYSdLR7Gw9O/Xf+mnzL3p/wRtBrrDiuEoRqKC0P/bpi6/W H/sMLl131RW6YvDAwPNXDhkk+aV5Ke/o408/k8lkUoP69Sv0N+Dz+fTp52t1fo9uatem9Qn3ffvd 9/Xxp6m65YZhapjQQCnvvq9xk6bopSmTZDabtXHTz0pu2kT/uHW4cnKcWrR0mZ565nm9Nm2ywsLC Trr/uvX/U8OEeN1x0w3y5uWpSVJjyS+d1qa1Rvz9dkVERGjjpk2a/867atWyuf7vzD/f4Gt8kUQ5 nNampW765/0V3u+Nl6ZUeez3lq3U0pWfSJLsdrv+SN+vV+f+R9k5uep/UdmniOfMX6ivv90gk8mk mJhopR/IKNEm5b2l+ujT/8psNis2Nlq79uzVjFlvyH7X7erc8XRJ0ieffS6vN092u1V2u13mcLNc LpemvTpHHo9HjRrGKzwsXAcPHTIubNWy3wfUTs2aNtHPv/yq0eMnadzjj8hkMunJp5/V9p271DQp qU7+HjHDBVTQzdf/Ved376ZHx4yTz+fTRb3OL9Hmol7na17KOwoLC9MzY0brtDatKjTGocNHlJPj VNtWJ94v1+XSe8s+0D9uHa4LCq9Wu/uO23TbPffpl19/U6cO7SVJTZMaq3PHDpKk+AZxemj0WP22 bYeaNU0q1/4tmjXVGYX7H9MyOVlKLvi+XdvW+vzLr/XzL1uLBq5T1DtLVuidJSsCP18xZIB6n9dd Kz75VJL095tv0Lldz9bK1Wu04N0lem/pB7qoZw9ZLCU/lOPQkSNa/933kqQH7rpdZ3Ror8+/Wq9Z b6YE2mQezdLHqZ8XXCX72ANqnNhIqZ+v09wFi/Rx6ueBwHXMw/f8Q61bNpfXm6f9GRnyeDwKCwvT 4/fdrdjYGOXn5xvxsgDlNubRBzVq/ETt3L1HoydMkslk0o5du9UwPl5PPPpAsMurFAIXUAv5fQX/ fQs3h5d4buH7S/Xl+v9pytNjtWfvXnm9Xr0063W9PHtukXbpGQfUSe1L7J+U2FiSdPjIEZlM/grv f8x3P2zUoiXLtHv3XlmsFjlzc+V0Oit4pKGp+Bouq8Wibbt2Kz8/XxE2m87terYk6aKe52rBu0uU 63ZrT9ofatk8uURfaX+ky+/3KyIiQmcUBmCruWgw275zd2DG9dGxk4o8l77/QNl1WsxKbJigpMRG StuXrgeemKDu/3eWBvfvo8aJjSp38EA1aFC/vsaPGhkIXZKUEN9AY0c9oobx8UGurnJqLHD56+L8 H1CKufPf1tIPVgbe4FI/X6srhg4q0ib1vwWX6/t8Pj3y5FgNHfgXDb/+2nKPEVc/VjabVTt37i7x t5PrculI5lH55Vd44Zv6XbffrDati65Lql+vXmDfgjN7Bd+brQV/9nn5+ZXaX5LS9+/XhOdfUL8+ F+qWG4bJb/LrxZdeK2x7rN2xvU69v/3S1nBt+HHTiXcylf5xbV5vniQpPz9ffr9fplLamQuDuclk 0pBLLi7ynOMkpwbDw8M16sF/aflHq/Tfdeu19qtv9PW33+vJh+9VsyaNT1xzJZyKvw+onPBws6wW a+Bni9kii8VSZ3+HmOECKiipcSOd172bIiMi9HHqZ1qwaLEkqXfhqcXPPv9CC959X5LU/6LeysnN VVLjis0WhIeHq0fXc5S69gsNHnhJmW98jRs1lMVi0e60PwLjV0Rl99+2Y5fy8/M17JorFR0ZKUmK jIwu0sZkUiCUQmrVPFnh4eHKdbv15Tff6dyuZyt17ZeSJLvdqiaFM0rh4WZ5vXnKOHRIrVs2V3LT JIWFhcnj8ejTz9ep7wUl/52aJCUqLCxMPp9P0dFR6te7p0wmkzIzj8pqt52wrvz8fPl9Pl17+RBd MfgvGvvci9q1Z682/rTZkMAFlMfhI5l6YsIk7dmbVrBmS9KetDQ9OeFZjR31iOLqxQa5woojcAEV 1L9Pb/Xv01t+v18bN2/WvvT9mpeyUPNSFhZpl9ioof5+202lzkiUx03DrtGmn3/RI6Of0pWXDVbr Fi2U7/Np567dgTZ2m02XDrxE769YqfCwMHVod5pcbpdynC71vbDnSceo7P7JzZoEFtxfcN65MoeH y5lb9HRi/Xpx2rhps/rsS+f0lKTYmGgNuLi3ln+0Wq+8/pbmLlgkl8slSbps4F9ktRb8Tz65aWP9 +tt2vTr3P7JarepyRkf1691TH336X72Z8q7eW75S+flF7+8WFxurPr3O1ao1X2j+wsVatHSFzOHh ynHm6oHjFs2XZseuvRo/+UXFN6ivCLtdu/emSZISExsa9EoAJzfu2SmBsDV21COSpCfGT9KetDSN mzRZUyaODXKFFcdVikAlfb/xJ+1L36/4BvXVOLGRftz0syTpjI6n64996dqXvl/fb/xJXTqfUan+ 42Lr6flxT2nh+0v00apUHTx0WFaLRfENGqjHOWcH/qaGXX2loqOjtWLlJ3pv6QrFREWp6/91Ud8L jgtMx18tePzfor8S+0tqkthY//r7bVr0/nKt/ORThYeHKy42VomJjQLt/nrV5Xp51lx98uka3Xjd NZV6DULNVUMHKiY6Wh+lrtGRI0fVMCFeg/v30YXn9wi0uXnYNZr39nvaum2H6hf+L/6vVwxVQoP6 +mTNWh3IOKTw8HAlNkwIrOmSpOuvvlyJDRP0yWdrlXHosHw+v5KbJBU5JVManz9fTZMa64/0/Tqs I0psmKDePXvo/86s3O/tSfFegHLYvmOnWrZortEP36+42IK/g7GjHtG4SZO1feeuOvl7VLn/epfs I7xws0iySrJLchRuUZK6/b5l89RqGAuoNb7f+JPefHuhHr3vHiU0aKC/3XmXJGneqzN04OBBPTP1 37rx2qt1VudOQa409KSn7VZE4anM8vrXyDGV/vie+vXqaerTT1RqX/wpNydHjZKaBbsMoIjW7Trc J2m9pGxJzsLNJckjySspv3CrUszjTvNAJZ3VuaPO6twx8HPL5skymUwymaSG8Q00ZcKYwmf43a8N 7rjxOs16M0WHMzMrtF9sbIxu/dtfDarqVMTfA05NrOECqsm4xx8Jdgk4gU6nt9MLE58MdhkATlE1 eFsIAMCpjvcCnKr4RFUAAACDcZUiAKDm8F6AUxSL5gEANYj3ApyaOKUIAABgMAIXAACAwbhKEQBQ Y3gvwKmKRfMAgJrDewFOUSyaBwDUIN4LcGpiDRcAAIDBCFwAAAAGI3ABAAAYjMAFAABgsJq7LYSf hZIAcKrjvQCnKma4AAAADEbgAgAAMFiNnVLcu2t7TQ0F4BTgdruCXQIqgfcCnKpqLHB179W3poYC AACoVTilCAAAYDACFwAAgMEIXAAAAAYjcAEAABiMwAUAAGAwAhcAAIDBCFwAAAAGI3ABAAAYjMAF AABgMAIXAACAwQhcAAAABiNwAQAAGIzABQAAYDACFwAAgMEIXAAAAAYjcAEAABiMwAUAAGAwAhcA AIDBCFyl+HjVp3pl5mztTUsrs83RrCylrvlcS5Yvr8HK6qbFS5bquanTtGv3nmCXAgBAUJiDXUBt NH7Ss/J4POp53rlqkpRUapuv1/9Po8eOU8sWLXTp4ME1XGHdMnX6S/J4PBrQv1+wSwEAIChCLnBd d9Mt2r5jR4nHw8LCtC51Vc0XVM1yc3PVd+AQ+Xw+LZz/lpo1LT0QltcT48Zrw/cblZWdrfz8fMXE xKjdaW116aCBurBXz2qqumIu6PcXeTweTRo/tkgNfQcOUU5OjsY9MVr9+l4UlNoAAKiMkD2laLNa FRkZGdiio6KCXVK18PtN8vl81dbf1t+26UBGhsJNJsXGxig7K0vrvvxKj4x6QqtT11TbOAAAnMpC bobrmFuH36gbrx9W4nG/36/FS5bpP++8o/T9B5SUmKibb7pBf+l34tNdOU6nXnhxuj5bu1b5+XlK aJBQoo3P59O8BSl6f+lyHT5yRMnNmumm64ep70UXBtpMf/lVrf/2O6WnpyvX5VJys6aaN3um1n/7 nV6ZOVvbd+yQ2WxWcrNmmvbcJEVHlx0Ur77+BklS5zM66bXpL1b62CTp7n/cqcsvHSqv16tHnxij L9Z9qU/XrAnU/srM2frgo4916PBh2SwWderUUffec5daNm8e6OPjVZ/q9Xlvac/evYqKitTVl1+m W266scg4+fn5GvHgw/rfdxvUscPpeumFKbLZbCetrzRPjBuvX7b8qv0HMuTz+dSieXPdfvNN6nX+ eZXqDwAAo4TsDFdZXpv9up6d+oL27E2T1WLRzt27NWb8RL296L0T7jfxucla9uFKZWfnKCIiUrv3 7i3R5sWXXtbLr81SxsGDqlcvVlt/+02Pj3lKX379daDNO+8t1q9bt8qb55HD4ZDFbJHT6dQjj4/W z7/8ooT4+kpo0EDp6eknDFuS1CQpSc2bNVPjRo2qdGzH+P1+HcnMlDMnR5LUqGHDwHPZOdlyezxK bNRQeT6fvv7mf3pi7ITA8/MWpOiJceO1fccOWc1mOXOckslUYowXps/Q/77boKTGjfX80xMqHbYk 6bP/rtWu3XtksZhlsVj069ateuixUVr2wYeV7hMAACOE7AzXS6/N0kuvzQr8fMetN+vSQQM1b0GK JOmp0Y/rkov7asE7izRtxkt6bdZsXTZkUKkBYP+BA1qd+pkkaeqzE9WjWzctX7lS4yc+G2hz8NAh vfPuYoWFhWnenJlqkZysxUuWatKUF5Sy6D2d2717kT5ffP55derYQR6PR3vT0uRyuRQeHq5XXpym Bg0aKC8v76TH+MJzzwbWcB08eLBSx3bMpCkvaNKUFwI/N0lK0q03/S3w83333K377rlbhw4f1tGj Wbrxtju09bfflJmZKZ/Pr1lz5kqS7r37Lv316ivl8/nkdruLjPH2u+/qk9Wpqh8Xp2nPP6e4uHon PcbymDrpGXXscLqmzXhJKQvf1fRXXtPAS/orPDy8WvoHAKCqQnaGq/gaLpvNpp+3bFFeXp4iIyJ0 ycV9JUmXDRkkScrJzdW27dtL7Wv7jp3y+/2KjIxUj27dCvq3FA0vv/yyRT6fTz6fT3/923D1uLBP IMDs2VNyNuwYq9WqZk2bqmXzZOXn5+uK627QuImTtOcEt6QoTWWP7ZimTZLU+YxOatWypcLCwrQ3 LU3jnvkzUL4+7y31HzRUQ668RtfffKvy8/MlSUeOHtXmn3+W2+NRRESErr3qCkkFFylEREQUGeOT 1amSpPv/dXeVF/sXZzKZNOzaayRJmZmZpc5AAgAQLCE7w1XaGq6169adeKdSToFJksfjkVSw/sjv 98tUSjuzxSKpIGjcVGzcqJOcGjSbzXptxnS98dZ8LfvgQ61Y+ZFWpX6mOa+8pNatWhZpG1YkIvtP fDzHK+PYjrn+2mt0+aVDJUnrvvxK9z/6mD777+dK++MPbf3td816/Q1FOhx68N4RiopyaOJzU+R2 u+X3+2U2mwuHKP21OSYxsZH27UvXtBkv66zOnRUf36DUdlGRkTrk8ejQoUOBx9xut5xOpyQppozX 02a1Br43h4fsrzYAoA4K2Rmu0pzevr3MZrNycnP10arVkqT3l62QJDkc9sACcEthgNiXni5Jatum tcLCwuRyufTekqWl9t2qZQuFhYXJ5/OpXr16uuPWm3Xnbbfoqssv1WVDh5ywrry8PPl8+br7H3dq 6aK31bZNG7ndbn3x5Zcl2trtdtntdknS1t9+D+xf3mM7Gb/fr7R96UV+/qPw57ZtW+uqyy/VX/r1 C4QsSWpZeOxOp6vIjWCzs7OL9P34Iw+pTetWOpCRocfGPFXm1ZatWxaEzEXvL9GevWnKcTr18sxZ 8vv9gfGO5/F6JUkfF86g2e12NU5sVK7jBQCgJpxS0wAN6tfX9ddeozfm/0dPjpugZydPVU7hrMmt w4cHgkybNq30w8afNGbCRNntNvU87zxdc+XlSln4rp6bOk2vzZlbYo1VQny8rrh0iBYtXqKp/56u V2bNltkcrqysbE19dmKJNVzH2/LrVt1+1z1KapwohyNSv2/bJklqntys1Pbdu56jNZ+v1eix4/TC 9Pqy2SxaOP+tch1bWWa8NktvzF+go1mZcjpdkqSuZ5+tJklJ6tihvSTp+x9+1PU336r4+vWVm5sb 2LdhQoKGDByoJcuXa+JzU/Ti9JelsDCd2fkMTXnm6UC7CJtd48c8oZtuvUMbf/xJ899+R3+77q8l arnt5uH69vvv9fu27bpq2A1FnvvLxRerYULRK0RHPPiwYmJidPDgQUnSNVdewfotAECtckrNcEnS 32+/VffefZcSExvJ7fGoaZMkPfbQA7q+cP2PJD364IM65+wuCg8PD7y5/+uf/9D99xSsPcrOzlZe Xp6SmzVVj+5dA/vd/697Cts0kdfrlcfjVdvWrWWznTjs5Pt8at2qlQ5kHNSOnTvVrEkTjfjnP3Rh r16ltn/4vhE6/7xzZTablZWdrejoWOXn55fr2Ipr2SJZkQ6HsrOztS89XX6/Sae1bavbbxmu5yaO lySd0bGjHnvoAbVITtbuPXv17fc/KC4uTl3PPlvRkZGSpAfvvUe33HSjmiQlye31ymw2q0FcXInx WiQn69bhBbeKmPPGPGVkHCzR5szOnfTq9Gk6+6wzFRERIYvFohbJybrztls0auTDJdo3TSr4N4mN idGN1w/T32+75YSvNwAANe3EC3vK30d44WaRZJVkl+Qo3KIkdXPmZE+thrGAgGN3pJ/10nR16tgh 2OUAAOogR2TUfZLWS8qW5CzcXJI8kryS8gu3CiycLumUm+ECAACoaQQuAAAAg51Si+YRWv77ycpg lwAAQLkwwwUAAGAwAhcAAIDBCFwAAAAGI3ABAAAYjMAFAABgMAIXAACAwQhcAAAABiNwAQAAGIzA BQAAYDACFwAAgMEIXAAAAAYjcAEAABgspD+82uvxKDfXKbfLKa/HG+xyAABAMRarRTa7QxERDlms 1mCXY5iQDVxHM4/IlZuj2Hr1FdcgXlarLdglAQCAYjwet5zZWTp86IDsEZGKia0X7JIMEZKB6/DB A7JYrGre6rRglwIAAE7AarXJWt+mevXjdWBfmg4fPKC4BgnBLqvahdwarqOZR2SxWJWQmBTsUgAA QAUkJCbJYrHqaOaRYJdS7UIqcHk9HrlycwhbAADUUQmJSXLl5sjr8QS7lGoVUoErN9ep2Hr1g10G AACogth69ZWb6wx2GdUqpAKX2+WUIyo62GUAAIAqcERFy+0icNVaXo+XqxEBAKjjrFZbyN3OKaQC FwAAQG1E4AIAADAYgQsAAMBgIXnjUwAATnW5zhw5c7Llcbvl9/trZEyTySSrzSZHZJQiHJE1MmZd QeACACDEHM08LI/brajoGDWIbyiZTDUzsN8vlytX2VlH5fV6FBMbVzPj1gGcUgQAIITkOnPkcbsV n9BI9ghHzYUtSTKZZI9wKD6hkTxut3KdOTU3di1H4AIAIIQ4c7IVFR1Ts0GrOJNJUdExcuZkB6+G WobABQBACPG43bLbI4Jdhuz2CHnc7mCXUWsQuAAACCF+vz+4s1vHmEw1tli/LiBwAQAAGIzABQAA YDACFwAAgMEIXHXcq6++qm+++aba+rv33ns1ffr0Cu83f/58ffbZZ9VWBwAAoYTAVYd9//33uuee e3To0KFK93HOOefo0UcfDfy8atUq7dmzp8L9/Pzzzxo+fLhycrjnCgAAxRG4jnPxxRfrsssuK/F4 SkqKTCaTMjIyglBV2UaPHq3BgwfrkksuqXQf7du3V7Nmzapcy6hRo+T1ejVz5swq9wUAQKjho33q qK1bt2rFihVas2ZNlfp56623qqUeu92uv//975o2bZruvffeaukTAIBQwQxXJfj9fk2bNk3Jycmy 2+3q3r17iXVU99xzj9q2bavY2FjFxsbq0ksv1Zw5c9SjRw85HA41btxYM2bMKLJPfn6+Ro8erTZt 2ig2NlZ9+/bVpk2bSq1hxYoVio+PV69evao0ZqdOnYqcUjxeVlaWzjrrLA0cOFD5+fknre+KK67Q jh079NNPP1Xo9QQAINQRuIrx+XxyuVxFNq/XW6TN008/rUcffVQjRozQkiVL1Lp1a/Xs2VNbtmwJ tElNTdUZZ5yhpUuXatasWfrmm29077336rrrrtPixYt1+eWX6+6779aGDRsC+4wdO1YzZ87U2LFj 9cEHHyg8PFyDBw+Wx+MpUefatWt17rnnFnmsMmOWJS8vT1dffbXMZrPeeecdhYeHn7S+Dh06KC4u rsqzbgAAhBpOKRazbNkyRUSU/ZEIOTk5mjhxokaOHKkHHnhAktS/f39t3LhRY8aM0YIFCwJtTzvt NF144YWSpF9//VWTJk3SiBEjJEl9+vTRW2+9pVWrVqlLly7KysrSpEmT9Oqrr2rYsGGSpNmzZys5 OVnr1q1T7969i9Sxd+9edenSpUR9FRmzLD6fT8OHD9f27du1du1aRUVFlas+k8mkJk2aKC0t7YSv MQAApxoCVzEXXHCBJk2aVOSxVatWafTo0ZKkzZs3KycnR3369Ak8bzKZ1Lt3b3344Ydl9tuiRQtl ZWUpNzdXERERslgsatKkiQ4ePCip7HohxgAAIABJREFU4Co/t9utO+64Q3feeWeRfXfs2FGivyNH jigmJuaEx3KyMcvy2muv6ejRo9qwYYMSEhIqVF9MTIwOHz58wv4BALXLmV27l6vdD998bXAloYvA VUxcXJx69OhR5LHjA8Wxz4UyFfucqpN9XpTNZpNUsE7r+Mfy8vKKPD9z5kx169atyL6NGzcu0V+9 evWUlZVVpTHLcuGFF2rjxo269dZblZqaqujo6HLXd/ToUdWrV++E/QMAcKohcFVQx44d5XA4tHr1 ap1//vmSCsLWmjVr1LVr10r326ZNG9lsNv3888+68cYbT9o+KSlJe/furfR4J3L66afrxRdfVM+e PXXttddq+fLl5a4vLS1NSUlJhtQFADAGM1fGI3BVUGRkpEaOHKkJEyYoKipKnTp10ty5c7V161Yt WrSoSv0+8MADev7552U2m9WrVy9lZ2crMzNTN998c4n2PXv2LHHqszo1b95cixcvVq9evfT0009r 1KhRJ63v559/1qFDh3TBBRcYVhcAAHURVylWwuOPP66JEydq6tSpGjJkiH7//XetXbtW7du3r1K/ 48eP1zPPPKO33npLgwcP1l133aWvvvqq1LaDBg1Senq61q1bV6UxT+Scc87RmDFjNHbsWG3evPmk 9S1evFjJycnq3LmzYTUBAFAXmU7epFx9hBduFklWSXZJjsItSlI3Z0721GoY64TSdu9U63YdjB6m 1hg0aJAcDocWLlwY7FLkdrvVpk0b3Xfffbr//vuDXQ4AnLLSdu9UUrPmwS5DUtVq+X3L5ho5Dkdk 1H2S1kvKluQs3FySPJK8kvILtxMv1j4JZrjqsHHjxmnJkiVatWpVsEvRhAkTFBYWpjvuuCPYpQAA UOsQuOqws88+W1OnTlV0dHSwS1GbNm00Z84cRUVFBbsUAABqHRbN13F33XVXsEuQpHJdWQkAwKmK GS4AAACDEbgAAAAMRuACAAAwGIELAADAYAQuAABCiMlkkk7y+b41wu8v8bnDpzICFwAAIcRqs8nl yg12GXK5cmW12YJdRq1B4AIAIIQ4IqOUnXU0uLNcfr+ys47KEcm9GY8hcAEAEEIiHJGy2mzKOJAu V66zZoOX3y9XrlMZB9JltdkU4YisubFrOW58CgBAiImJjVOuM0c52Vk6fDBD/hoKXSaTSVabTZFR 0YStYghcAACEoAhHJKGnFuGUIgAAgMEIXAAAAAYjcAEAABiMwAUAAGAwAhcAAIDBCFwAAAAGI3AB AAAYjMAFAABgMAIXAACAwULuTvO/b9kc7BIAAACKCLnA1bpdh2CXAAAAqijUJlA4pQgAAGAwAhcA AIDBCFwAAAAGI3ABAAAYjMAFAABgMAIXAACAwQhcAAAABiNwAQAAGIzABQAAYDACFwAAgMEIXAAA AAYjcAEAABiMwAUAAGAwAhcAAIDBCFwAAAAGI3ABAAAYjMAFAABgMAIXAACAwQhcAOqUM7t215ld uwe7DACoEAIXAACAwQhcAAAABiNwAQAAGMwc7AIA4ETKWq9V/PEfvvm6JsoBgEphhgsAAMBgzHAB qNWKz1wdm9liRgtAXcIMFwAAgMEIXAAAAAYjcAEAABiMNVwA6hTWbgGoi5jhAgAAMBiBCwAAwGAE LgAAAIMRuAAAAAxG4AIAADAYgQsAAMBgBC4AAACDEbgAAAAMRuACAAAwGIELAADAYAQuAAAAgxG4 AAAADBZSgctitcjjcQe7DAAAUAUej1sWqyXYZVSrkApcNrtDzuysYJcBAACqwJmdJZvdEewyqlVI Ba6ICIcyjxwKdhkAAKAKMo8cUkQEgavWslitskdE6sC+tGCXAgAAKuHAvjTZIyJlsVqDXUq1CqnA JUkxsfXk9XoIXQAA1DEH9qXJ6/UoJrZesEupdiEXuCQprkGCfH6/dm77VUcOZbCQHgCAWsrjcevI oQzt3ParfH6/4hokBLskQ5iDXYBRYmLrKSLCodxcp45mHpbX4w12SQAAoBiL1SKb3aG4+gkhdxrx eCEbuKSCNV0Wq1UKwalJAABQd4TkKUUAAIDahMAFAABgMAIXAACAwQhcAAAABiNwAQAAGIzABQAA YDACFwAAgMEIXAAAAAYjcAEAABiMwAUAAGAwAhcAAIDBCFwAAAAGI3ABAAAYjMAFAABgMAIXAACA wQhcAAAABiNwAQAAGIzABQAAYDACFwAAgMEIXAAAAAYjcAEAABiMwAUAAGAwAhcAAIDBCFwAAAAG I3ABAAAYjMAFAABgMAIXAACAwQhcAAAABiNwAQAAGIzABQAAYDACVyk+XvWpXpk5W3vT0spsczQr S6lrPteS5ctrsDIAAFAXEbhKMX7Ss5r71nwdPnykzDZfr/+fRj7xpFIWvleDlQEAgLrIHOwCqtt1 N92i7Tt2lHg8LCxM61JX1XxB1Sw3N1d9Bw6Rz+fTwvlvqVnTpCr1d+z1+ucdt+nG64dVU5UAAOB4 IRe4jrFZrTJbLIGfzeHhQaym+vj9Jvl8vmCXAQAAKiBkA9etw28sdcbG7/dr8ZJl+s877yh9/wEl JSbq5ptu0F/69TthfzlOp154cbo+W7tW+fl5SmiQUKKNz+fTvAUpen/pch0+ckTJzZrppuuHqe9F FwbaTH/5Va3/9julp6cr1+VScrOmmjd7ptZ/+51emTlb23fskNlsVnKzZpr23CRFR0eVWdPV198g Sep8Rie9Nv3FSh9bacfx3pJlenvRIv2xL112u11JjRtr0F8u0bVXXSFJGj12nLb8ulWHDh+Ry+VS 48RGuv6v1+qyIYMr9FqX9Xr4/f6TvpYAANQVIRu4yvLa7Nf1+ry3JEmRDod27t6tMeMnKjMzKxAm SjPxucla9WmqTCaT6tevr91795Zo8+JLLytl4buyWCxq0KC+tv72mx4f85Qcjok6t3t3SdI77y2W x+ORw2GXw+GQxWyR0+nUI4+PlsvlUrOmSTKHW5Senn7CsCVJTZKSZA4PV+NGjap0bGUdR1hYmFq2 aK5Dhw/r161bldioYaCfNZ9/IY/Ho6ioKNntdu3es1fPPD9FbVu3VscOp5e7ntJeD5PJpGkzXjrp awkAQF0RsovmX3ptlnpc2CewzXlzng4ePKh5C1IkSU+NflyrP1yuEXf9U5L02qzZcrvdpfa1/8AB rU79TJI09dmJWvHeQj32yINF2hw8dEjvvLtYYWFhmjdnpt5/e4Eevm+EJCllUcmF9S8+/7xWLnlP r06fpv0HDsjlcik8PFyvvDhNC958XUsWppz0GF947lm9/dYbemr045U+ttKO9Z13F0uSJox5UvNf n60rL7207BqefUYfL3tfXc7sLElalZpa8HpUsJ7jX4+KvpYAANR2IRu4bFarIiMjA5vNZtPPW7Yo Ly9PkRERuuTivpKky4YMkiTl5OZq2/btpfa1fcdO+f1+RUZGqke3bgX9W2xF2vzyyxb5fD75fD79 9W/D1ePCPpo05QVJ0p49JWfDjrFarWrWtKlaNk9Wfn6+rrjuBo2bOEl7TnBLitJU9tiK2/LrVvl8 PkVGROiiC3uVa5+wsDCd0amTpILAVpV6rFZrpV9LAABqq5A9pVjaGq6169adeCeTqdSHPR6PJCk/ P19+v1+mUtodW6AfFhamm4qNG3WSU4Nms1mvzZiuN96ar2UffKgVKz/SqtTPNOeVl9S6VcsibcOK RGT/iY/neGUcW3HWYxcalLN98f283rwq11OV1xIAgNooZGe4SnN6+/Yym83Kyc3VR6tWS5LeX7ZC kuRw2NWyeXNJksVckEP3padLktq2aa2wsDC5XC69t2RpqX23atlCYWFh8vl8qlevnu649Wbdedst uuryS3XZ0CEnrCsvL08+X77u/sedWrrobbVt00Zut1tffPllibZ2u112u12StPW33wP7l/fYTqZF i+YymUzKcTq1fOVKuVwu7c/IKNe+x6tKPVV5LQEAqI1OqcDVoH59XX/tNZKkJ8dNUN8BgzVtxkuS pFuHDw8EmTZtWkmSxkyYqLXr1imxUSNdc+XlkqTnpk7TJUMv1zOTpxTpOyE+XldcWhAGpv57uvoM GKx+g4dq0BVXa+PGjSesa8uvWzXgsit11bAbdPtd/9Lv27ZJkponNyu1ffeu50gquFJw6FXX6rqb hpf72E6mUcOGGnhJf0nS+InPqvclA7V0+Ypy7Xu8qtRTldcSAIDaKGRPKZbl77ffqri4OKUsWqSM jINq2iRJNw67TkMHDwq0efTBBzX5hWn6cdNmNUwouP3Dv/75DyUlNtbCxe8p7Y/0wls3NFWP7l0D +93/r3uU3LSZFi5erD/2pcvn86lt69ay2U4cdvJ9PrVu1Uq7du+W35+hZk2a6LIhg3Vhr9LXUD18 3wjl5efrf99+p6zsbMXHt1B+fn65jq08Hn/kIbVp3Vr/27BBeV6vcpxO/bRpsyIdjgr1U5V6Kvta AgBQG1VsoU7ZfYQXbhZJVkl2SY7CLUpSN2dO9tRqGAs1YN++dMXHN5DZbJbb49G9Dz6sDT9s1B23 DNctN90Y7PIAAKg2jsio+yStl5QtyVm4uSR5JHkl5RduFVg4XdIpN8OFkxs/6Vlt/GmT6sXGKjsn S06nSw6HXUMGDQx2aQAA1EkELpSQlJSkPXvTdPDQIVnNZp1zdhfdfvPNSoiPD3ZpAADUSQQulPDY Qw8EuwQAAELKKXWVIgAAQDAQuAAAAAxG4AIAADAYgQsAAMBgBC4AAACDEbgAAAAMRuACAAAwGIEL AADAYAQuAAAAgxG4AAAADEbgAgAAMBiBCwAAwGAh/eHVXo9HublOuV1OeT3eYJcDAACKsVgtstkd iohwyGK1Brscw4Rs4DqaeUSu3BzF1quvuAbxslptwS4JAAAU4/G45czO0uFDB2SPiFRMbL1gl2SI kAxchw8ekMViVfNWpwW7FAAAcAJWq03W+jbVqx+vA/vSdPjgAcU1SAh2WdUu5NZwHc08IovFqoTE pGCXAgAAKiAhMUkWi1VHM48Eu5RqF1KBy+vxyJWbQ9gCAKCOSkhMkis3R16PJ9ilVKuQCly5uU7F 1qsf7DIAAEAVxNarr9xcZ7DLqFYhFbjcLqccUdHBLgMAAFSBIypabheBq9byerxcjQgAQB1ntdpC 7nZOIRW4AAAAaiMCFwAAgMEIXAAAAAYLyRufAgBwqst15siZky2P2y2/318jY5pMJlltNjkioxTh iKyRMesKAhcAACHmaOZhedxuRUXHqEF8Q8lkqpmB/X65XLnKzjoqr9ejmNi4mhm3DuCUIgAAISTX mSOP2634hEayRzhqLmxJkskke4RD8QmN5HG7levMqbmxazkCFwAAIcSZk62o6JiaDVrFmUyKio6R Myc7eDXUMgQuAABCiMftlt0eEewyZLdHyON2B7uMWoPABQBACPH7/cGd3TrGZKqxxfp1AYELAADA YAQuAAAAgxG4AAAADEbgCrIZM2Zo4cKFwS4DAAAYiMAVZC+//LK+/fbbYJcBAAAMROAq1LNnT5lM pjK3I0eOBLtEAABQR/HRPoX+/e9/KzMzU5I0ffp0ffnll5o/f37g+aioqGCVBgAA6jhmuAp16dJF vXv3Vu/evdW0aVNFREQEfu7du7fMZrOefPJJderUSTExMYqJidG8efMkSa+++qqSkpJks9nUsmVL TZgwoUjf8+bNU7t27WS1WpWYmKg333yzyPP/+c9/FB8fL7vdrnPPPVebNm2qseMGAADGY4arAt59 9121aNFCL774ojwej9q1aydJ6tGjh+bOnauYmBitXr1ao0aN0tlnn60BAwbot99+0/Dhw/XEE09o wIAB2r9/v5o3b16k33bt2unee+9VXl6enn76aQ0YMEDbtm2T2cw/DwAAoYB39Arq1KmT+vTpU+Sx M888M/B9jx49lJKSorVr1wYCls/nU//+/dWtW7dS+/y///s/DRo0SJLUpEkTde3aVd9++626d+9u 3IEAAIAaQ+CqBitXrtTTTz+tTZs2yW636+jRo4H1YN26ddPAgQPVp08f3XDDDbr77ruLBLTi2rRp I0nat29fjdQOAMCZXcv3H/wfvvna4EpCF2u4qmjbtm0aOnSoOnXqpI8//lhLlixRs2bNAs+bzWat WLFCS5cu1a5du9SlSxdNmTKlzP7sdrskyev1Gl47AACoGcxwVdGGDRvk9Xo1fvx41a9fX5ICX4/X r18/9evXTyNGjNBzzz2n+++/v6ZLBQCgVMxcGY/AVUWdOnVSWFiYnnrqKQ0bNkwWiyVwOlEqmAFb vXq1OnfuLI/Ho82bN6thw4ZBrBgAANQ0TilWUbt27fTGG2/o448/Vq9evdSzZ0/l5OQE1mKlp6dr 8uTJ6tWrlwYPHiyfzxe4nQQAADg1mKqpj/DCzSLJKskuyVG4RUnq5szJnloNY51Q2u6dat2ug9HD AABQa6Xt3qmkZs1P3rAGVKWW37dsrpHjcERG3SdpvaRsSc7CzSXJI8krKb9w81dlHGa4AAAADEbg AgAAMBiBCwAAwGAELgAAAIMRuAAAAAxG4AIAADAYgQsAAMBgBC4AAEKIyWSS/FW6ZVT18PsLaoEk AhcAACHFarPJ5coNdhlyuXJltdmCXUatQeACACCEOCKjlJ11NLizXH6/srOOyhEZFbwaahkCFwAA ISTCESmrzaaMA+ly5TprNnj5/XLlOpVxIF1Wm00RjsiaG7uWMwe7AAAAUL1iYuOU68xRTnaWDh/M kL+GQpfJZJLVZlNkVDRhqxgCFwAAISjCEUnoqUU4pQgAAGAwAhcAAIDBCFwAAAAGI3ABAAAYjMAF AABgMAIXAACAwQhcAAAABiNwAQAAGIzABQAAYLCQu9P871s2B7sEAACAIkIucLVu1yHYJQAAgCoK tQkUTikCAAAYjMAFAABgMAIXAACAwQhcAAAABiNwAQAAGIzABQAAYDACFwAAgMEIXAAAAAYjcAEA ABgs5O40DwAApFxnjpw52fK43fL7/TUypslkktVmkyMyShGOyBoZs64gcAEAEGKOZh6Wx+1WVHSM GsQ3lEymmhnY75fLlavsrKPyej2KiY2rmXHrAE4pAgAQQnKdOfK43YpPaCR7hKPmwpYkmUyyRzgU n9BIHrdbuc6cmhu7liNwAQAQQpw52YqKjqnZoFWcyaSo6Bg5c7KDV0MtQ+ACACCEeNxu2e0RwS5D dnuEPG53sMuoNQhcAACEEL/fH9zZrWNMphpbrF8XELgAAAAMRuACAAAwGIELAADAYASuSvriiy80 efLkYJdRpoceekizZ882fJypU6fqww8/NHwcAADqMgJXJY0dO1YbNmwIdhllWrx4sbZv3274OJMn T9YPP/xg+DgAANRlBK5KyMjI0Keffqprr71WkjR8+HDZ7XaZTCY5HA61b99ed911l7Zu3RrkSgEA QG1A4KqEhQsXKioqSpdccokkac+ePTrnnHP0+eefa9myZbrvvvu0fv16de7cWcuWLQtytQAAINgI XJWQkpKiyy+/XFarNfBYfHy8evbsqb59++rOO+/UV199pZ49e+pvf/ubMjIyJBXcG2XatGlKTk6W 3W5X9+7d9c0330iSbr/9dp1++umB/nw+n+Li4vTSSy8FHpszZ47sdrtyc3N1zz336LTTTlNsbKzs drvOPfdcbdq0qcyaTzT2Ma+++qqSkpJks9nUsmVLTZgwocjz+fn5GjVqlBo2bKjY2Fj169dPWVlZ RdrMmzdP7dq1k9VqVWJiot58880KvroAAIQeAlcFpaWlae3atYHTiWUJDw/X5MmTlZmZqXfffVeS 9PTTT+vRRx/ViBEjtGTJErVu3Vo9e/bUli1b1LdvX23ZskWHDx+WJG3atElHjhzRV199Fehz3bp1 Ou+88xQREaHU1FR16NBB7733nubPny+v16sBAwYoLy+v1HpONPYxPXr00Ny5c7VmzRrddtttGjVq VJEF8Q8//LCmTJmihx56SCkpKTr33HPlcrkCz//2228aPny4hg0bprVr12rWrFnq0qVLxV9kAABC jDnYBdQ1b7/9tuLi4tS3b9+Ttu3YsaNsNpt+/vln5eTkaOLEiRo5cqQeeOABSVL//v21ceNGjRkz Ri+++KJMJpPWrFmjyy67TKmpqYqLi1Nqamqgv9TUVN12222Bn9u3bx+oo1mzZurevbu+/fZbde/e vUgdJxt7wYIFkqQzzzwzsE+PHj2UkpKitWvXasCAAcrJydGMGTM0duxYPfTQQ5KkAQMGaM6cOYF9 9u/fL5/Pp/79+6tbt24Vel0BAAhlzHAd55///KdiY2PVpUsXzZ49WwcPHtRjjz2mmTNnBtqkpKTo yiuvlNlcvqx67GMNNm/erJycHPXp0yfwnMlkUu/evbV+/XolJCSoa9euWrVqlSRp9erVGjlypNLT 07VlyxZt375d27Zt05AhQ0od57TTTpMk7du3r8RzJxv7mJUrV+qCCy5QgwYN1KRJE+3YsUOZmZmS Cmav3G63LrjggjKPtVu3bho4cKD69Omj22+/nasXAaCOOLNr93JtqDwCV6GvvvpK69ev186dOzV6 9Gg9++yzio+P19y5c3XxxRdLkrZv367169ef9HTiMT/++KM8Ho9OP/30QPAyFft8q+M/Z2ro0KFa vny53G63Pv30U1199dU6//zztXLlSi1fvlytWrVSp06dSh3LbrdLkrxeb4nnyjP2tm3bNHToUHXq 1Ekff/yxlixZombNmgWedxd+AGlp/R9jNpu1YsUKLV26VLt27VKXLl00ZcqUMtsDAHCq4JRioR49 eujrr79WeHi4rrjiCl1++eXasWOHmjRpElgcn5KSokaNGunCCy88aX95eXm6//77FRsbqyuvvFIR ERFyOBxavXq1zj//fEkFgWfNmjXq2rWrJOmaa67R448/rkmTJqlp06Zq0aKFBg0apPfffz/wfHmZ jvvQ0I4dO5507A0bNsjr9Wr8+PGqX7++JAW+SlKHDh0UERGhDz/8UL169Trh2P369VO/fv00YsQI Pffcc7r//vvLXTcAoOb98M3XwS4h5BG4jhMeHh743mQyqWXLlkWeT0lJ0dVXX12k3TEHDhzQZ599 Jo/Ho61bt2rOnDnavHmz3nnnHcXHx0uSRo4cqQkTJigqKkqdOnXS3LlztXXrVi1atEiS1KZNG3Xt 2lXjx4/XI488Ikm66qqrNHLkSPl8Pk2bNq3cx5KUlKTVq1dr+PDhatu27UnH7tSpk8LCwvTUU09p 2LBhslgsgdOJkhQVFaXRo0friSeekCRddNFF8ng8cjqdgTbbtm3T6tWr1blzZ3k8Hm3evFkNGzYs d80AAIQqAlc5/fLLL9q4caNmzJhR4rmmTZtqwYIFuuiii2S329W8eXP17dtXb7/9ttq0aRNo9/jj jysqKkqTJ0/W/v37ddZZZ2nt2rVq3759oM1tt92mO++8U9ddd50kqUWLFurWrZu8Xq86d+5c7nrH jh2rO+64Q7NmzdKkSZNOOna7du30xhtvaMKECXr55ZdlNpuVmJhYpP6RI0eqQYMGeu655/T8888r OjpaLVq0UIcOHSRJ6enpmjx5srZt26aIiAidc845mjdvXsVeaAAAQpDp5E3K1Ud44WaRZJVkl+Qo 3KIkdXPmZE+thrFOKG33TrVu18GQvp988knNnj1bu3fvLrEWCgCA2iJt904lNWse7DIkVa2W37ds rpHjcERG3SdpvaRsSc7CzSXJI8krKb9w85fVR3mwaL6c3n77bV1zzTWELQAAUGEErnL4/vvvtWXL lnJfnQgAAHA81nCVw1lnnVXkFgoAAAAVwQwXAACAwQhcAAAABiNwAQAAGIzABQAAYDACFwAAIcRk Mkm14UIvv59bKR2HwAUAQAix2mxyuXKDXYZcrlxZbbZgl1FrELgAAAghjsgoZWcdDe4sl9+v7Kyj ckRGBa+GWobABQBACIlwRMpqsynjQLpcuc6aDV5+v1y5TmUcSJfVZlOEI7Lmxq7luPEpAAAhJiY2 TrnOHOVkZ+nwwYwau3m3yWSS1WZTZFQ0YasYAhcAACEowhFJ6KlFOKUIAABgMAIXAACAwQhcAAAA BiNwAQAAGIzABQAAYDACFwAAgMEIXAAAAAYjcAEAABiMwAUAAGCwkLvT/O9bNge7BAAAgCJCLnC1 btch2CUAAIAqCrUJFE4pAgAAGIzABQAAYDACFwAAgMEIXAAAAAYjcAEAABiMwAUAAGAwAhcAAIDB CFwAAAAGI3ABAAAYjMAFAABgMAIXAACAwQhcAAAABiNwAQAAGIzABQAAYDACFwAAgMEIXAAA/H97 d68bx3XGcfhPirv8EPRlQRBcOU1cUIUrw7fgNpfgXIuRS7Dh3EScwkDaAAaMIE2MxC5ciGIgCwKo UJIpU+LukkyxnHA4IuVYnJcrUs8DDLgSiZmj7od3Do+gmOACACgmuAAAigku4Fz54MOP8sGHH816 GQC/iuACACgmuAAAigkuAIBiC7NeAMCrnLRfq/v33/79b2exHIDXYsIFAFDMhAt4o3UnV81ky0QL OE9MuAAAigkuAIBiggsAoJg9XMC5Yu8WcB6ZcAEAFBNcAADFBBcAQDHBBQBQTHABABQTXAAAxQQX AEAxwQUAUExwAQAUE1wAAMUEFwBAMcEFAFDsQgXXYDjIaLQz62UAAKcwGu1kMBzMehm9ulDBtbi0 ku1nW7NeBgBwCtvPtrK4tDLrZfTqQgXX8vJKnj7ZnPUyAIBTePpkM8vLguuNNRgOs7R8ORsPH8x6 KQDAa9h4+CBLy5czGA5nvZReXajgSpKr165nPB6JLgA4ZzYePsh4PMrVa9dnvZTeXbjgSpIbN29l b38/63d/yJPNRzbSA8AbajTayZPNR1m/+0P29vdz4+atWS+pxMKsF1Dl6rXrWV5eyfPn2/np6eOM R+NZLwkA6BgMB1lcWsmNd279WYIHAAAFrElEQVRduNeIbRc2uJLpnq7BcJhcwNEkAHB+XMhXigAA bxLBBQBQTHABABQTXAAAxQQXAEAxwQUAUExwAQAUE1wAAMUEFwBAMcEFAFBMcAEAFBNcAADFBBcA QDHBBQBQTHABABQTXAAAxQQXAEAxwQUAUExwAQAUE1wAAMUEFwBAMcEFAFBMcAEAFBNcAADFBBcA QDHBBQBQTHABABQTXAAAxQQXAEAxwQUAUExwAQAUE1wAAMUEFwBAMcEFAFBMcAEAFBNcAADFBBcA QDHBBQBQTHABABQTXAAAxQQXAEAxwQUAUExwAQAUE1wAAMUEFwBAMcEFAFBMcAEAFBNcAADFBBcA QDHBBQBQTHABABQTXAAAxQQXAEAxwQUAUExwAQAUE1wAAMUEFwBAMcEFAFBMcAEAFBNcAADFBBcA QDHBBQBQTHABABQTXAAAxQQXAEAxwQUAUExwAQAUE1wAAMUEFwBAMcEFAFBMcAEAFBNcAADFBBcA QDHBBQBQTHABABQTXAAAxQQXAEAxwQUAUExwAQAUE1wAAMUEFwBAMcEFAFBMcAEAFBNcAADFBBcA QDHBBQBQTHABABQTXAAAxQQXAEAxwQUAUExwAQAUE1wAAMUEFwBAMcEFAFBMcAEAFBNcAADFBBcA QDHBBQBQTHABABQTXAAAxQQXAEAxwQUAUExwAQAUE1wAAMUEFwBAMcEFAFBMcAEAFBNcAADFBBcA QDHBBQBQTHABABQTXAAAxQQXAEAxwQUAUExwAQAUE1wAAMUEFwBAMcEFAFBMcAEAFBNcAADFBBcA QDHBBQBQTHABABQTXAAAxQQXAEAxwQUAUOysgms02d1dO6NnAQD8ooM2GZ3Fs84quJ7fv3//H2f0 LACAX3TQJs/P4ll9Bdf+wbWXZDfJJMk402rcSbLxxRd//GdPzwIAOLWDNtnItFVGmbbLJNOW2cth 35zaXE/3mEtyKclCkkGSxSRLSZaTrCS5nOTO999/9/Fv3nvvdz08EwDgtd1bX//T6uqdvyT5LsnP SbYznXa9yDTA2vF16vDq+5Vid9LVXJMkP66u3vlm69nW1z0/EwDg/7b1bOvr1dU73yT5MYdR1Vy9 TrYafQTXfutrE1vN1cTWJMlPSe7evv3uV2v31r7s4bkAAL/K2r21L2/ffverJHczbZOmU5rYaq52 dJ06vi6d9gYtzavF+c51qfV5nGT7s88+f7z5+PG377//20dXrlxdnJ+fv9HjOgAA/meyu7u2/u/1 v3766R/+/Mknv/9XkrUkm5m+Omz2bx23h6sJr1PrYw9Xc592YA1yuJervZ9rqXW9k+RmkisHfx72 tBYAgMYo031ZW0n+k2lovWhd7X1bzd6tcXqOroXT3qBlv3XtZhpfkxydds21fnYjydODNSxkGmYA AH3ayeFrw2aStZOj0632ZKu9Sb63fVx9BldyuIdrLof7t5rp11znZ5rvL2Q6FdvteS0AAC/y8pFV 7ehqJlolrxIbfQXXfudzs9gmuF4VW01wTXpaCwBAYydHf4mvHV3N5+Z73Q3zvU25+p5wJUdfKyYv x1YTXOMcxpbgAgAqNMHVja72ZOu414m96nsPV2PvmO+1j41ov0psfotx3ONaAACS6QSrfT7oJEfj qx1bx024elE14UqOj67mH9xMtNrHRphwAQB9G+ewP7oHs+92vldy6GnS37EQx92zfS5X99iI7lld c6mJPwDg7TbJywezHxdZvR922lYRXO37znWu+RO+Nv8XIwBAn9r7srpxddIG+XMx4ere+6T4Oi7G AAD6dFxUvSqyeo+tpDa4us84KcC6nwEA+tKNqpMCqyS0GmcZOd1nzXU+Cy4AoG/dTfDdsCoNrcas I2fWzwcA3h5nElcAAAAAAAAAAAAAAAAAAAAAAAAAAAAAAAAAAAAAAAAAAAAAAAAAvL3+C1mF1q9m 3mAIAAAAAElFTkSuQmCC "
       id="image2626"
       x="106.32388"
       y="137.08629" />
    <image
       width="159.80833"
       height="159.80833"
       preserveAspectRatio="none"
       style="image-rendering:optimizeQuality"
       xlink:href="data:image/png;base64,iVBORw0KGgoAAAANSUhEUgAAAlwAAAJcCAYAAAAsHHqwAAAABHNCSVQICAgIfAhkiAAAABl0RVh0 U29mdHdhcmUAZ25vbWUtc2NyZWVuc2hvdO8Dvz4AAAAtdEVYdENyZWF0aW9uIFRpbWUAU3VuIDE3 IEphbiAyMDIxIDAxOjI5OjE1IFBNIEVTVJMUfOEAACAASURBVHic7N15XFTV/8fx18AAw+rCIiKu gBu4lLlUluaSllpm38osLdNsT8sWLTP3tCyrr+1+zTK1zFxKC39qapmlVgqoqLiLG4oLoOxzf38g I/smI4rvZ4/7SOaee7Z758yHc89cQERERERERERERERERERERERERERERERERERERERERERERERE RERERERERERERERERERERERERERERERERERERERERERERERERERErgWma7x8ERERuXYYFVXw5Qx4 8pZlyvNvBV8iIiJS3gxyB1p5g67LEoSZL0MZpiL+X9C/RURERMpLzoAr77/zprMbewZchQVYhW0O dqyLiIiIXJusXAy0CtryskvgZa9ZpcKCLIdC/m8CHO1UFxEREbl2ZXIxuLIW8v+8AVi5B132mOHK G2zlDK4cyAqsHPJsJjvVRURERK5tGVwMrnJumWTFHzmDLy7820Q5B13lHeQUFGzlDLIcc2zegA/g BbjaoS4iIiIiGUAykACcBOLJCrYcLvw/O/gCOwZd9prhyhtsOV4oywxUAer+s2njS8FBQR2dXFws jo6KteTy279nJ84uLhVdDSkDw2pQq079iq6GiFwlMjMzSE9NTdm9Z8+aVq3bTAUOAGfJCsYy8iTP GXSVm/Jcw5V3rVZ2sGXOsfkCTQ4f2jfTbHbyzMjIIDMzE8NqLSxPEbs5fGAvru7uFV0NKQNrphWf GjUruhoicpUwOTjg6OiI2WwmIyM9sVbt+o8B0cAJLgZdGVyc8cq7tuuS2eObgTkXwWcHXE5AdaDp 0cMH54HJMyU5mYz0dAVbIiIiYleG1UpGejopycmAyTMrFqEpWbGJE1mxSnbcYpdHVZXXvbyCvo3o wMWZLWegfuzBvTMz0tPNmZmZhWYkIlIShlFhD4wWkatYeloajo6O5tiDe2cG1mlwP3CO3LNZDlxc w5Xtkgec8p7hKuh2ohPgu3J5+CAweSjYEhERkYqUFYuYPLJiE3zJPcuV8wkK5aY8A66cM1x5byf6 hTQMuT0jPb0cixMREREpm4z0dEIahtwO+FH4bcVyC7rsPcPlSFYjqjo44FHOZYmIiIiU2YXYpCpZ sUp23HJFz3AVtIYr5zcU3ayZVv2tRBEREbliXIhN3LgYr2QHXHnjmktWHovmC3vYac6gy9Ew9G1E ESlPWjQvIpfmwpdvbLEK+f8KTs4Y55IGHXs8aT7nDNfFTWOjiJQnjSkiUj4c82x5g61yYa/HQuRb y6WxUUTKk8YUESknBa3dyrtdMY+FKGjtlhNZz99yufBvERERkSuNE1mxijP5Hw9RbjNd9njSvIiI iIjkcBn/arRuAIhIedKYIiJXj8sXcGlsFJHypDFFRK4il3GGS6Rye+v9jzBhYsSwpyu6KleMvzZt JvboUW69qS1+Pt4VWpcRb44neldMvteDG9Rn9CvDqVLFqwJqVbAv58wjMCCArrd1KDTNkp/DCQyo SauWLS5jzUSkrC7bGi5Dm7YrbLtUW6N3Mvqt9zh56hSGYXAw9ggHYg9jGAYnT51i9FvvsTV6ZzmU dPWa8c08fgpfSWJiUrnnXdrzXVCwBbB77z5eGzeJU2fOVPg1mb39telfjp84UWSaJUt/Yf+BgxVe V23arvbtctEMl0gZGYbBgUOxTHp3OjX8fDl/PhmAtz/8lONxJ4g/fSb7oXqllpKSws8rVrNpcyQn 4uNxdHTA19ubFqFNuOuO23FxcS7PplzzYo8cYeBTz+d7vXFIMJPHjS5VXqMnTiFy67Z8rz/z+GN0 7dSxjDUUkaudFs2LlFFYk0b4+foQd+Ik8afP2F7fvjNrJsXP14ewJo1KnW9CYhIT3/0vx+JO2F5L T4dDh49yJiGRPr3uuPTKVwr2H1N2xOwuQzkGTRs3pP8D9+V6tWZN/zLlVT5pRKSiaYZLpJRWr/uL 6J0xuFosxJ04idlspk+v7tzc+gYA1m38m0VLw4k7cZJZcxeQnJJCk0Yh3Na+XYnyn/3dDxyLO4HF YqHfvXfRLLQxFmcXDh87RkJiEo6OjgBYrVZ+XrGa1b//SUJSEjVr+NGzW2faXH9xTc/HM2dz4GAs CUlJpKam4VO9Gnd07ZSrLiXJ57tFP7FtRwzxp06TmpaKv58v4197iR9++oU//vqbs4mJOJvNBDWo x0P39SbAv0Z5dLVdvPXm6zRp3NCuZXh6eBRahmEYLF2+giVLf+FsQiL16tThiYEPExzUoND8rFYr 8xYsYvmqNaSnp9MwqAHnU1Lypfl2wWJ+W/8XZxMSCA6qz5BHHqZ2YC0A5n2/kPUb/+bkyXgAnnjs ETrechNrfl/P/EVLOB53Ak8Pdx7p15fbbr25nHpCpGx6P/gITRo3ZOQLz+HllbW+MiEpiben/Zet 23eweN5XFVzD0tO3FEVK6VhcHBv/3WK7XXhPz+706NrJtr/n7Vn//n7xUtb88Scmk4lq1aqUKO9z 55PZtDkyK98e3ehw88XAKKRB/Vxpv134I8t//Q2z2UyVKp4cjD3MRzO+wvLM4zQPbQLAvxFRpKdn 4ObmiouLM8dPnGTW3PnUqRVAUP06Jc5nxZrfSU/PwGJxxmKxYHY0YzKZSE5OJi0jHe/q1Th95ixb o3fyycxvGP/a8LJ0bemUcUxp0qghvR98pNTHLZ5bwgHeyAqqrJm5/36sg0PWktkFi3/i+0U/8tD9 91InMJBff1/HiDET+WDKBGrVrJkrn+w2zprzHeErf+XB/9xDndq12Bmzh207duZK890Pi/m/X1fz 2MP98PP15tsfFjN+ynt8/N4UzGYz6zf+jZ+vD0MeeZj0jAxqBdTk6NE4Pvz0C+6/525atWzG2bOJ +Pr6aLyWClc7sBbRO3bxxoQpjH/9VUwmE29Oept9Bw4SGBBwVV6jmuESKaUH+9xFm+taMuHdD7Fa rbRvc0O+NO3b3MD3i5fi4ODAqOHP24Kb4hw9ftwWyIXmmSHZs+8AmZlWAvz9yLRa+b/Vv2MymZjw 2nBq+tdg9e/rmTVvAf+3+ndboJTtpWeG0KBeHd6a9jE7d+9h47+bCapfh7MJiaXK55XnniKofl3S 0zMAeOi+e3jovns4m5hIUtJ5Rr/1LgdjD5OUdA4PD/cS92lls/GfzfR5eKDtZ/8aNfh02tukpKby w5Kl3Ht3L+7ukXVruGXzMJ4/+DrfLljE8Ofyf8M1JTWVX1as4sH/9OGenncC0KpFC1at/s2WJjkl hYU//cxTgx7l1ptvBODZIYMZ/NwL7Ni1m7CmjQGoVzuQZqFNbcft2BWD1WqlZfMwQoKCyr0fRMpq zIiXGDXhLQ4ciuWNiVMwmUzsP3gIPx8fRo+4DL/Q2YECLpErSFGL7N+Z/jnJyck8/Vh/XFxcbGlH jJuSK93xHGu/cjKZTAQH1WPn7j2curDmbN+BQ6XOB8DJKWvo+PGXFYSvXENyamqu/Ynnru2AK6xJ Yx59uK/tZ2dz1l83iz18mJTU1FyBrMlkolmTxvwbEVVgXkePHyc9PZ3QxoWvB4w9fJj09HQ+nvEl n/xvVq59x0+eIIzGBR7XMDiIVi2bM3rCZDq0v4k7u3Whfp2S/XIgYk/e1aszYdRIW9AF4OvjzbhR r+Ln41PBtSubyxZwGVfj/J9IAeYt/JHlq9baApV1G/+23UbM9seGTUDWuprxUz+gW+cOPNjnrmLz 9vf1xWQyYRgG23fGULtWzQLTmc1Z67hMJhO9unXJtc/NzbXQ/J3MWW/5jMzMS8oH4J+IrSxathyL xUL/B+7FzdWFmXO+Jz09Hcr47czSKOuYcjmOc3N3Jah+vXzHW7P7xWTkyu/iV9SNXK8YGFn9CWRk ZhRwTNZ/jk5ZAd0zjw8kOCj3refqVavajstdBpgcTIx65UW2RG1jybJfeHHkaB596AHuurN7idsq Yi+OjmacnS5+I9vJ7ISTk9NVG09ohkuklPz9/GhzfUtcLRbW/PEni5aGA9huLa7b+DeLli0HoOPN N5KckoK/n1+J8vb09CCsSSOitu9g4dJwPD3duS6sKa6uuYOfWgH+ODg4YLVa8fT0oGvH9phMJs6e TcDZ4lLitlxKPifjTwFQNzCALh2yFll//d0iW4AAWQNmenoGJ0+dIqh+3RLXq7KqHVgLFxdnIrdG 07hh1i1jwzDYGr2D4Bxr9Eymi7OdtWvVwtnZmX+3RNK0kIX4NWv44eTkxKEjR+l4S+kXvLdsFkrL ZqHM+HoOi5f+ooBLKtzpM2cZPXEKsYePZK3ZIuvxLW9OfJtxo16lWtWSrYu9kijgEiml29q347b2 7bJmoXbFEHfiJN8vXsr3i5fmSufn68Oj/f6DyVS6PzQ/oO+9TJj6IWcTEvnsyzkAtqAoW7UqVeh0 y42sXPsHc75fxIIfl2F2dOTc+WSG51jsXpxLySd7XdrO3XsZNfEdqnh5kpLnm3N1Amuya/c+Pps1 F2dnZ65rFlqqvqhsLC4u3HtXTxYs/gmLxSVr0fxv6zh67DivDHvGlq561WpEbttOp2PHqelfg/v7 3MXc+QsBCAttQmZGBmnpqbnyvfvObixeFo6jgwNNGzUkJTWFc+dT6NyhfaH1OR4XR8S27dSrXYeM jAxiY49QxevKeeK+XLvGv/2eLdgaN+pVAEZPmELskSOMn/Iu7701roJrWHr6lqJIGW2N3knciZN4 V6tKDT9f2/O3mjYK4XjcCeJOnGRr9E6aNS14/Uxh/Hy8Gf/aS/y0fBURW7cTf+o0AFWrelGnVi0C avoDWQvW/f18WbFmHSdPncZqNahTKyDXFHxJlDWf4Pr1eOyh+/ll1VqOxZ3gyLE4vLw8qeVfA7cL M3ID+93P7O8WErN3P9XL+zfSso4pl+O4Ih5h/Z+7e2GxWFiyLOuxEPXr1uGtN18nsObFb171/c89 fDJjFit+XcuAB+/n3l498XT3YPGyn1m87BfcLBZ8fX0JDAy0HdPvvnvx9PRkWfgKFv64DC8PD1q3 uo7Ot+YIuPLU68yZBH5cupxjcXE4OzsT3KAeQ58aovFaKty+/QeoX68ub7zyItWqZI0d40a9yvgp 77LvwMGr8hot3a/ehefheGFzApwBC+B2YfMA2uzZuX1aOZQlUm6OHzmEq3vZF3Zvjd7J/MXLeP6J R/GuVo2nXx4FwMfvTCD+9Gk+/GwW9/fuUaaHn0rRrJlWqlYv3cLZx54ZxukzZ4pPWADv6tWY8V8N YSKVUVCjpi8AG4Ek4PyFLQVIA9KBzAvbJYV5etK8SBmFNWmUK5iqG1gLk8mEyWTCp3p1xo18sQJr dy0o3Zjy/BOD+e/n/+PU6dOlOq5a1ao8O2RQqcsTEclJa7hEysmIYfmfoSRXjpbNQ/nf9Pcquhoi co26jI+FEBEpPxpTRORq4lDRFRARERGp7PQtRRG5OmlMEZGriBbNi8hVSmOKiFw9dEtRRERExM4U cImIiIjYmb6lKCJXJY0pInI10aJ5Ebk6aUwRkauIFs2LyFVKY4qIXD20hktERETEzhRwiYiIiNiZ Ai4RERERO1PAJSIiImJnl++xEIYWuIpI+dGYIiJXE81wiYiIiNiZAi4RERERO7tstxQPH9x3uYoS KbHU1JSKroKUUcLZ0xVdBRGRErtsAVfbWzpfrqJERERErii6pSgiIiJiZwq4REREROxMAZeIiIiI nSngEhEREbEzBVwiIiIidqaAS0RERMTOFHCJiIiI2JkCLhERERE7U8AlIiIiYmcKuERERETsTAGX iIiIiJ0p4BIRERGxMwVcIiIiInamgEtERETEzhRwiYiIiNiZAi4RERERO1PAJSIiImJnCrhERERE 7EwBl4iIiIidKeASERERsTNzRVegvJ08Gc+MWV+xYdPfnDh5Eg8PD1o0C+OJQQNpUL8+ycnJdL6z F1arle/nfEPtwICKrrKIiIhUcpVqhis9PZ3nhr/M4p+WcvTYMaxWK2fOnGHt7+swmUwAGIYJq9Va wTUVERGRa0mlmuHaHr2Tffv3A/DfaVNpff31nDlzhq3bt1O/Xr186e976GEAmjcL4/PpH2IYBouW /MTc+fM5HneCAH9/Bj7yMN27drUdM/2Tz9j4z78cP36c5JQU6tQOZPb/vuCzGTP5efn/cer0aVyc nAgLC2XYc89Qv25dAKxWKwuX/MR3CxZw9NhxLBYLATVr0qN7Nx74Tx9bmtnzvmXxj0s5feYMdWrX 5pGH+tH5tg727TgRERGxq0o1w+Xr623796ZN/3Du3DmqVq1K+5tuKjB9rYAA6tauTc0aNQD4/H9f 8va094k9fARnJycOHDrEmAlv8d2ChbZj5i9cxK6YGNIz0nBzc8PJ7ITJZCLpXBKpaWn41/Ajw2pl w6a/GT1uou24Dz/+hKnvf8DhI0epW6c2Tk5mdsXE8M/mzbnSfPL5DE7Gx1O1ahVidu/m9TFj+XPD hvLuKhEREbmMKlXAFVCzJv0f7AvA13PncUfve3lj3Hh2xcQUmP79d97mu2++YuwbrxMfH8/sed8C MPaN11n1y1KGPvM0AJ/P+B+pqam5jv1w6lTClyzks+kfAPDCc8/y86IFfPLh+8z89GMcHR2J2b2b s2fPEnfiBPN/WATAxDFvMufL/3Hv3Xfnyi/+1Cnm/7AIBwcHZs/8gsXfzeOVF4YC8G2OgE9ERESu PpXqliLAM08O4dZbbmbJj8tYvXYtK1atZtXqtYx5/TVu79Kp0OOid+4kIyMDd1dXunXpDEDvXj34 4KOPOZeczN59+2jSuHG+45ydnQH4cvY3zPt2PueSk3PtP5OQwMGDh7Barbi7unJbh1sKLH/Hjp22 tWV9+z+aa19s7OESt19ERESuPJUu4AJoFhpKs9BQXhj2HKPHTeCP9X/y5dezub1LJxxyzekZJc/0 wqL7gqz9fR0zvvwKdzc3Xho2FA8PN9565z1SU1MxDANnJ6di8zBfSOPg4MAjD/XLtc/D06Pk9RQR EZErTqW6pQiwNDyc43FxADibzVSvWhWA8xdmniwWCxaLBYCY3XsAyMjIoEnjxpjNZs4lJ7N85SoA Fv+0DAA3N4tt8XtBjh47DkBISBD/ueduunftitl8MZatV68uJpOJc+fPszQ8nJSUFOJOnsyVR4P6 9XBwcMBqtVK1alWGDBrIE4Mf4z/33E3vu3pdareIiIhIBapUM1y7YmKY8NbbQNZMkWEYGEbWLFaH W9vb0rVtfQNrf1/HG+PG8/706ri4OPH9nG946IH7+WrOXN4cP5G3353GufPnARj06KO2IK0goU2z bjVuiYjioYGD8KleneQctxZr+PlxZ7fbWRa+nAlvvW2rY06+Pj70ubsXCxYtYdp/p/PpjP9hNjuS mJjEtLff4sa2bS+9g0RERKRCVKqAy9XVje5duxIRFUX8qVM4OTpSw9+f27t04uG+D9jSvfLCUDIy M/n7n39JTErCx6cemZmZPPn4IKpVq8a3CxZw8mQ8gbUCGNDvQe7q2aPIcpuFhvLay8OZ+933HIo9 zIGDh6hWrRoN6tbF090dgNdffZngoCD+3ryZjPR0zp0/z9Zt23F3c7Pl8+Lzz1EnsDbfL1rE0WPH sVqthAQF4eJSeLAnIiIiV77CFxWVLg/HC5sT4AxYALcLmwfQ5vy5pGnlUNZV69ix4/j4eGM2m0lN S2PYS6+wOSKSIY89ymOPDKjo6omIiFyT3Nw9XgA2AknA+QtbCpAGpAOZF7ZSLPzOr1LNcF3JJkx5 m8it26hapQpJ5xI5fz4FNzcLvXrcWdFVExERETtTwHWZBAQEEHv4CPGnTuFsNnPD9dfx+MCB+Pr4 VHTVRERExM4UcF0mr708vKKrICIiIhWk0j0WQkRERORKo4BLRERExM4UcImIiIjYmQIuERERETtT wCUiIiJiZwq4REREROxMAZeIiIiInSngEhEREbEzBVwiIiIidqaAS0RERMTOFHCJiIiI2JkCLhER ERE7q9R/vDo2Ppno2PPEnk4nIcXAMCq6RiIiIpLNZAIvi4nAak40CXQj0Nu1oqtkN5U24FoREU/0 sXRc3dxxcvWkuocDYKroaomIiIiNQWamlf0JqUT/fZYm/ufp2sK7oitlF5Uy4PphwwmOJzlQtboP LetYCPI14+PhWNHVEhERkTxOJmWy50QGWw66EnPyLAkbTnBvW9+Krla5q3QB14qIeI4nORDoV5XO oe4KtERERK5gPh6O+Hg4EuRrZtU2E7FxZ1gREV/pZroq1aL52Phkoo+l4+FVRcGWiIjIVcTHw5HO oe54eFUh+lg6sfHJFV2lclWpAq7o2PO4urnTso5FwZaIiMhVxsfDkZZ1LLi6uRMde76iq1OuKlXA FXs6HSdnF4J8K92dUhERkWtCkK8ZJ2cXYk+nV3RVylWlCrgSUgwcHR00uyUiInKV8vFwxNHRgYSU yvUsp0oVcGU9Z0uPfhAREbm6mSrdszMrVcAlIiIiciVSwCUiIiJiZwq4REREROxMAZeIiIiInSng EhEREbEzBVwiIiIidqaAS0RERMTOFHCJiIiI2JkCLhERERE7U8AlIiIiYmcKuERERETsTAGXiMhl 8OeffxIVFWW3/JcsWcIff/xht/yvNUuXLmXjxo0VXQ2pRBRwXeFuuOEGRowYUdHVEJFLtG7dOg4e PGi3/Hft2sWZM2fslv+1Jioqivj4+Aop+/3332fZsmUVUrbYj7miK3Al6dKlCx4eHixevPiyl+3j 48OIESN46aWXcr3euHFjateufdnrIyJyuaWlpbF69Wq2bNnCqVOncHJyokaNGrRr147WrVtXdPVK 7Ntvv2XLli1kZGTg5ORE1apVCQkJ4dZbb8XHx6fY4/38/KhateplqGnZvfTSS3h7e/Pss8/i6elZ 0dW5KijgusJ98803FV0FERG7S01N5aOPPuL48ePccsst1KtXj9TUVI4dO0ZycnJFV69Uzp49S2Bg ID169CAjI4OTJ0+yYcMGpk6dyoABA2jatGmRx/fr1+8y1bTsqlevTnx8PJ988glPPfWUgq4SUMBV QoZh8OGHH/Luu+8SFxdHixYtmD59er7fuj766CPeeecdjh49SmBgIN988w033ngjn332GWPHjiU+ Pp6AgAAGDx7M66+/nuvYl19+mZdffhmAefPm0bdvX8LCwujZsyeTJ08ucT2ee+45li9fzvHjx0lN TeW6665jxowZhIaG2rmXRKQoMTExvPPOO8THx+Pt7U3v3r0JCQmx7f/zzz9ZsWIF586dw8vLi7Zt 29KlS5dcefzxxx+sWbOGhIQEqlSpwkMPPUTdunVzpckOXry8vHjsscdwcHBg9OjRdOrUiY4dOwJZ QcH48eN56qmnCAoKYsmSJezYsYOEhASsViv16tXj7rvvxt/fv8C2GIbBunXrWLt2LUlJSdSsWZM+ ffrkmpFftGgRO3fuJDExkczMTGrVqsV9991XYJ7h4eEcPXqUZ599Nl97SltuSdIA/PXXX/z666+c PXsWd3d32zmpVatWvnKtViv/93//x+bNm0lKSqJ27dr07t270P5xd3enfv36AISEhNC2bVu++OIL 5s6dy8iRI3F3d2f58uVERkbabgX36dOHVq1a8c4779C0aVN69OjB/PnzOXjwYK67H+vXr2fZsmWM GzcOk8lUqnqVl+eff55PP/2UY8eO8cknn/D000/j4eFh1zKvdlrDVUKTJk1ixIgRDB06lCVLlhAU FET79u3ZuXOnLc2UKVN46aWXGDJkCOHh4YwdO5YGDRoA0K5dO2bNmsXatWsZPHgwo0aN4pdffslV xvDhw4mKiiIqKoo77rijzPVYvXo1TZs2ZeHChcyZM4f09HTuuOMOMjIy7NAzIlJSKSkpdOjQgQED BuDv78/nn3/O4cOHbfvr1q1L3759efrpp2nbti3h4eHs2LHDtn/16tX89NNPtGvXjscff5xu3bpR vXr1XGVYrVa+/vprHBwc6N+/Pw4OJRvmd+3aha+vL4888gh9+/bFMAw++OADTp06VWD6VatWsWzZ Mm655RYGDhyIj48P06dP58SJE7Y0u3fvpkaNGjz66KP069ePzMxMZsyYgdVqzVfnv//+m5YtWxYZ bJW03JKkWb16NQsXLuSGG25g8ODB9OjRg3379nH69OkCy12xYgV//fUX3bt35/HHH8fBwYH//e9/ ZGZmFtu3AA4ODtx1112kpKQQGRkJQGRkJNWrV2fgwIH079/fFqDlFBYWxrFjx0hKSrK9FhMTQ5Mm TXB0dLzkepWVh4cHTz75JDVr1iQuLo5PP/2UxMREu5Z5tVPAVQLnzp3jrbfeYuTIkQwfPpxu3box Z84cQkJCGDNmDJD1G+WECRMYOXIkr732GrfddhsPP/wwNWrUAKBFixbcfvvttGvXjtdff52wsDDW rVuXqxx/f3/CwsIICwujSpUqZapHtsaNG9O5c2fuvfdePv74Yw4dOsQ///xjl/4RkZJp1qwZbdq0 oWnTpvTv3x8/Pz/Wrl1r2x8QEEDDhg2pW7cuXbp0wd/fn3379gGQkZHBihUr6Ny5M507dyY4OJhW rVrlupVjGAbffvstp06dYvDgwbi4uJSqfjVq1KBhw4a0aNGCxx9/HE9PT5YvX54vXVpaGr/++iud O3emQ4cONGrUiH79+uHj45MvvZ+fHyEhITRv3pw+ffpw5swZYmNjc6VJSEggOTm52PWqJSm3JGky MzNZuXIlHTt25PbbbyckJKTI23ypqamsXr2anj17ct1111GvXj3uv/9+Tp8+zf79+0vStUBW/5rN ZuLi4myv+fv7ExwcTOPGjfMFzwANGzbE2dmZ6OhoW9137dpFWFhYudWrrDw8PHjiiSeoWbOmbaZL QVfhdEuxBLZv3865c+fo1KmT7TWTyUTHjh1ts1QxMTEkJSXlSpNTeHg4kyZNYtu2bVgsFhISEjh7 9my516MgDRs2BODYsWOlKk9E7KtBELRA5AAAIABJREFUgwa5Phh37NjBqlWrOH78OGazmZSUFFJS UgA4efIkaWlpBAcHF5rfX3/9RUpKCi+++OIl395xdHQkJCSEvXv35tt3/PjxfHUxmUwEBwfbAoOC +Pr6AuT7UDYMw1ZmXitXriQqKooXXnihROWWJM3JkydJTU2lcePGxfZDdp4ZGRl8//33LFiwINe+ U6dOERQUVKJ8cra1pMxmM40aNWLr1q20bt2amJgYMjIyaNy4cbnWq6yygy7dXiyeAq4SyH6DmEym Al8HbFPkedMA7N27l7vuuovBgwczbdo0DMNgwIABudIUdFxZ6lEQi8UCQHp6erFliMjlY7Vabbf6 4+Pj+fLLL2nbti133303hmEwb948W9rC3v85BQUFceTIEebPn89TTz2Va4bL0dGx1GOAg4MDTk5O +V4v61iUnVfe211eXl44OTlx5MiRfMekpqbabqeVpNySpMkOYkt6u9VszvqovO+++6hTp06+upfU sWPHyMzMxM/Pr8THQNYdkm+//Zbk5GQiIiJo2LAhFoul3Op1qXLeIi4oaJYsuqVYAqGhobi5ubFq 1Srba4ZhsHbtWtti9eDgYCwWS6402TZv3kx6ejoTJkygVatW3HDDDfmmjqtUqVLsM3RKUg8RuTpk Zmaye/du2wfl4cOHyczMpHv37gQGBlK7dm3c3Nxs6X18fDCbzcTExBSap5+fH08//TSJiYnMnj07 V5Dh5eWV61ZWSezdu7fAxdf+/v44OTnlqothGOzZsyffB39JODo60qxZM/755x+OHz9eaLqSlFuS NH5+fphMJtvt2oLkDNiy+z4uLg4/P79cW/YvtMWxWq38+OOPWCwWmjdvXqJjsoWFheHk5MTff/9N VFQUbdq0Kbd6XaqEhATb7FbNmjV54oknNLtVCM1w5XHixAlWrlyZ67XQ0FBGjhzJxIkT8fDwICws jFmzZhETE2ObxnVzc2P48OFMmjQJwzC48cYbSUxMpEGDBoSFheHg4MDYsWPp168fTk5O+W4ntm7d mtmzZ9OmTRvS0tIICAjgpptuypXG3d292HqIyJUrLi6O3bt3k5KSwh9//EFCQgK33347ADVr1rR9 4+z666/H0dHRNhMDWbNDHTp0YNWqVRiGQb169UhJScHb2zvXt+qqVavGo48+ykcffcSqVats33Js 2bIl4eHhBAQEEBgYWOCShqioKHx9ffH09OTff/8lLi6uwEcUODs707lzZ1auXImzszM1a9Zk06ZN nDx5kkceeaRMfdOzZ0/27t3Lhx9+SKdOnahduzaZmZkcPXq0VOWWJI2rqys33ngjK1euxGKx4Ovr m+vLCZAVoMbExNC6dWt8fHzo0KEDa9aswcHBgQYNGpCamkpKSkqhv+yeO3eOPXv2kJmZyYkTJ9i4 cSPHjx9nwIABuLu7l6pvzGYzrVq14ueff8ZisdjWmzk7O5e6XuUpKSmJTz/9lLi4OPz9/RVsFUMB Vx7r16+na9euuV778ssvef311/Hw8LA9jqFly5asW7cu1xqA8ePHU716dT788EPGjx+Pn58f7777 Lg8++CBfffUVEydO5JNPPsFsNtsWSmabPHkyAwcOpF+/flSpUoU33ngjX8AFlKgeInLlCQkJITo6 mpkzZ9oCpqFDh+Lt7Q1krW/q27cvq1at4s8//8TBwQFPT0/bfoDu3bvj5ubGunXrWLFiBZ6envTq 1SvfYwxq165Nt27dCA8Pp1mzZtSoUYMOHTpw/vx5Vq9eTWpqKm5ubtSvXz/XonsXFxfWrFnDqVOn 8Pb2ZsiQIQU+IgGgc+fOODs72x69EBAQwLPPPlvq22XZvLy8GDZsmO1bd8uXL8dsNlO1alXCwsJK VW5J0vTq1Quz2cyKFStIT08nMDAQuHhLrFu3bixYsIANGzbQo0cPunfvjru7O7///jurV6/Gzc2N 0NDQAgObKlWqsHnzZtt4X61aNUJCQujfv3+JHnxakJtvvpl169bRsWPHXLftSlOv8pQz2NLMVskU v3CoZHk4XticAGfAArhd2DyANufPJU0rh7KK9P4vR/H29WPIrZfv3rWISGWQ89lP16Jjx44xdepU Xn75Zdu3y6Vwb731FvHx8XYLtj7/LYH4E3EMu6NmueZbEDd3jxeAjUAScP7ClgKkAelA5oWtdN94 yEMzXCIics2JiIgAsmajzp07x6pVq6hVq5btm5RStPj4eKpXr66ZrVJQwCUiItecQ4cO2Z7O7uHh QYMGDejRo0eJv7l4rZs6dWpFV+Gqo4BLRERsf1bsWtGzZ0969uxZ0dWQa4hCeRERERE7U8AlIiIi YmcKuERERETsTAGXiIiIiJ0p4BIRERGxMwVcIiIiInamgEtERETEzhRwiYiIiNiZAi4RERERO1PA JSIiImJnCrhERERE7EwBl4iIiIidKeASERERsTMFXCIiIiJ2poBLRERExM4UcImIiIjYmQIuERER ETszV3QF7OHz3xIqugoiIiIiNprhEhEREbGzSjXDdX9YGhBb0dUQERGRS1WjoitQvipVwAUQ1Khp RVdBRERELtGendsrugrlSrcURUREROxMAZeIiIiInSngEhEREbEzBVwiIiIidqaAS0RERMTOFHCJ iIiI2JkCLhERERE7U8AlIiIiYmcKuERERETsTAGXiIiIiJ0p4BIRERGxMwVcIiIiInamgEtERETE zhRwiYiIiNiZAi4RERERO1PAJSIiImJnCrhERERE7EwBl4iIiIidKeC6xg0bNozp06dXdDVEREQq NXNFV0Aq1sqVK7FYLBVdDRERkUpNM1w5dOnShd69e+d6bebMmTg5ObFw4cIKqdOgQYPw9PTEZDLh 7u5OgwYNGDx4MLt3766Q+oiIXEu6dOmCyWTKt82YMaOiqyZXGc1wFWHevHk8+eSTzJw5kz59+lRI HQ4cOECrVq2YPHkyKSkp7Nixg8mTJxMeHs6ePXtwcXGpkHqJiFwrbrnlFiZNmpTrtZCQkAqqjVyt NMNViHnz5vHII4/w2Wef0b9/f9vrmZmZvPHGGwQHB1OlShU6d+7Mtm3bSrx/2LBhNG7cGC8vL9zc 3OjatStbt24tsi4+Pj60a9eOjh078uSTTzJhwgQOHz7MgQMHAPjss88ICAjAxcWF+vXrM3HixHx5 fPTRR9SrVw8XFxeCgoL4888/86VJTEykZcuW3HnnnWRmZtrKnjp1qi1NbGwsJpOJNWvWlLg9s2fP plGjRjg7O+Pv78/XX39dZHtFRK4k1atXp3379rm2GjVqAGAYBh988AF16tTBYrHQtm1bNm3alOv4 N998k7CwMLy8vPDy8mL27NlA0Z8XgwYNolmzZrny+fjjj6lSpQppaWnFftYUVqZUHAVcBZg9ezaP PvooM2bMYODAgbn2jRs3ji+++IJx48bx888/4+joSM+ePUlLSyvR/pUrV9KwYUN++OEHvvrqKzIz M2nTpg379u0rtl5Wq5U9e/Ywe/ZsGjRoQL169QBo164ds2bNYu3atQwePJhRo0bxyy+/2I6bMmUK L730EkOGDCE8PJyxY8fSoEGDXHlnZGRw3333YTabmT9/Po6OjiXqq+Las3v3bh599FH69evHunXr mDFjBtddd12J8hYRuRIYhkFGRoZty/6FFGDSpEmMGDGCoUOHsmTJEoKCgmjfvj07d+60pfnhhx+o V68eixcvZv78+bRv3x4o+vOid+/ebNu2jbi4OFs+q1at4o477sDZ2bnYz5rCyrwUY8aMKfD2akHb uHHjLrk8yc9E1q1JF8ADqA4EAMFAc+AmYNj5c0mGvbfdO7YZl6Jz586Gr6+vYTKZjMmTJ+fbn5CQ YLi4uBizZs2yvXbw4EEDMFavXl3sfsMwjNDQUOPVV1+17U9NTTUaNGhgDBgwoNA6mUwmw9HR0TCZ TAZgWCwWY/ny5YW2IywszHjttdcMwzCMlJQUw8PDwxg7dmyBaUNDQ42XX37ZeOihh4yGDRsacXFx ufZ7e3sb77zzju3nQ4cOlao9f/zxhwEY69evL7S+IiJXqs6dOxtAri0oKMgwDMNISkoy3N3dc42v VqvVCA0NNfr27Wt7Le84aRjFf54kJycb7u7uxpdffmkYRtbY6unpacybN69MnzXl5c0338zXH3m3 wj5vSmv3jm12jxvOn0sygGEXYpXmF2KXgAuxjMeF2MZ8Ida5JJrhyqN27dq0bNmSt99+m9WrV+fa Fx0dTWpqKkOGDMFisWCxWGz38ffv31/s/oI4OzvTuXNn/vrrr0Lr1KVLF7Zs2cKWLVtYvnw5vXv3 plevXvz2228AhIeHc+utt+Lt7U2tWrXYv38/Z8+eBSAmJoakpCQ6depUaP6ff/45c+fOZf78+fj6 +pa4r0rSnjZt2nDnnXfSqVMnHn/8cSIiIi4pfxGRy61Dhw5s2rTJti1evBiA7du3c+7cuVzjq8lk omPHjmzcuLHIPIv7vLBYLHTr1s1W1q+//kpqaip33nlnmT5rysuYMWN48803i9w/evRou9bhaqVF 83nUrl2b+fPnM2jQIO644w4WLVrEHXfcAWBboP7FF1/Qpk2bXMfVrFnTdqEXtr8wjo6OuLq6Frrf y8uLsLAwAJo3b87tt99O3bp1mTlzJoGBgdx1110MHjyYadOmYRgGAwYMsB1rtVqBrEGgMB06dCAy MpJBgwaxevVqPD09bfucnJxITk4u9Nji2mM2m1m2bBkrVqxg6tSpXHfddUydOpUXX3yxVHmKiFSU qlWrcsMNN+R73TAMIP/4mv16UYr7PAG47777ePTRRzlz5gzz58+na9eueHl5lehYexozZgwAY8eO zfd6UcHYtU4BVwGcnZ35+uuv8fT05J577mHFihXccsstBAcH4+LiQnR0dK6gJltx+wvz+++/07Jl yxKnT01NJT09HUdHRzZv3kx6ejoTJkygevXqALb/Z9fJYrGwatUqbr755gLza9KkCR9++CHt27fn gQceYOnSpTg4ZE1+BgQEEB0dXeK6Fdaerl270rVrV4YOHco777yjgEtErnqhoaG4ubnlGl8Nw2Dt 2rW0bt26yGNL8nnRu3dv3Nzc+Oqrr1i4cCEzZ84s8bH2NmbMGFxdXRkxYoTtZwVbRVPAVQiTycT0 6dM5fvw4vXv3ZsOGDQQHBzN8+HCmTp2K2WzmlltuISkpibNnzzJw4EDc3d2L3J9t4cKFhISE4O/v z5w5c4iOji7ym3snTpxg3bp1pKWlsX//fj777DPi4uJ45JFHqFGjBg4ODowdO5Z+/frh5ORku50I 4ObmxvDhw5k0aRKGYXDjjTeSmJhIgwYNci1er1u3LosWLbJ9/XnUqFEA3H///YwePZopU6Zwww03 EBsbm69+RbVn7969rFq1iubNm5OWlsb27dvx8/O75PMjIlLR3N3dGTlyJBMnTsTDw4OwsDBmzZpF TEwMCxYsKPbY4j4vLBYL/fv357XXXsPLy4tevXqV+NjL4dVXX7XdAVGwdXlUqkXzd999d67XEhIS jJCQEKNdu3ZGRkaGYbVajffee8+oV6+e4eTkZPj7+xtDhgyxpS9uf2hoqHH99dcbTZo0MVxcXIym TZsaK1asKLROjz32mOHh4WEAhtlsNmrWrGncddddxtq1a21pZs+ebTRu3NhwcnIyXF1djfr16xvT pk3LVad3333XqFu3ruHo6GjUrFnTmDt3rq0+ORdWTp482XBycjK2bcvqy/T0dOOVV14xvL29DWdn Z8Pf399o3769ER0dXaL2rF+/3mjUqJHh5ORkeHl5GZ06dTIiIiJKdV5ERCpKQZ8LOVmtVmPatGlG YGCg4ezsbLRp08bYuHFjrjSFLWAv7vPCMAxjx44dhslkMkaPHl2qY+21aP5yqmyL5i85gwt5OF7Y nABnwAK4Xdg8gDbnzyVNK4eyinTk0AGCGjW1dzGXJCwsjJ49ezJ58uSKrkq5qGztERGRK8OendsJ qF3X7uW4uXu8AGwEkoDzF7YUIA1IBzIvbMUvziuCvqUoIiIiYmcKuERERETsTIvmL7Pi/ozP1aay tUdERMQeNMMlIiIiYmcKuERERETsTAGXiIiIiJ0p4BIRERGxMwVcIiIiInamgEtERETEzhRwiYiI iNiZAi4RERERO1PAJSIiImJnCrhERERE7EwBl4iIiIidKeASERERsTMFXCIiIiJ2VqkCLidnJ9LS Uiu6GiIiInIJ0tJScXJ2quhqlKtKFXC5WNw4n5RY0dUQERGRS3A+KREXi1tFV6NcVaqAy9XVjbNn TlV0NUREROQSnD1zCldXBVxXLCdnZyyu7pw4dqSiqyIiIiJlcOLYESyu7jg5O1d0VcpVpQq4ALyq VCU9PU1Bl4iIyFXmxLEjpKen4VWlakVXpdxVuoALoJq3L1bD4MDeXZw5dVIL6UVERK5QaWmpnDl1 kgN7d2E1DKp5+1Z0lezCXNEVsBevKlVxdXUjOfk8CWdPk56WXtFVEhERkTycnJ1wsbhRrbpvpbuN mFOlDbgga02Xk7MzVMKpSREREbl6VMpbiiIiIiJXEgVcIiIiInamgEtERETEzhRwiYiIiNiZAi4R ERERO1PAJSIiImJnCrhERERE7EwBl4iIiIidXbMB1/G4OD74+BNOnz5j97K2REQxcvSbWK3WQtPM nvcta39fZ/e6HDt+nOmffMbZs2fLPe99+/cz9KVXiD91qtzzvhzynqeSnLfLUZY9zxmU7tqzZ58U 53K9R6Bi21ka5TmOXS1tvlzUH1LertmA67ff/2Dpz79QtWoVu5cVvnIlJ0+ewsGh4O5OSEzk48++ wMls/wf/r/ltHT8u+xkvL69yz3vdn3+xe89evKtXL/e87eHzmbN4cMBA2895z1Nx5+1ylWXPc1ba a688+6Q0Lud7BPK3M+/5u1QF5Re+ciUPDRxEh9vvoPcDD5YoiCrPcayizm228u7jS827ovtDKp9K +ad9fli8hHemfVDo/gVzv2FLVBTNmzXDZDLZvT4REZHcfGO7wvdHRmEymWjeLOySynnsyWcIbdKI 4UOfLzTNlshImjULs0u7I6O20qL5pbXhcvJ0d6dRw4a2n/Oep+LOW0EKOweXUpY9z1lpr73S9klJ rskSlVtO75ESl5ennXnP36XKm9+fGzbw9rvv8fzTTxPcoAEZGZlUq3bxT5IV1o/lOY6V5Xovi5K+ R8pTWfK+XP0h145KGXDd3K4djT4OAWDWN3M5eOggo0eOAMBkMhFYK4DIqK3c/58+dq9LQmIi+w8e 5OknHi80TURkFA3q18PDw6PM5aSkpLBz1y4eeuC+ItNFRm2l7/3/KXM5Rea9dRsD+z9sl7zt4cEc fZX3PJXkvOVV1Dm4lLLsec5Kc+2Vtk9Kek2WRHm8R0qqoHY+WA5tyClvfvO+W0C/+x+gd6+e+dIW 1Y/lNY6V5Xovi5K+R8pbafO+XP0h15ZKOVfq71+DsNCmhIU25fDhw7S6/nrbz6FNm3Dk6FFOnDzJ goWL6dC1O336PkT4ihW58ojeuZPnX3yZ27r3oOe99/HD4iWFlhcRuZWnh75ApzvupNe99/P9wsW2 fZFRUQC5fjM/ffoM70//iHsffJhbunRj7vzvadm8WYnKzl4n1aXHXXTpcRevjxkLwNbt0WRmZvL6 mHG069CJF0e8lq+eBw/Fcur0aX5ft55uvXrT8977+HruvFxpziYkMP2Tz7jvof7c2rU7d/Tuk6tv tm2PZtjLI+h8R09u7dqdDz/+FID9Bw9y9uxZ2wzX9z8s4tau3dkcEUn4ypW073w7KSkptnwef/o5 Jk99z9Yfo8dP4O77+tKha3ceHDCQdevXF9vmbIZh0K5DJ8JXrrS9tjQ8nHYdOnH+/MUyR40dz/Mv vpyV54EDtOvQiZ27Ygo8TwWdt7Keg0spqyTnrDTX6qVcewXVs6j0RV2TxdW5uHqWpv1FXdMnT8bz 8muj6Hnvfdx0WxcGP/1svnbmPX/FlVlQnjnlzS85OZl/tmxhxqyvaNehE08PfSFX+sL6sTzHsYLO bVHjGhQ+FhTV3yV9jxRXfnx8PCNHv0mfvg/RoWt37n3wYf5v5a8Fti1v3sWNJ6Xtj7KMP3mVW1sL aVtxYyyUfewvr8/K4t43lUGlnOHKdvbsWfYfPMhjjwzI9XpE1FZcnJ15/umn8K5enUU//sikt9/l pnbt8PL0ZHNEJENfeoVb29/M25PG888/m3n3g//S5baOVKmSe63Ehk1/8+KrI+ndqyfPPjmEvzZu 4r0P/0vL5mGEBAezJSKKenVqU+XC+pt9Bw7w7LDhVK9WjaeHDMbH24enhg6jZfPmAMWW/crrowgJ Dmb6e1M5n5xMekYGkHXbyd+/Bu9NngSQr57ZacxmM7fcfCPXt3yK9Rs28vFnX9CqZUtCmzZh/8GD PPfCS3h5eTJ44KN4enjw4qsjcXdzB+CvjRt5aeQoOtxyM5MnjsMwDKpXrQZk/abt6upKw+Bg5n43 n89mzGTKhLFc16I5U957n4YhIVgsFgBS09LYsWsX99zdC4BN//zLmt/W8c6kCbhaLHz3w0JGjZ3A om/nUq1a1ULbnM1kMuHk5ERaaprttWU/hwNgtWalTUpK4vc/1jPy5Rcv1DcKV1dXQoKDsvomz3nK +3NOpT0Hl1JWceesNNfqpV57eetZbPpC+qO444qrZ07F5VXcNb3xn3/YsOlv3p0yCVcXC1arld/W /ZGrnXnPX3FlFpRnTnnzi9y6DRcXJ7746HNMJvD09Mx3DRTUj+U5juU9t8WNa4WNBcX1d0nfI8WV v+Hvf/jjzw1MmTAWN1d3vl+0iIlT3uamdm3yzYLmzbu48aQs/VHa8Sen8mxrYW0rbowt69hfnp+V xb1vKoNKHXBtjojEMAyub5l7oN4SEUWTJo3ofFsHAKpUrcLylas4cuQoHiHujH9rCje2bcOEN98A wM3iyqxv5pCR542ZmZnJ5Knv0eW2jrz8wlAAmjRuzFdz5hG9YychwcFERG2lebOs8q1WK6PGjKNB vXpMnTIJF2dn/t0SgdVqpWXz5lit1iLLPpeczKHYIzzzxBM0bpR7PUJERBQtmzWnQf36hfZHZORW wkKbMOChfgCENm3Cd/O/Z3v0Dpo2acyoMeOoW6c27055CxdnZ9atX4/JZKJl8+akpaUx/q23uaNr F14f8Uq+vKOittKkUUM++PgTfg7/P96f+jbXtchqd0RkFO3atLaljY7eSXp6Oi2yZ3i2RtGkcUPa tr4BgMDAWqxavYadMbto1qxZoW3OyWJxIfXCgLcrJoZdMbsBSElJxcPDg+8XLcbNzZXbbr01q8yo bYQ2aWxbEJvzPBX0c7aynIOylgVFn7MmjRuV+Fq91Gsvbz1LlL6A/ijuuOLqmbdNReVlGEaR1zRk /cbdpHFDWl9/vS3f/37yWa7zkfP8lajdBeRZ1PXw7+YthDUJJahBwe/dwq6r8hrHIPe5LW5cq1un ToFjgWEY9B/0eNH9XYL3SInG1citNG7UkBvbtgXAw8Odlb+u5uixY4QEBxead1Hv37L2R0hwcKnH n2zl2dai2lbUGNu2desyjf1Wq5X/9Otffp+VxbxvKoNKeUsx278REdQOrIW3t3eu1yOjImkedvH2 xJkzWd8G8vX1YdM//3Lk6FEeG9Cf1LQ0Nvz9DxOmvEPLFs3y5bM5IpKjx44x8JH+ttfS0tNJS0vD y8vLNpPTvFkoAH9v3syevft4+cVhuDg7X8gjgloBAfj4eBdbtrurKze2bcv4yW/z9Zy5pKZlvcEz MzPZGh1NyxYF33LJtiUqkuuat7D9nJ6eTnJqKi4uzmz6919279nLKy++YKvblogoghrUx9PTg782 buLU6dM8+figAvOO2LqViKitLFryE198/F9bsJWUlMT+AwdswVVW2ih8fLypFRCQ9XPUNlrm+IA7 dy4ZALPZqdA25+Xl6UVyStZxX82Zy3197sFsNpN47hznz6fw3YKFPPxgX1xcXICsAah5s6z+ynue 8v6cU1nOQVnLgmLOWSmu1Uu99vLWs7j0hfVHcccVV8/S5FXcNQ1ZY0GLHGNBQecj5/krSZ/nzbOo 6yG7fS0Kee8WeV2V0ziWt83FjWuFjQXF9XdJ3yPFlZ/d9pY5+vD0hbZXuzDjXljeJRlPStsfUPrx J1t5trWothU1xpZ17C/Pz8rsdhb1vqkMKvcM1+YIrmvZMtdrWYshD/FcjgBgW3Q01atVw7t6dZb9 kjUV/NTQoZw/n0K1alXp1KEDQwbl/0rxvv0HqOLlRb06dWyvRURFYRgGDerXZ8eOXaSnp9vWnkRt 3YaPjzd1agdeTB8RZdu/c9euYst+d/JElv4SzkeffcGfGzbyyYfvs3vPXpKTk2keVvCHNkD8qVPE Hj6Sax3M5ohIrFYrYaFNWf3b7/nqtiUqyhY47d67Fx9v73xvJMga6A8eiuWZJ4cw59v5/LBoMS8N y/otZtuOnbYyLvbRVlsAdv58Cnv27uWpHG/mzRFbcHR0pFFISKFtzqtq1SokJSaxKyaGvzb+zSvz hrHox584e+YsK1b9itnsSJ+7sm5hnj59hkOxR2gellWnvOcp7895leYcXEpZxZ2zdev/BEp2rV7q tZe3nsWlL6w/ijuuuHpeal45r+mzCQnsP3iIZ5+8OBbkbWfe81dcmQXlmVPe/FJSUti+YydDBj1W YPrC+rE8x7G8bS5uXFu5enWBY0Fx/V3S90hx5Wf38TNPXsxnW3Q0Pj7e+YLyvHlD8eNJafsDSjf+ 5FSebS2sbcWNsfMXLizT2F+Sz6vStrOw901lUWkDrsTEJPbs28dDD96f6/WIyKzFkM3CLp7YLRFR tsWRGZmZ1KkdyPRp7+Lm6lrkt6ISExNwc3Oz/Wy1Wvlmzrc0bdKEOrUD2RIZiZOTk20mJy01DVdL 7t9wonftpOOtt5S4bAcHB+7FACrRAAAgAElEQVTqcSfubu68PmYs58+nsO/gAUwmE7UDA/Olz9lG BwcHwi60MzExiQ8++oQ2rVrRoH59lq9YhZura6627NwVw3/uuRsAJycnrFYrhmHk+wp6RNRWTCYT 9/TqSeNGDXn+xZdp16Y17W+6ifj4eBwcHKhe7eJvY7tiYnjw/qxvDW2N3gZgC8DiT53ii5mz6Hrb bbZZiILa7OZmyVUHP18f4k+d4r3/TuehvvdTpUoVvLw82RIVyZxvv2PUq6/geqF9kVsv9EXTrEH4 wKGDuc5T3p8v5RxcSlnFnbM1v68r8bV6qdde3noWl76w/ijuuOLqWdq8irqmI6O2AtAsR9CSt515 z19xZRaUZ679efKL3JZ1/Yc1bVJg+sL6sTzHsbxtLm5cK2wsKK6/S/oeKa783//IWuydc5ZwS0QU LZoVPHOWM28ofjwpbX9A6cafnMqzrYW1rbgxtrjzVtj5Ls/Pyux2Fva+qSwq7S3FLZGRBa77iIiM ol7durYPc8MwiNq61XYBX9+iJYdiD7P051/YvWcfGzZu4qeffymwjMaNGnH02DF+WLyErdu2M2bi JCK3bWPE8GEAVPHyJD09nZ9+CcdqtdK4USMOxR7h+x8W8e+WCMZOfIvExCTbhVpU2efOnWPm17PZ tj2ardu2s2z5curVqYObmwUnRzOGYbDi19X8uWGD7eLN1R9Rkfj5+bJnz16WhoczYPAQ0tJSeX1E 1rdmGoYEc/BQLD8sXkLk1m289uZY0tPT8XDPWjTZplUrTp0+zbTpH7ElIopf1/zGXxs3AlkfMvXr ZX1lv/X113Nbh1uY9t+PSU9PJ8C/JlarlW/nL2BLRBSvvTmGkyfjcb/w5ouM2koNPz8Oxsby47Kf GTBoCB7u7rzw/DNFtjmvAP+arFqzlpMn43m47wMA+Pr48Pn/vuT6li3p2vm2i9dA1Dbq1a1r6/e8 5ynvz9nKcg7KWtb/t3ff4VFUixvH303vgdCSiBAg9CBIl0uTJlVARewN9GfjgiIKggoICIpyvaJe LshFEfWCgAgKKAgoVwQUSKFL7y2U9E2y8/sjyZpsyoZkh2D8fp5nHtjd2XPOnNmZfTNzdqY46+xq P6sl/ewV1G5n8xfWH87e56yduTkry9lnOjomVhE1aigo1yB1x+V0XH/O6iyozNwcy9uxIyZ7DFD+ z3RR/ejK/VhB+6mi9muF7Quc9XdxtxFn9Tv2sc1mU+zOnXlOuxXU38Xdn1xtf0hXt//JzVXLWtSy FbWPlUq+73fld6Wz7aa8KLdHuLZFRyssNFSh1arleT736Swp+3IGV66oWfblDJo1baJRI4brs4UL 9fGnn6ly5crq0invQMcc7dq20aMPPqDZ//lY6WlpimoSpdkfvKe6dbJ+DdO+XTvd1q2r5i/4TP16 9VSnDn/ToDsHavZ/5kmSBvTrqy6dOyojM8Np3cdPnNSGnzbq4/kL5OHhoSZRUXpj0sTsem7RLW3a aNrbMxQQEFDgNW68Pb2UcCVBzz43UmHVqqln92564N7B8s/eqG7t1FH9+/bVh7M/koeHh+4a2F8p qan2gaD169XVyy+N0iefLtCy5d8otGpVPf7YI5KyfmWV+zTBU48/rnseekSrvl+jfr17afBdd2ju /Plys7ipZ49u6tmtmzIyMiVlDbY/c/asnnx2uMJCQ9W/X1/df+9g+fv6au++/YUus6OIWhFKS0vT mFEvyCt7HEKVypVVsUIFvTrmpTzzxsTF5Wmv43pyfJyjJOugpHUVZ51dzWe1NJ+9gtrtfP6C+8PZ +5y1MzdnZTn7TEfHxqmpw6lKx+V0XH/O6iyozNwcy9seHW3f9xSksH505X7McZmd7dcK2xd06dyp yP4u7jbirH7HPj546LASExMLvOhy7rKL2n5L0x/S1e1/cnPVsha1bEXtY6WS7/vbtm7tsu9KZ9tN eeGKS1dbJLlnT56SvCT5SPLLngIktU5OSpzhgrpQjthsNnXv3U8vvTBSPbp1KevmANfU5StX1HvA nXrnzalq07JFWTcH5RD72OLx8w94TtIWSYmSkrOnVElWSemSMrMnozT1lNtTirj+HTh4UEkpKWrY oEFZNwW45v7zyXzVqV1brVuU35/Bo2yxj72+ELhQZqJjdyooMFA3Vi94cDpQXqWkpCgzM1OTx792 Te7nir8m9rHXF04pAgCAvyxOKQIAAJQT5TZw5dzE80J8fFk35bp25uxZvfvBh7p48VJZN6VMuaIf dkTHasyrr5XLe4Bdr+Z//oU2/LTR5fOW13VZlstVWP+fPnNGMz+cpcuXL7u8Tr4HcD0pt4Fr46Zf 9PuBg6oUElLWTbmu/fjT/7Ti25WqUCH/za7/SlzRD6vWrNH58/H2e+ShdP49d57ufSj/VatzXElI 0AezZsvTw/nVba5mXsl169LZMlxrZfUZLar/1/+4UV9/8639Fi+uxPcArifl9pshJjauwOuyuMJj Tz6jt9/9pyllm1VfYWXsiM26z9hfZeCumf0QHR2T59pI17tr/Tm+WoH+/qpfr4gbDMfEymKx2K+u XpSrmVe6+nVZWF86W4ZrzVXLddX1FtH/O2Ji1KRJlCn7IDO/B4CrVX4DV9zOPDd2dZXU1FTt3bcv 3xXszeKK+ooqIyY2rtB7BpY3ZvZD1r3tjv5pLt53rT/HJXHv4EEaP25Moa9Hx8Sqdq2IIm8pUpJ5 r3ZdFtWXzpbhWnLlcl2tovo/xuEirq5k1vcAUBLlMnAdPnpUly9ftv9ls2jxUnXs3lPbo2MkSbv3 7tXfnx+lW3v2Ud87B2nxV8vs77148ZJefX2S+g+6R52699S9Dz2qjT//caucuF27lZmZqbHjJ6pt py56fvTL+epftWaN2nftodTUVPtzjz89TFOnv1OsOnIrqr7omDg9Pfw5denVW/3uvFuLlnx1VWWc PHVK586f15dLvlKn7j11xz33a9X339vfd/78BY16eZz63jlI7W7tpqFPP+u0/4rzeo4LFy5ozKuv 6Y577lenHr30wGNDtWLVKo0cM1Zds9+7dNnXed5T1DLnKa97T9157wP6bs0Ppe6HnHEg3frcrm59 btfY8RPyLUtMbNa97XL/BV+atkpZt+v4YNZsDbr/AXXs3lN97sjbH0X1c2HrzllfOGu3o8tXrmjm h7M06P4H1bF7T/UacIdWff+9Tp85o7adumjrtm32eU+dPq1bOnfVjuhYp/UcOnJEbTt10d59++3P Xbx4Sf+Y+b7uvPcBdeh2mz5buKjQkOxs3qL6rqB1WdT8hfWl4zK4Yp3nKMm2WdByFbb+ilouZ/Vc zbo6euy44i9e1E8bf9Zt/Qao752D9Mlnn+eZp6g2StLOXbs1YtRode3VVx2799Q/P/iXpKK/B0q7 jy7OPgFwVC5v7RMTGydfX1/Vi4zUZ/9dqFlz5mrapAm6uelN2h4do+EvvKiO7f+mN6e8rt9+2663 331P3W7trODgYG39bZvW/7hRb02ZJF8fH/138RKNmzBJS7/4TBUrVtCOmBiFhlbTO1OnSJKCg/OP +YmOiVO9unXt90dLs1q1Z98+Deyfdbd4Z3XkVlh9m7f+qudfGqMB/frq2Sef0C9btuqdf76nZjdF qW5kZLHKiI6Nk7eXl/7+9FOqFBKipV9/rSlvvq12bdsqKDBQW377TZu3/qq3p02Rr7ePbDab0/5z 9npum3/9Tf/btFnTJk2Ql5e33n73Pb31zrsa+ujDun/w3fpm5SpNf/c9derYQSEVKzpd5tzl+fn6 a9HSpZo87U21a9taAQEBJe6HF8eOU93ISM18Z7qSU1KUnpH/NjM7omMVUeNGBWePQyltW0+fPqNn nhspLy8vPf7oY6papYqefX6kMm1Zv0p21s8FrTtXf64OHz2qYc+9oKCgQA199BEFBgTo+ZfGyN/P X/5+WbcfSs++PYgkfbv6O9WoXl3NmjZxWk9MbKx8fX1VNzLr1h+HjhzRsyNGKqRiRT39xFBVrlRZ Tw0fUeDRF2fzOus7x3XpdP5C+tJxGUq7znMrybbpuFxFrb+iPiPO6rmadbUjJkYeHh7q8Ldb1LzZ U/p58xZ9MGu2WjRrpsaNGjpt4y9btuiFMePUqcPfNHXyRBmGoZAKFbP7v/DvgWnv/KNU++ji7BMA R+UycMXGxqlh/Xp694MP9e2q7/SP6W/q5qY3yWaz6fU3pumWNq016bVXJEl+Pr6a9+kCZWRvMDFx sWrYoJ7atGopSape/QatXbdee/fvU9vWrRUdHatmTW5S7Vq1Cq0/OiZWbVu3sj/evXuv0tPT7YfN ndWRp6wC6svMzNTU6e+o262dNeq54ZKkhg0a6OMFn2v3nr35vhgLa/OO6Fg1bFhfXW/tJEkKrhCs 1WvW6uTJUwqqH6jomDg1bFBPrZpnXQnbZrPprvseLLT/itO/efspTg3q19MtbdpIknp276r/Ll6q B++9R5JUrWoVfbNqtY4dO6HgoCCny+xYXkCAv9b8sE6nTp/Oer0E/eBew0PHjp/UM//3f2pQv4jx RLFxuqnJTcVeP87aOn7KFFUKqah3p78pX19fHTx0SBkZGWrapHGx+tlx3eVrbyk/V4ZhaNz4iapZ 40a9Pe0NeXt5aePPP8tisajZTTfJ399Pbm5uupKYIEmyWq1avHSZhj7ycLHqiYndqcYNG8jNzU02 m03jxk9U7YgITZ82Rd5eXtq2I7rAm9M7m7dYfZdrXRZr/kI+V7mXIWedlHSd51t/V7ltOi6Xs/VX 2HI564+rWVeSFBMTp6jGDfXQ/fdJkho3aqj/LlykXbv3qFHDBkW20Wq16vU33lSv7t00dvSL+cou 7Hsgq/9Kvo9u0qRJsfYJgKNyeUoxOi5O0bFxWrpsuWZ/8J59I9v62zadPHVKjz30oNKsVm3+9TdN mvaWmjVtokqVKmW9N3anmjX5Y8eQlJQiSfLw8FRmZqbidu9Ws6aFjwlITEzU4SNH8oxJiI6LVeXK lXRDeLjTOnIrrL7t0TE6dfq0Hn34Qftz1vR0Wa3WfL/0KarNMbExecY3XLqUdUmEKlUq219vmut1 Z/1XnP51rD/3Xe+vXElQheCgXI+vSJKCKwQVa5kdy7uYvTwVK1QscT/4+/rqljZt9PrUN/XJgs+U ZrXme3/OX8c3ZX8xlratu3bv1o7oWL0w4u/yzb7BbNzOXfLz81Gd2rWL1c+O6y43V3yutm7bpt8P HNSLzz8n7+yb9e6IjlWd2rUUGBggNzc3VaxYURcvZv3U/+tvVsrT01P9+vQqXv/EZf2IQZJ+3b5d Bw4e0qjnR9jr2h4drRvCw1W5ct7PlbN5nfWd47p0Nn+Rn6tcy1DadZ6v7KvcNvMtl5P1V9hyOavn ataVJO2IjdHNNzW1P05PT1dKWpq8vb2ctvGXLVsVf/Ginnx8SL5ypcK/B0q7jy7OPgEoSLk7wnXp 0iUdPXZczzz5hBZ8sVCLl36lF0Zk/RW9d98+SdJTw4crOTlVFStWUJdOnfTEkKyfbScnp+rAwYN6 KtcGvD16h9zd3VW/bl39fuCgUlJS8tzZ3tHOPXtls9kU1biR/bnoXINCndWRW2H1HTp8RMFBQYqo USNXHbEyDCPfX9mFlZE1gPaYhuXa6ezcvVshFSuqUkiILl+5osNHj+nZJ/943Vn/OXs9t5zyn3ny j3bt2bcvTx/s3rNP/r6+qlG9urb+uq3IZS6ovJ27d6ty5UqqXLmS9u7bX6J+kKS3p07WipWr9P6s 2dq0eYs+/Oc/8pSxZ88+paen28eoOFs/ztq6as0ahYWGql6uvojbtVtRDRvLzc3NaT8XtO5yc8Xn KjZupypXrqQaN1a3P7cjNtb+pSZJodWq6uz5c0pKTtaceR/rmf97XJ6enk7ruXjxko4dP6mbohoV Wld0dGyBY4Kczeus7xzXpbP5C+tLx2Uo7TrPrSTbpuNyOVt/hS2Xs3quZl1diI/X8RMn87y2PTrG vv9c9+NPRbfx4EFVrlSpwD/mivoecMU+2tk+AShIuQtc0bFxslgsGtivrxrUr6e/Pz9KbVu3Uvt2 7ZSRmakaN1bXzBlvy8/XN98vZuJ275Qk+4Z3IT5es+fOU/dbb1VgYIAObT4ii8WiG6tXz1dvjgsX LsjNzU0hFSvan9u3f7/uvXtQserI7dDRgutLSLgiPz8/+2ObzaZPF3yhRg0b5tk5FVVGdEzWANom UX/stHdEx9oH1MbExmW9niuIOOs/Z6/nllN+zhGAzMxM7dy9R9273vpHe2JjFBWV9YXjbJl/+t/P ecrLWZ6m2Y9L2g+S5Obmptv79Ja/n7/Gjp+g5ORU+fn52F8/cuyoPD097X8dl7atly9dlo+3d552 xu7cpS6dOharnwtad7m54nNlTbPKL/tITM68e/ft110D+9ufq1G9uk6ePKV/zZ6j6jeEq2+vnsWq Z8NPP8nNzU1RjRrZ6/L1ydsfu/ftVeeOHfItm7N5nfWd47p0Nn9hfRkTF5tnGRw/79LVrfM8ZZdg 23RcLmfrr7DlclbP1ayrHdHZfZS9HAkJiXr3/Q/VukUL1a5VS6u/X1tkGz09PWWz2WQYRr5LShT1 PeCKfbSzfQJQkHJ3SjEmNk61IrJ+ftyqeXPd2qmDZrz3gdLT09W8aTMdO35CK75dqd8PHNLmLVu1 /NuVed5brWpVHT1+XF9/860eGvKEAvz99dzfn5Ekebp7yDAMff/DOm3avNn+xZlbeGiYbDabvlj4 pXZEx+rl18br/PkL8s/+gnFWR26F1degfn2dOn1ai79apriduzR+8hTF7Nyp0SNHFLuM6JhYRdSs ad+BGIah2Lg4+xdAdEysImrUUFBgoL0sZ/3n7PXcHMvfu29f1l/UuQ7jR8f88Vens2V2LM9msyl2 5077KZyS9ENSUpLmfjJfO3ftVtzOXfpm9WpF1KiRb8caHBSo9PR0LV+5SjabrdRtrVHjRh05dkzf rFqt7dExevf9D3T4yBF7CHTWzwWtu+J8Jq7mc1WvbqSOHjuuxV8tU0zcTr382gSlp6crwN/fPk+t iJr6ddt2ff3NSo0e+bz9S9Fp/8TuVETNmvYv8wb16+vY8ZNatHiptu2I1oTJbyghIbHAQO9sXmd9 57gunc1f6OfKYRlKu85zK8m26bhcztZfYcvlrJ6rWVc7YmNUtWoVHThwUCtWrdJDQ5+Q1ZqmsaNH Fesz1rpFC8VfvKgZM9/XjuhY/bD+R/2yZYukor8HSrOPLmqf8MyI5zVi1Oh8ywnkKHdHuLKuu/LH YfCnHn9c9zz0iFZ9v0b9evfSqBHD9dnChfr4089UuXLlPH9BxsbG6czZs3ry2eEKCw1V/359df+9 g+Wf/VdW+3a36JY2bTTt7RkKCAjQ/YMH5au/WdMmGnzXHZo7f77cLG7q2aObenbrpoyMzGLVkVth 9bVr20aPPviAZv/nY6WnpSmqSZRmf/Ce6tapU+wyoh2ufXP46FFdvnJFzbJ/Qh0dG5fvej3NmjYp sv+cvZ6bY/nRMXHZp5lulJR1q50zZ8+qafZAW2fL7FjewUOHlZiYaP9JeEn64fiJk9rw00Z9PH+B PDw81CQqSm9MmlhAH7fTbd26av6Cz9SvV89St7VXj+6Kjo7VO/+cKW8vL4WGhsrd3d1+CsRZPxe0 7vK2t/Sfq1s7dVT/vn314eyP5OHhobsG9ldKaqrScv0qsX69ekpKStJzw55VZJ0/xiE5qycmLi7P Ntypw9806M6Bmv2feZKkAf36qkvnjsrIzP9DDGfzOus7x3XpfP6C+9JxGUq7znMrybbpuFzO1l9h y+WsnqtZV96eXkq4kqBnnxupsGrV1LN7Nz1w72D5ZwcqZ22sX6+uXn5plD75dIGWLf9GoVWr6vHH Hsnu/6K/B0q6j967b3+h+4Sk5GSFhRb8Rw4gSa64tK9Fknv25CnJS5KPJL/sKUBS6+SkxBkuqMs0 NptN3Xv300svjFSPbl3+tHWg/Hll4utKTEzWjDffKOum4BphnZcN9tF/TX7+Ac9J2iIpUVJy9pQq ySopXVJm9pT/Gi1Xodwd4SqpAwcPKiklRQ0bNPhT14E/tz1792nzr7+qccOGyszM1Nr1G/TD+h81 58OZZd00mIR1fv1gHw0zEbiyRcfuVFBgoG6sHv6nrgN/bhcuXNCq79boo3mfyNPDQ/Xr1dWMt6aq Yf36Zd00mIR1fv1gHw0zcUoRAAD8ZV2rU4rl7leKAAAA1xsCFwAAgMkIXAAAACYjcAEAAJiMwAUA AGAyAhcAAIDJCFwAAAAmI3ABAACYjMAFAABgMgIXAACAyQhcAAAAJiNwAQAAmIzABQAAYDICFwAA gMkIXAAAACYjcAEAAJiMwAUAAGAyAhcAAIDJCFwAAAAmI3ABAACYjMAFAABgMgIXAACAyQhcAAAA JiNwAQAAmIzABQAAYDICFwAAgMkIXAAAACYjcAEAAJiMwAUAAGAyAhcAAIDJCFwOtkfHaMlXX+vs uXMuLfdKQoLWbfhJy1asuKr3fbfmB/1r9kc6cfKkS9sDAACuHY+ybsD1ZvgLL8pqtape3UhVrVLF ZeVu3vKrXpn4umpFRKh/377Fft+kaW/KarWqfbtbdEN4uMvaAwAArp1yF7jOn7+gOfM+1uatv+rc +fMKCAhQ0yZR+r8hj6p2rVpl3TwAAPAXVK5OKaanp2vYyFH6avkKnTp9WjabTZcuXdKGnzbKYrGU dfMAAMBfVLk6wrVr914dOnxYkvTejOlq1by5Ll26pLhdu1QrIiLPvN+t+UH/mf+pjp84oYAAfw0a OECPPfyQ/fVRY8cpISFR1apW1ZBHHlLv23rYX7PZbJr/+Rf66usVunjpkmrceKMevv8+db21k32e pORk/eOfM7V+40ZlZmaoSqW8pyeTk1PVpVdvSdKiBZ/qxurhmv6Pd/Xl0mW6vU9vvfziC4UuZ3Hq BwAA149ydYSrSpVK9v9v3fqbkpKSVKFCBbVv1y7PfPM//0Kvvj5Jhw4flpeHh5KTkiWHI2ApKany 9fXRiZMnNXHKVEXHxNlf++cHH+rDf8/R+QsXVKFCsPb//rvGjp+gTZs32+d54623tXzlKiUmJsnX 11/HTpxw2XIWp34AAHD9KFeBKzwsTA/ee48k6ZPPPlevAXfqlYmva9/+/fZ5Ll68pDlz50mSRjz7 jNau+kbrVn+rewfdlaesme9M1+qvv1LzZk0lSWs3rJckXYiP18LFS+Xm5qb5c2frq/9+rhefGy5J +uLLJZKks+fOae26rPlnvPmGvlmySC+/VPgRq6tRnPoBAMD1pVydUpSkZ558Qh07/E3Lvv5G6zZs 0Pdr12ntug0aP/Zl9ejWRbt271aa1SpfX18NvusOSZKbm5t8fX3zleXm5qaoxo21bUe0zp8/L0na s2evbDabJOmeBx/JM//x41lHsQ4dPiLDMOTv76+2rVtLkrw9vV2yfMWpHwAAXF/KXeCSpCaNG6tJ 48Z6bsQwvTpxkv738yb955P56tGtizw8shbZYjGKNZDey9NTkpSRkSlJ8sh+7Obmpofvvy/PvAGB AZIkq9UqScrMzJRhFFyPh8cfBxczMqzFXrbi1A8AAK4v5S5wrVi1Sq2aN1e1qlXl5eGhkAoVJEnJ KSmSpFq1IuTm5qbk5FQtW7HCfk2sxMREBQQ4Dyy1s99vs9lUoUIF3X3nQFksFl24cEE+fn6SpLqR deTm5qbU1FQtWfa17hzQP185Xl5eCg4K0uUrV7RtR3S+Qf05PD08ZLVadfrMGUU1blSs+gEAwPWl XI3h2rd/vya98ab6D7pH7W7tpo7de2r5tyslSZ06tpckVa1SRf16Z/068I233lHXnn3UtXc/vTpp SrHqqFK5su7o30+SNOO9merSq6+6971dfe4YpJiYGElSaLVquvvOgZKkt2a8q9tuH6ipb7+Tr6xu XW6VJE3/xz/V985BWv7NynzzREbWliSNn/yGNv78c7HqBwAA15dydYTL19dPPbt3V3RsrC7Ex8vT 3V3VQkPVo1sXPXDPYPt8L4wYpkqVQrT6+zU6c/as/P39ValixWLX8/zfh6lG9Ru1aOlSnTp9Rjab TXXr1JG3t499nr8//ZTCQ8O0aOkSnTx1Rh4eHqpxY3W1bdPKPs+wp/5PFov0/Q/rdenSZQUGBqhW rQhFNW5kn2f0Cy/o7X+8q9idu+xXvi9O/QAA4PrhiquBWiS5Z0+ekrwk+Ujyy54CJLVOTkqc4YK6 AAAAXMbPP+A5SVskJUpKzp5SJVklpUvKzJ6M0tRTrk4pAgAAXI8IXAAAACYjcAEAAJiMwAUAAGAy AhcAAIDJCFwAAAAmI3ABAACYjMAFAABgMgIXAACAyQhcAAAAJiNwAQAAmIzABQAAYDICFwAAgMkI XAAAACYjcAEAAJjMo6wbYKZ0q1UpKclKS01WujW9rJsDAAAceHp5ytvHT76+fvL08irr5pim3Aau K5cvKTUlScEVQlSxUmV5eXmXdZMAAIADqzVNyYkJuhh/Tj6+/goKrlDWTTJFuQxcFy+ck6enl2rW rlfWTQEAAEXw8vKWV4i3KoRU1rnTJ3XxwjlVrFSlrJvlcuVuDNeVy5fk6emlKqHhZd0UAABwFaqE hsvT00tXLl8q66a4XLkKXOlWq1JTkghbAAD8SVUJDVdqSpLSrdaybopLlavAlZKSrOAKIWXdDAAA UArBFUKUkpJc1s1wqXIVuNJSk+UXEFjWzQAAAKXgFxCotFQC13Ur3ZrOrxEBAPiT8/LyLneXcypX gQsAAOB6ROACAAAwGYELAADAZAQuAAAAkxG4AAAATEbgAgAAMFm5vJciAABwDcMwCnzeYrFc45b8 uRG4AAD4E1r0y1kt2nRau45c0uXEFGVkZLiwdEPKyVkFBCsPD3eFhfjprnbhGtW/DuGrGAhcAAD8 iby3+qRmrfxdl5PT5SDHsEYAACAASURBVOsfLB//qqoa4iN3d8/SF24YqhWcogvnzyg1LUO9mldT u/oV1aB6gKoEZV1Y/NyVNO05nqif917U178c1+ptJ9WlabhevoPgVRQCFwAAfxI9Jv2m3UcvKahi NYVVqejawg2bavic1YkTCRret7YGtgkrcLYqQd6q0shbHRpV0ksDI7V08ym9u+Kgog9d0BfPt5Kb G8PDC0KvAABwnTsWn6aoET/q4Nl0hdVsIP8g14Ytf89MBVmPqEZFD62b2E4DWofKMIxiTQNah2rd xHaqXtFH3V/bqJ3HEl3atvKCwAUAwHWu18TNslr8FFLtRtcXbtjknnhUtzYO0bQHG5a4mGkPNlSX qMr6+7+3yWazubCB5QOB6xoaMWKEZs6cWdbNQAmNGjVKH330UaGPAcAMPSb9plSblypULvgUX6lk n0a8qWagXhwYWeriXhwYqaYRwbrnna2ELgcErmtozZo1On78eFk34y+lZcuWGj16tEvKWrp0qQ4d OlToYwBwtfdWn9Tuo5dMOrJlKCIoVafPJ2jagw2U9bPE0k/THmygk+dTNGXJgUIvKfFXRODKZciQ IQoMDJTFYpG/v79q166toUOH6vfff7/mbWnWrJmGDh2a7/lx48YpNDS01OXHx8crICBAXbp0KdH7 K1eurOnTp5e6Ha5SWHsaNGigG280YUcFANfArJW/K6hiNZNKNxR//oyG94lwecnD+0RoXfQpAlcu BK5cjhw5ohYtWmjTpk365ptv9OKLL2rNmjXq3Lmz0tLSyrp5LvXBBx8oMDBQ69at09atW8u6Oab5 9NNP9cwzz5R1MwDgqi365awuJ6e7fIC8JMkwlJaSqFRrhvq3DpNhyKVT/9ZhSku36c1lHOXKQeBy ULlyZbVt21adO3fWk08+qUmTJunEiRM6cuSIJGnWrFkKDw+Xt7e3atWqpcmTJ+cr4/3331dERIS8 vb1Vp04dbdq0Kd88CQkJatasmXr37q3MzMwSt3fEiBFq0KCBgoKC5Ofnp+7duysuLq7I91itVr3/ /vuaPHmybr311gKPDDkeMTp+/LgsFovWr19vf27UqFGyWCyyWCz64osvJGVdkfjdd99VjRo15OPj ozZt2uQLdMOGDVPdunUVHBys4OBg9e/fX3PnzlXbtm3l5+ensLAwvf/++3neU5x+L6g9UVFR+U4p FrZ+ilNHYR5++GE1adIkz3MTJkxQ9erVi10GAOS2aNNp+foHm1S6oZTkRPW8uapJ5Us9b66qJZs4 ypWDwFUIm82mAwcOaP78+apdu7YiIiIkSW3bttW8efO0YcMGDR06VOPGjdPKlSvt75s2bZpeeOEF PfHEE1q1apUmTJig2rVr5yk7IyNDgwYNkoeHhxYuXCh3d/cSt3PNmjWqV6+eFi9erI8//liZmZlq 3bp1kWOLFi1aJEl64IEH9Nxzz2np0qU6derUVdc9cuRIxcbGKjY2Vr169ZIkTZkyRaNHj9bw4cO1 bNky1alTR+3bt9fevXvt71u3bp2aNGmir7/+WnPmzNHWrVs1YsQI3XvvvVq6dKkGDhyoZ599Vtu3 b7e/x1m/F9YeR0Wtn+LUUZiePXtq586dOnv2rP25jRs3qnv37sXrTABwsOvIJfn4BZhStmEYsqYm qV39CnLV2C3HqV39CjoVn0TgysaFTx0sWbJEHh4estlsMgxDPj4+WrZsmby8vCRJTZs2tc/btm1b ffHFF9q4caN69eqltLQ0TZo0SWPGjNHLL79cYPk2m02PPPKIDh06pI0bNyogoPQbU6NGjexf7P37 91fDhg01fvx4ffzxxwXOP3PmTD366KPy8vJSnz59FBYWptmzZ+vVV1+9qnpDQ0MVFRVlf5yUlKQ3 3nhDY8aM0ciRIyVJPXr0UExMjMaPH6/PP//cPm+9evXUqVMnSdK+ffs0bdo0DR8+XJLUpUsXffrp p1qzZo1uvvlmSUX3e2HtceRs/RSnjsL07NlTnp6eWrFihR577DFlZmbql19+0axZs5y+FwAKcjkx RVVDfFxfsJEViNKtaWpQ3ZxAJ0kNqgcoI8Nmv17XX/0q9BzhctCtWzft2LFDO3bs0OrVqzVgwAD1 69dPP/74oyRp1apV6tixoypVqqQbbrhBhw8f1uXLlyVJ+/fvV2JiYpED0f/973/rs88+08KFC1Wl ShWXt9/Ly0tdu3bVL7/8UuDrcXFx2rx5s4YMGSJJcnNz0+OPP665c+eW+ie8u3btUlJSUp7lt1gs 6ty5s7Zs2VLo+yIiIpSQkKCUlBRJkqenp2644QZduHDBPk9R/V5cztZPaeqoWLGievToocWLF0uS fv31VyUlJalbt25X1UYAyJGRkeGa2/UUxJBsmRmqFODl8vFbOVOlgKwDFRzhykLgchAUFKSoqCjd dNNN6tGjhz7//HOFhoZq7ty5OnjwoG6//XZFRUXpu+++07Jly/L8Ai4nsBSV4jt16qSaNWtqyJAh SkhIKLIduQNHjrNnzyo4uOhz+u7u7vL19S3wtTlz5sgwDEVGRtrHO73yyis6cuSIvv/+e/t8np6e 9gBUkIKWMWejcnzN2cbm7Z11f67cY9m8vb3tN2J11u+FtcdRUeunOHU488gjj+j7779XfHy8VqxY oZtvvllVq5o3PgIA8OdB4HIiLS1N6enpcnd31/bt25Wenq5JkyapRYsWatmypUJCQuzzRkZGysfH R2vXri20vIYNG2r9+vU6c+aMBg8eXOhRpUaNGunnn39WYuIft0iwWq1au3atGjduXGSbf/rppwJP raWnp2vBggV65ZVXtH379jxTq1atNHfuXPu84eHh2r17d6F1BAcH69KlS3mea9y4sfz8/PIsv2EY 2rBhg1q1alVkm4virN8La4+jotZPceqwWCx5wqPj4wEDBigsLEyffPKJli9frjvvvLMkiwsAkiQP Dw9lZqabVr6bu4fOJ6TJrDFcWWUjB2O4HJw7d04bN26U1WrV4cOHNWvWLJ09e1YPP/ywqlWrJjc3 N02YMEH33XefPD0985xy8vPz08iRIzVlyhQZhqFbbrlFCQkJql27tn0skiTVrFlTS5cuVYcOHTRl yhSNGzcuXzteeOEFzZs3T126dNEzzzwjT09PffTRRzp8+HC+q5svWbJEdevWVWhoqBYsWKDdu3fr k08+yVfmihUrFB8fr6eeekphYXmvWDx48GCNHTtW8fHxCgkJ0d13361XX31V06ZNU8uWLfNdsLVV q1aaP3++WrduLavVqvDwcLVr105jxozR5MmTFRAQoKioKM2bN0/79+/Xl19+WaL1IWX90rCofi+q PbkVtX6KU0d4eLjWrl2rRx55RHXr1s332N3dXU8//bSmT5+ukydPlmqZASA4wFfpaaly9zPntKKn l7f2HE9U+4YhzmcugT3HE+XhwXGdHPRELjVr1tS2bdvUoUMH3XbbbfaLjP7www/q2LGj6tevr48/ /ljfffedOnTooPbt2yspKUmRkX/cDuH111/XlClT9J///Ee9e/fWsGHDtGfPnnx1tWzZUuPHj9fE iRO1a9eufK9HRkbqhx9+UEBAgJ555hkNHTpUqampWrlypTp37pxn3sDAQL399tu68847FR0drdWr V6t58+b5yvz444/1t7/9LV/YkqS7775bVqvVPrB95MiRGjFihN566y317t1bo0ePVvv27e0XXZ06 darq1Kmj++67T8OHD1dMTIwkaezYsXrjjTc0Y8YM9evXTwcOHNDGjRvVoEGD4q8IB8Xp98La46iw 9VOcOiZOnKiLFy9qzpw5BT6WpMcff1wXL17U3/72tzzvBYCr1ahmBaUmm3QjaIvk5e2nn/deMm0M 1897Lym0ot9ffrB8Dlf0gkWSe/bkKclLko8kv+wpQFLr5KTEGS6oq0gnjx1RnfqNzK7muhIVFaW+ fftq6tSpZd0UKGscWmRkpCZPnqz77ruvrJsD4E9s0S9n9fzcWIXVLPkfrIUxbJmypiQo0HZWa15r 4/LyJanbhM3q0ypcLw6ILNHljw7s3aXwG2ua0LK8/PwDnpO0RVKipOTsKVWSVVK6pMzsqVSj/znC BbjAtm3b9Ntvv+mxxx5ThQoVNHjw4LJuEoA/uUFtqyrYz1NJVy66vGyLxSIvbz95e3lo2ZYzLi9/ 2ZYz8vZ00/N9IzjClY3ABbjAkCFD1KlTJ124cEHLly8v1cVsASDH//WK1JWLrg9EkkVyc1NIpap6 b+Vhl5f+3srD6twkVO7u7gSubAya/5NzdhsfXBu5r4oPAK4y7LZwLd96SgfPHFNItau7VE2RLBZZ 5KbDl7xUIyRAYz7dqzceqO+Sosd8uldhIb56sX+E3NzcCFzZOMIFAMB17LtxLeTjZtWl81d/C7ai ZR3lOpIcophjiXrrq4P2q8KXdHrrq4OKOXpFnwxrytEtBwQuAACucytfbSMvI1nxZ465rlCLRRaL myxuHsrwCdP63Rc1ZsG+Ehc3ZsE+rd91QW8/FiUPDw+ObjkgcAEAcJ27McRbcf/oqNpVPXXqyB7X DaS3uMni5qbkDA9ddgvTsYsZ6j5hi5ZtLf64sWVbz6j7hC06cTFVy8e0UqMbAuXu7i43NyJGbozh AgDgT+K7cS303uqTmrXyd506cka+/sHy8QuQp7dPye+7aHGTxU2SLDqSHKJaoQGavfaEZn57RLc1 q6K29SuowQ3+qhyYdW/E8wlW7TmRpF/2XtLqHefk7eWmHs3DNOr2mvLw8CBsFYLABQDAn8iw28I1 7LZwLfrlrBZtOq1dR87q7JkU+/1nS8wwJNl03GaTDJtksej3Uwn6YLWbHC/b6eHhptCKvhrQOlTP 9akpd3d3e9AibBWMwAUAwJ/QoLZVNahtVZeWmTP43WazKTMzUzabzf44t5zxWW5ubvagZbFYGLNV BAIXAACQJHtoyglTuX+BWNh8BK3iIXABAIA8cocox7CVex4UH4ELAAAUimDlGoxsAwAAMBmBCwAA wGQELgAAAJMRuAAAAExG4AIAADAZgQsAAMBkBC4AAACTEbgAAABMRuACAAAwGYELAADAZOXu1j4H 9u4q6yYAAADkUe4CV536jcq6CQAAoJTK2wEUTikCAACYjMAFAABgMgIXAACAyQhcAAAAJiNwAQAA mIzABQAAYDICFwAAgMkIXAAAACYjcAEAAJiMwAUAAGAyAhcAAIDJCFwAAAAmI3ABAACYjMAFAABg MgIXAACAyQhcAAAAJiNwAQAAmIzABQAAYDICF647I0aM0MyZM8u6GQBwXXC2Txw1apQ++uija9gi lASB6y+sZcuWGj16dFk3I581a9bo+PHjZd0MALguONsnLl26VIcOHbqGLUJJELgKEB8fr4CAAHXp 0qVE769cubKmT5/u4laVXGHtadCggW688carLm/IkCEKDAyUxWKRv7+/ateuraFDh+r33393RXOv uW7dusliseSb5syZU9ZNA3AdGT9+vLy9vZWenu503i+//FIWi0VHjx69Bi3Dn4FHWTfgevTBBx8o MDBQ69at09atW9WqVauybpIpPv300xK978iRI2rRooWmTp2q1NRU7dmzR1OnTtWqVat04MABeXt7 u7il5uvQoYOmTJmS57m6deuWUWsAXI+aN28uq9WqXbt2qWnTpvbnu3btqq5du+rll1+2P7djxw5V qlRJNWrUKIum4jrEES4HVqtV77//viZPnqxbb721wCNDjkeMjh8/LovFovXr19ufGzVqlP1IyRdf fCFJMgxD7777rmrUqCEfHx+1adNGW7duzVP2sGHDVLduXQUHBys4OFj9+/fX3Llz1bZtW/n5+Sks LEzvv/9+nvfMmjVL4eHh8vb2Vq1atTR58uR8bS6oPVFRUflOKb7//vuKiIiQt7e36tSpo02bNhXY T5UrV1bbtm3VuXNnPfnkk5o0aZJOnDihI0eOFLtNxakrISFBzZo1U+/evZWZmVms/h8xYoQaNGig oKAg+fn5qXv37oqLiytwOXKEhISoffv2eaZq1arptddeU1RUlIKCghQUFKT58+dLkjIzM/XKK68o MjJSwcHB6tq1q3bu3JmnzNmzZ6tevXry9vZWtWrV1KZNG61YsSJPHxa1HM7qGDZsmOrVq6fg4GD5 +PjolltuydeGgvr44YcfVpMmTfLMN2HCBFWvXr3IPgL+6po3by5J2rZtm/25zZs364cfftC//vUv GYZhf37Hjh1q0aKFJOfbcnH2JzkK2ifmxvZ9/SJwOVi0aJEk6YEHHtBzzz2npUuX6tSpU1ddzsiR IxUbG6vY2Fj16tVLkjRlyhSNHj1aw4cP17Jly1SnTh21b99ee/futb9v3bp1atKkib7++mvNmTNH W7du1YgRI3Tvvfdq6dKlGjhwoJ599llt377d/p62bdtq3rx52rBhg4YOHapx48Zp5cqVTtvjaNq0 aXrhhRf0xBNPaNWqVZowYYJq165d5HLabDYdOHBA8+fPV+3atRUREVGsNhWnroyMDA0aNEgeHh5a uHCh3N3dnXe8ssY71KtXT4sXL9bHH3+szMxMtW7dusgxDoZhKCMjwz7l7MgWL16siIgIffXVV1q4 cKHat28vSZo4caJmz56tiRMn6ttvv5W7u7v69u0rq9UqSZo6daqefvppDRgwQMuWLdOcOXO0f/9+ p8EvN2d1rFu3To0aNdKSJUu0YMECpaenq1evXsrIyCiyj3v27KmdO3fq7Nmz9ro2btyo7t27F7tt wF9R9erVFRYWpl9//dX+3KJFizRw4EBduHAhzx+NW7duVZs2bSQ535advZ6jOPtEM7fv8ePHFzj8 oqBp4sSJpa4P+VmUdWrSW1KApBBJ4ZIiJd0kqZ2kEclJiYbZ0+97dhql1bZtW2PMmDGGYRhGZmam UaNGDWPChAl55qlUqZLx1ltv2R8fO3bMkGSsW7euwNcNwzASExMNf3//PGXZbDajcePGxj333GN/ rnHjxsZLL71kfzxp0iQjMDDQ/thqtRqBgYHGm2++WegyREVFGS+//HKh7S2ortTUVCMgICDfshak a9euhsViMdzd3Q2LxWJIMnx8fIzVq1cXq03O6mrcuLExatQo4/777zfq1atnnD17Ns/rzvrfsQ/T 0tKM2rVrGw899FChyyMpz1SnTp0CyzIMw7hy5Yrh7e1tzJs3z/7c0aNH7W1ITEw0/Pz8jNGjR+d5 3w033GC88cYbxVoOZ3UU1LbNmzcbkoxffvmlyD6Oj483vLy8jI8++sgwDMPIyMgwAgICjAULFhTY PwD+cMcddxgtWrSwP46IiDCWLFliDBw40BgxYoRhGIZx+PBhQ5KxcuVKp9tycbf1ovaJderUMcaO HWsYhvnb92uvvZZvf+k4Fed7pDh+37PT9NyQnJRoSBqRnVVuys4u4dlZJiA723hkZ51S4QhXLnFx cdq8ebOGDBkiSXJzc9Pjjz+uuXPnymazlarsXbt2KSkpKc9AfIvFos6dO2vLli2Fvi8iIkIJCQlK SUmRJHl6euqGG27QhQsX7POsWrVKHTt2VKVKlXTDDTfo8OHDunz58lW1b//+/UpMTCz2DwW6deum HTt2aMeOHVq9erUGDBigfv366ccff3TapuLU9e9//1ufffaZFi5cqCpVqlzVsjjy8vJS165d9csv vxQ6T6dOnbR161b79NVXXxU67+7du5WWlqYnnnhCPj4+8vHxsY/3Onz4sHbt2qXk5GT17t27xG12 VkdB6tWrJ0k6ffp0kX1csWJF9ejRQ4sXL5Yk/frrr0pKSlK3bt1K3F7gr6Jjx46Kjo5WUlKS/ve/ /yk+Pl69evXSXXfdpS+++EKZmZn6+eef5eHhoVtuucXptlzcbb24+0Szt+/x48frtddeK/L1V199 1SV1lTcMms9lzpw5MgxDkZGR+V77/vvvddttt0nKCj05AaggFkv+IGxkn9t3fM3Idc6/IDkD0HOf q/f29rafNjp48KBuv/12DR06VDNmzJBhGHrooYectsdRTqAszrySFBQUpKioKEnSTTfdpB49eqhm zZqaO3euqlevXmSbilNXp06dFBMToyFDhmjdunUKDAy0v+as/wvi7u4uX1/fQl+vUKGCWrZsWayy ctbJ7Nmz1bp16zyvhYWF2XeSnp6eRZZT1HI4q6MgPj4+kqT09HSnffzII4/o3nvvVXx8vFasWKGb b75ZVatWLbK9AKQ+ffpoxIgR2rRpkxYtWqQ77rhDPj4+9n3eqlWr9PPPP6tdu3YKDg4u9v7C2bZe 1D7Rkdnb9/jx4yVljQ1zfL6oMPZXxxGubOnp6VqwYIFeeeUVbd++Pc/UqlUrzZ071z5veHi4du/e XWhZwcHBunTpUp7nGjduLD8/P61du9b+nGEY2rBhQ6l+Bbl9+3alp6dr0qRJatGihVq2bKmQkBCn 7XEUGRkpHx+fPO27GmlpaUpPT5e7u7vTNhWnroYNG2r9+vU6c+aMBg8enOcIo7P+L8hPP/1kD4il FRkZKW9vb+3evVsNGjTIMwUHB9tfzznaV5iilsNZHcVpY1F9PGDAAIWFhemTTz7R8uXLdeeddzpf cACKjIxUvXr1tHz5cv33v//Vww8/LEkKCAjQHXfcoblz52rt2rXq06ePff7i7C+cbetF7RMtFkue P96vxfY9fvx4TZ06Nc9jwlbROMKVbcWKFYqPj9dTTz2V7wjC4MGDNXbsWMXHxyskJER33323Xn31 VU2bNk0tW7bMd0G6Vq1aaf78+WrdurWsVqvCw8PVrl07jRkzRpMnT1ZAQICioqI0b9487d+/X19+ +WWJ2x0VFSU3NzdNmDBB9913nzw9PfOdTiysPbn5+flp5MiRmjJligzD0C233KKEhATVrl1bN998 c756z507p40bN8pqterw4cOaNWuWzp49q4cffljVqlUrsk3FratmzZpaunSp/ZIN48aNkySn/S9J S5YsUd26dRUaGqoFCxZo9+7d+uSTT0rcz7n5+/tr5MiRmj59ujw8PNShQwclJibq8uXLevTRR+Xv 769nnnlG48ePl4eHhxo1aqRNmzbp3Llzecopajmc1eGMsz52d3fX008/renTp+vkyZOl+gwCfzV9 +vTRzJkzVb16dXXq1Mn+/GOPPabbbrtNGRkZ9sBVnP1Fcbf1wvaJ4eHhWrt2rR555BHVrVv3mm3f L730kv0oPWHr2igXg+b79+9vdOjQocDXjh49algsFmPmzJmGYRhGenq68eKLLxqVKlUyvLy8jNDQ UKN9+/bG7t27DcPIGjB56623Gv7+/kZ4eLjx4YcfGoaRNUh+xowZRvXq1Q0vLy+jdevWxpYtW/LU 5TgQetGiRYYkIyEhwf5c06ZNjZEjR9ofz58/32jQoIHh6elp+Pr6GrVq1TJmzJhhf72w9jjWZbPZ jLffftuoWbOm4e7uboSFhRmfffZZvv547LHHjICAAEOS4eHhYYSFhRm33367sWHDhmK3qai6HNs1 depUw9PT09i5c2ex+r9x48ZG8+bNjYYNGxre3t5Go0aNjO+//77AdWsYWYPm+/fvX+BrBQ2az2n/ O++8Y0RERBienp5GaGio8cQTT9hfz8jIMMaOHWtUqVLFCAwMNLp162YEBQXlGTTvbDmc1eHYtpSU FEOSsWjRIqd9bBiGceHCBcPPz89o3759oX0DIL+1a9cakozXXnstz/M2m82IiIgwatSoke/5orbl q93WHfeJ69evN+rVq2e8+OKL9nnKw/Zd3gbNl7qA7DLcsydPSV6SfCT5ZU8BklonJyXOcEFdRTp5 7Ijq1G9kdjW4zkVFRalv3755DndfD6pXr65nn332urmdUmZmpiIjIzV58mTdd999Zd0cAC5UHrbv A3t3KfzGmqbX4+cf8JykLZISJSVnT6mSrJLSJWVmT0UPunaCU4rAX8y2bdtkGIb++c9/qkKFCho8 eHBZNwmAi7B9X78YNA/8xQwZMkSdOnXShQsXtHz58mJfUBbA9Y/t+/rFES6UO1dzNfdrqaDB/WUh 910KAJQvbN/XL45wAQAAmIzABQAAYDICFwAAgMkIXAAAACYjcAEAAJiMwAUAAGAyAhcAAIDJCFwA AAAmI3ABAACYjMAFAABgMgIXAACAyQhcAAAAJiNwAQAAmKxcBS5PL09ZrWll3QwAAFAKVmuaPL08 y7oZLlWuApe3j5+SExPKuhkAAKAUkhMT5O3jV9bNcKlyFbh8ff10+VJ8WTcDAACUwuVL8fL1JXBd tzy9vOTj669zp0+WdVMAAEAJnDt9Uj6+/vL08irrprhUuQpckhQUXEHp6VZCFwAAfzLnTp9UerpV QcEVyropLlfuApckVaxURTbD0JGD+3Qp/jwD6QEAuE5ZrWm6FH9eRw7uk80wVLFSlbJukik8yroB ZgkKriBfXz+lpCTryuWLSreml3WTAACAA08vT3n7+KliSJVydxoxt3IbuKSsMV2eXl5SOTw0CQAA /jzK5SlFAACA6wmBCwAAwGQELgAAAJMRuAAAAExG4AIAADAZgQsAAMBkBC4AAACTEbgAAABMRuAC AAAwGYELAADAZAQuAAAAkxG4AAAATEbgAgAAMBmBCwAAwGQELgAAAJMRuAAAAExG4AIAADAZgQsA AMBkBC4AAACTEbgAAABMRuACAAAwGYELAADAZAQuAAAAkxG4AAAATEbgAgAAMBmBCwAAwGQELgAA AJMRuAAAAExG4AIAADAZgQsAAMBkBC4AAACTEbgAAABMRuACAAAwGYELAADAZAQuAAAAkxG4AAAA TEbgAgAAMBmBCwAAwGQELgAAAJMRuAAAAExG4AIAADAZgQsAAMBkBC4AAACTEbgAAABMRuACAAAw GYELAADAZAQuAAAAkxG4AAAATEbgAgAAMBmBCwAAwGQELgAAAJMRuAAAAExG4AIAADAZgQsAAMBk BC4AAACTEbgAa1bXxgAABUhJREFUAABMRuACAAAwGYELAADAZAQuAAAAkxG4AAAATEbgAgAAMBmB CwAAwGQELgAAAJMRuAAAAExG4AIAADAZgQsAAMBkBC4AAACTEbgAAABMRuACAAAwGYELAADAZAQu AAAAkxG4AAAATEbgAgAAMBmBCwAAwGQELgAAAJMRuAAAAExG4AIAADAZgQsAAMBkBC4AAACTEbgA AABMRuACAAAwGYELAADAZAQuAAAAkxG4AAAATEbgAgAAMBmBCwAAwGQELgAAAJMRuAAAAExG4AIA ADAZgQsAAMBkBC4AAACTEbgAAABMRuACAAAwGYELAADAZAQuAAAAkxG4AAAATEbgAgAAMBmBCwAA wGQELgAAAJMRuAAAAExG4AIAADAZgQsAAMBkBC4AAACTEbgAAABMRuACAAAwGYELAADAZAQuAAAA kxG4AAAATEbgAgAAMBmBCwAAwGQELgAAAJMRuAAAAExG4AIAADAZgQsAAMBkBC4AAACTEbgAAABM RuACAAAwGYELAADAZAQuAAAAkxG4AAAATEbgAgAAMBmBCwAAwGQELgAAAJMRuAAAAExG4AIAADAZ gQsAAMBkBC4AAACTEbgAAABMdq0ClzUjM/PQNaoLAADAqexsYr0WdV2rwJVy/PjxHdeoLgAAAKey s0nKtajLVYHLyJ5skjIlZUhKV1ZqTJN0btasf8e6qC4AAIBSy84m55SVVazKyi4ZysoyNv2Rb0rN 4qIyLJLcJXlI8pTkLclHkq8kP0n+khrv2rWzZ0TNmgNdUCcAAECJHT5yZGmjRo1XSdopKUlSsrKO dqUqK4DlDl+lDl6uPqXoeKQrZ8qQdKJRo8abEhITNrq4TgAAgGJLSEzY2KhR402STuiPUJUzufTI Vg5XBC4j1785YStnyglbGZKuSDpYrVrYN4cOH/rKBfUCAABclUOHD31VrVrYN5IOKiub5OSUnLCV M+UOXaUOX+6lLSCXnFOLbg6Te67/p0tK/uCDDy/GX7wYXa9e3fOBgUHebm5uFV3YDgAAALuMzMxD R44e2TBp0pRljz76WJykQ5LilXXqMGf8VkFjuHKCV6m5YgxXTjm5A5an/hjLlXs8l0+uKURSJUmB 2Y+9XNQWAACAHFZljctKkHRBWUErNdeUe9xWztitdLk4dHmUtoBcjFxTprLCV4byHu2y5Jr3nKTL 2W3wUFYwAwAAcKU0/XHaMOdIVpryHt3KfWQr9yB5l43jcmXgkv4Yw2XRH+O3co5+WRzmyXndQ1lH xTJd3BYAAIBU5b9kVe7QlXNEy5RTiTlcFbgMh//nNDYncBUVtnICV4aL2gIAAJAjTXl/xJc7dOX8 P+c1xwHzLjvK5eojXFLe04pS/rCVE7jS9UfYInABAAAz5AQux9CV+8hWQacTXcrVY7hy2Ap4Lfdl I3KfSsz5FWO6C9sCAAAgZR3Byn190AzlDV+5w1ZBR7hcwqwjXFLBoStngXOOaOW+bARHuAAAgKul 64/84Xhh9kyH10y56KnkustCFFRm7utyOV42wvFaXRaZE/4AAMBfW4byX5i9oJDl8oud5mZG4Mpd rsVhcivk35x7MQIAALhS7nFZjuGqsAHyf4ojXI5lFxa+CgpjAAAArlRQqCoqZLk8bEnmBi7HOgoL YI7/BwAAcBXHUFVYwDIlaOW4liHHsS6Lw/8JXAAAwNUcB8E7BitTg1aOsg45ZV0/AAD467gm4QoA AAAAAAAAAAAAAAAAAAAAAAAAAAAAAAAAAAAAAAAAAAAAAAAAAAAAAAAAAAAAAAAAAAAAAAAA8Nf1 /9kfKhkabA/DAAAAAElFTkSuQmCC "
       id="image2612"
       x="178.85832"
       y="106.49996" />
  </g>
</svg>
