module github.com/Debian/dh-make-golang

go 1.13

require (
	github.com/google/go-github/v38 v38.1.0
	github.com/gregjones/httpcache v0.0.0-20190611155906-901d90724c79
	github.com/mattn/go-isatty v0.0.10
	github.com/russross/blackfriday v1.5.2
	golang.org/x/net v0.0.0-20190724013045-ca1201d0de80
	golang.org/x/sync v0.0.0-20190423024810-112230192c58
	golang.org/x/tools v0.0.0-20190731163215-a81e99d7481f
)
