{
  "extensionName": {
    "message": "Display Mail User Agent T",
    "description": "Name of the extension."
  },

  "extensionDescription": {
    "message": "Показва програмата използвана за изпращане на писмото",
    "description": "Description of the add-on."
  }
}
