{
  "extensionName": {
    "message": "Display Mail User Agent T",
    "description": "Name of the extension."
  },

  "extensionDescription": {
    "message": "Zobrazí poštového klienta v ktorom bola zobrazená správa napísaná",
    "description": "Description of the add-on."
  }
}
