{
  "extensionName": {
    "message": "Display Mail User Agent T",
    "description": "Name of the extension."
  },

  "extensionDescription": {
    "message": "Приказује програм за е-пошту којим је одабрана е-порука написана.",
    "description": "Description of the add-on."
  }
}
