{
  "extensionName": {
    "message": "Display Mail User Agent T",
    "description": "Name of the extension."
  },

  "extensionDescription": {
    "message": "Muestra el programa de correo con el que se escribió el mensaje seleccionado",
    "description": "Description of the add-on."
  }
}
