/* XPM */
static char *movieplay[] = {
/* columns rows colors chars-per-pixel */
"9 9 2 1",
"X c #000000",
"  c None",
/* pixels */
"X        ",
"XXX      ",
"XXXXX    ",
"XXXXXXX  ",
"XXXXXXXXX",
"XXXXXXX  ",
"XXXXX    ",
"XXX      ",
"X        "
};
