<svg width="10" height="10" xmlns="http://www.w3.org/2000/svg">
 <g>
  <title>Layer 1</title>
  <line x1="0" y1="5" x2="10" y2="5" stroke-width="1" stroke="#000" />
  <line x1="5" y1="0" x2="5" y2="10" stroke-width="1" stroke="#000" />
 </g>
</svg>
