/* XPM */
static char *mpe_xpm[] = {
/* width height ncolors chars_per_pixel */
"115 109 17 1",
"  c #505050",
". c #404040",
"+ c #000000",
"@ c #707070",
"# c #202020",
"$ c #303030",
"% c #101010",
"& c #606060",
"* c #7f7f7f",
"= c #bfbfbf",
"- c None",
"; c #9f9f9f",
"> c #dfdfdf",
", c #afafaf",
"' c #cfcfcf",
") c #8f8f8f",
"! c #efefef",
"----------------------------------------------------------------------------------------------';* ......*,!--------",
"------------------------------------------------------------------------------------------'*.++++++++++++++ =------",
"---------------------------------------------------------------------------------------'@#+++++++++++++++++++@!----",
"------------------------------------------------------------------------------------>*#+++++++++++++++++++++++$!---",
"----------------------------------------------------------------------------------= +++++++++++++++++++++++++++$---",
"--------------------------------------------------------------------------------;$++++++++++++++++++++++++++++++*--",
"------------------------------------------------------------------------------;#++++++++++++++++++++++++++++++++%!-",
"----------------------------------------------------------------------------;#+++++++++$....$++++++++++++++++++++)-",
"--------------------------------------------------------------------------,#+++++#&)=!--------'; ++++++++++++++++$-",
"------------------------------------------------------------------------=.++++ )>---------------->*+++++++++++++++-",
"----------------------------------------------------------------------!&+++.;!--------------------->.+++++++++++++=",
"---------------------------------------------------------------------)%+%@>--------------------------&++++++++++++=",
"-------------------------------------------------------------------=$+#;------------------------------&+++++++++++)",
"-----------------------------------------------------------------!@+.=---------------------------------$++++++++++*",
"----------------------------------------------------------------=#.=-----------------------------------'++++++++++,",
"--------------------------------------------------------------!@$=--------------------------------------&+++++++++=",
"-------------------------------------------------------------=.;---------------------------------------->+++++++++=",
"------------------------------------------------------------>*!------------------------------------------$++++++++-",
"---------------------------------------------------------------------------------------------------------*+++++++#-",
"---------------------------------------------------------------------------------------------------------=+++++++ -",
"---------------------------------------------------------------------------------------------------------!+++++++)-",
"----------------------------------------------------------------------------------------------------------+++++++'-",
"----------------------------------------------------------------------------------------------------------++++++#--",
"----------------------------------------------------------------------------------------------------------++++++&--",
"----------------------------------------------------------------------------------------------------------++++++,--",
"----------------------------------------------------------------------------------------------------------+++++#---",
"----------------------------------------------------------------------------------------------------------+++++@---",
"---------------------------------------------------------------------------------------------------------'+++++>---",
"---------------------------------------------------------------------------------------------------------,++++.----",
"---------------------------------------------------------------------------------------------------------*++++,----",
"--------------------------------------------------->=** .... **=!---------------------------------------- +++#-----",
"-----------------------------------------------!; %++++++++++++++#&;!------------------------------------%+++;-----",
"---------------------------------------------; ++++++++++++++++++++++&=---------------------------------'+++#------",
"------------------------------------------!*%++++++++++++++++++++++++++#;-------------------------------)+++;------",
"----------------------------------------!*%++++++++++++++++++++++++++++++#=-----------------------------$++#-------",
"---------------------------------------)%++++++++++++++++++++++++++++++++++ !-------------------------->+++;-------",
"-------------------------------------'$+++++++++++++++++++++++++++++++++++++%,-------------------------)++$--------",
"------------------------------------*+++++++++++++++++++++++++++++++++++++++++*------------------------#++=--------",
"----------------------------------!.+++++++++++++++++++++++++++++++++++++++++++&----------------------=++ ---------",
"---------------------------------'%+++++++++++++$.&**)=========*** .#+++++++++++&---------------------&++>---------",
"--------------------------------;+++++++++$&*=>-----------------------',*.%++++++&------------------->++*----------",
"-------------------------------*++++++#@,!---------------------------------')$++++;------------------@+#!----------",
"------------------------------&++++#@'---------------------------------------->*#++'----------------!%+=-----------",
"-----------------------------&+++&=----------------------------------------------;%.----------------*+&------------",
"----------------------------&++&>-------------------------------------------------! =--------------!%%!------------",
"---------------------------&+.>-----------------------------------------------------!--------------@+,-------------",
"--------------------------)%)--------------------------------------------------------------------->+ --------------",
"-------------------------;$'---------------------------------------------------------------------- #!--------------",
"------------------------'$!---*+++++@----------=+++++.--*++++++++%.)>---.+++++++++++.------------=+=---------------",
"----------------------->.!----*++++++'---------#+++++.--*++++++++++++;--.+++++++++++.------------#@----------------",
"----------------------- !-----*++++++$--------*++++++.--*+++++++++++++,-.+++++++++++.-----------*$-----------------",
"----------------------&'------*+++++++*------>+++++++.--*+++.---!;%+++$-.+++*------------------'%>-----------------",
"---------------------;)-------*+++++++%>-----.+++%+++.--*+++.-----*++++-.+++*------------------$;------------------",
"--------------------'.--------*+++.$+++.----)++++)+++.--*+++.---';%+++$-.+++.*******;---------*&-------------------",
"-------------------!#!--------*+++.=++++,--!%+++*=+++.--*+++++++++++++=-.+++++++++++.--------'$!-------------------",
"-------------------.,---------*+++.-@+++%!- +++#!=+++.--*+++++++++++#=--.+++++++++++.-------!.>--------------------",
"------------------* ----------*+++.-!%+++@=++++=-,+++.--*+++++++%.&,----.+++.*******;-------@,---------------------",
"-----------------=%!----------*+++.--,++++%+++&--*+++.--*+++.-----------.+++*--------------,*----------------------",
"----------------!%,-----------*+++.---.++++++%!--*+++.--*+++.-----------.+++*-------------'&-----------------------",
"---------------- .------------*+++.--->%+++++;---*+++.--*+++.-----------.+++#.......@----!&!-----------------------",
"---------------)+>------------*+++.----)++++.----*+++.--*+++.-----------.+++++++++++.---!.'------------------------",
"-------------->%*-------------*+++.-----$+++>----*+++.--*+++.-----------.+++++++++++.--'%'-------------------------",
"--------------.%!------------->==='----->=='----->==='-->==='-----------'==========='-)+;--------------------------",
"-------------*+)--------------------------------------------------------------------'.+;---------------------------",
"------------>+#---------------)*-------------------------------------------------->&++*----------------------------",
"------------.+;---------------!%$=----------------------------------------------= +++&-----------------------------",
"-----------)+#-----------------,++.;-----------------------------------------'@#++++;------------------------------",
"----------!%+;------------------&+++%&;>---------------------------------!,@#++++++;-------------------------------",
"---------- +%-------------------!$++++++#&)=!-----------------------!=)&$++++++++%,--------------------------------",
"---------=++*--------------------!$+++++++++++..***===========***..+++++++++++++#'---------------------------------",
"---------$++>---------------------!$+++++++++++++++++++++++++++++++++++++++++++ !----------------------------------",
"--------)++ -----------------------! ++++++++++++++++++++++++++++++++++++++++%)------------------------------------",
"-------!%++,-------------------------*++++++++++++++++++++++++++++++++++++++.>-------------------------------------",
"-------*++%---------------------------'$++++++++++++++++++++++++++++++++++%;---------------------------------------",
"------!%++&-----------------------------*%++++++++++++++++++++++++++++++%*!----------------------------------------",
"------&+++,------------------------------!*%++++++++++++++++++++++++++%*!------------------------------------------",
"----->++++!--------------------------------!;$++++++++++++++++++++++ ;---------------------------------------------",
"-----*+++.------------------------------------>).+++++++++++++++% ;!-----------------------------------------------",
"----!%+++*----------------------------------------';* ......@*,>---------------------------------------------------",
"----*++++,---------------------------------------------------------------------------------------------------------",
"----#++++>---------------------------------------------------------------------------------------------------------",
"---,+++++----------------------------------------------------------------------------------------------------------",
"--- ++++#----------------------------------------------------------------------------------------------------------",
"--!+++++.----------------------------------------------------------------------------------------------------------",
"--)+++++.----------------------------------------------------------------------------------------------------------",
"--$+++++.----------------------------------------------------------------------------------------------------------",
"-!++++++.----------------------------------------------------------------------------------------------------------",
"-;++++++.----------------------------------------------------------------------------------------------------------",
"-&++++++%----------------------------------------------------------------------------------------------------------",
"-#+++++++!---------------------------------------------------------------------------------------------------------",
"-++++++++,---------------------------------------------------------------------------------------------------------",
"=++++++++&------------------------------------------!@-------------------------------------------------------------",
";++++++++%-----------------------------------------).'-------------------------------------------------------------",
"*+++++++++;--------------------------------------;#@!--------------------------------------------------------------",
"*+++++++++#!-----------------------------------=.#=----------------------------------------------------------------",
"*++++++++++@---------------------------------,.+*------------------------------------------------------------------",
"*+++++++++++;------------------------------;#+.'-------------------------------------------------------------------",
"*++++++++++++;-------------------------->@%+%;---------------------------------------------------------------------",
")+++++++++++++@!---------------------!;.+++@!----------------------------------------------------------------------",
"=++++++++++++++#;----------------->) ++++.>------------------------------------------------------------------------",
"-++++++++++++++++%&,!---------=)&#+++++$=--------------------------------------------------------------------------",
"- +++++++++++++++++++%......%++++++++#;----------------------------------------------------------------------------",
"-=+++++++++++++++++++++++++++++++++#;------------------------------------------------------------------------------",
"--.++++++++++++++++++++++++++++++.;--------------------------------------------------------------------------------",
"-->%+++++++++++++++++++++++++++&=----------------------------------------------------------------------------------",
"---'%+++++++++++++++++++++++#)>------------------------------------------------------------------------------------",
"---->$+++++++++++++++++++#@'---------------------------------------------------------------------------------------",
"------;#++++++++++++++.*'------------------------------------------------------------------------------------------",
"--------') .#++#..@)=----------------------------------------------------------------------------------------------",
};
