/* XPM */
static char *editpaste[] = {
/* width height ncolors chars_per_pixel */
"22 22 7 1",
"  c #000000",
". c #ffff00",
"+ c #808000",
"@ c #000080",
"# c #ffffff",
"$ c #aca899",
"% c None",
"%%%%%%%%%%%%%%%%%%%%%%",
"%%%%%%%%%%%%%%%%%%%%%%",
"%%%%%%%%%%%%%%%%%%%%%%",
"%%%%%%%%%%%%%%%%%%%%%%",
"%%%%%%%%    %%%%%%%%%%",
"%%%%     ..     %%%%%%",
"%%% $+$ .  . +$+ %%%%%",
"%%% +$ %%%%%% +$ %%%%%",
"%%% $+        $+ %%%%%",
"%%% +$+$+$+$+$+$ %%%%%",
"%%% $+$+$@@@@@@@ %%%%%",
"%%% +$+$+@#####@@%%%%%",
"%%% $+$+$@#####@#@%%%%",
"%%% +$+$+@#@@@#@@@%%%%",
"%%% $+$+$@#######@%%%%",
"%%% +$+$+@#@@@@@#@%%%%",
"%%%%     @#######@%%%%",
"%%%%%%%%%@@@@@@@@@%%%%",
"%%%%%%%%%%%%%%%%%%%%%%",
"%%%%%%%%%%%%%%%%%%%%%%",
"%%%%%%%%%%%%%%%%%%%%%%",
"%%%%%%%%%%%%%%%%%%%%%%",
};