/* XPM */
static char *cursor_select[] = {
/* columns rows colors chars-per-pixel */
"32 32 3 1 ",
"  c white",
"o c black",
"& c None",
/* pixels */
"&&&&&&&&&&&&&&&&&&&&&&&&&&&&&&&&",
"&&&&&&&&&&&&&&&&&&&&&&&&&&&&&&&&",
"&&&&&&&&&&&&&&&&&&&&&&&&&&&&&&&&",
"&&&&&&&&&&&&&&&o o&&&&&&&&&&&&&&",
"&&&&&&&&&&&&&&&o o&&&&&&&&&&&&&&",
"&&&&&&&&&&&&&&&o o&&&&&&&&&&&&&&",
"&&&&&&&&&&&&&       &&&&&&&&&&&&",
"&&&&&&&&&&&  &&o o&&  &&&&&&&&&&",
"&&&&&&&&&  &&&oo oo&&&  &&&&&&&&",
"&&&&&&&& &&&oo&o o&oo&&& &&&&&&&",
"&&&&&&& &&oo&&&o o&&&oo&& &&&&&&",
"&&&&&&  &o&&&&&o o&&&&&o&  &&&&&",
"&&&&&& &&o&&&&&&&&&&&&&o&& &&&&&",
"&&&&&  &o&&&&&&&&&&&&&&&o&  &&&&",
"&&&&& &&o&&&&&&&&&&&&&&&o&& &&&&",
"&&ooo oooooo&&&&&&&&&&ooooo ooo&",
"&&          &&&&&&&&&&         &",
"&&ooo oooooo&&&&&&&&&&ooooo ooo&",
"&&&&& &&o&&&&&&&&&&&&&&&o&& &&&&",
"&&&&&  &o&&&&&&&&&&&&&&&o&  &&&&",
"&&&&&& &&o&&&&&&&&&&&&&o&& &&&&&",
"&&&&&&  &o&&&&&o o&&&&&o&  &&&&&",
"&&&&&&& &&oo&&&o o&&&oo&& &&&&&&",
"&&&&&&&& &&&oo&o o&oo&&& &&&&&&&",
"&&&&&&&&&  &&&oo oo&&&  &&&&&&&&",
"&&&&&&&&&&&  &&o o&&  &&&&&&&&&&",
"&&&&&&&&&&&&&       &&&&&&&&&&&&",
"&&&&&&&&&&&&&&&o o&&&&&&&&&&&&&&",
"&&&&&&&&&&&&&&&o o&&&&&&&&&&&&&&",
"&&&&&&&&&&&&&&&o o&&&&&&&&&&&&&&",
"&&&&&&&&&&&&&&&&&&&&&&&&&&&&&&&&",
"&&&&&&&&&&&&&&&&&&&&&&&&&&&&&&&&"
};
