{
    "description": "dput-ng configuration file",
    "properties": {
        "allow_dcut": {
            "type": "boolean"
        },
        "allow_unsigned_uploads": {
            "type": "boolean"
        },
        "allowed_distributions": {
            "type": "string"
        },
        "default_host_main": {
            "blank": true,
            "type": "string"
        },
        "distributions": {
            "type": "string"
        },
        "fqdn": {
            "type": "string"
        },
        "full_upload_log": {
            "type": "boolean"
        },
        "hash": {
            "type": "string"
        },
        "hooks": {
            "items": {
                "type": "string"
            },
            "type": "array"
        },
        "incoming": {
            "blank": true,
            "type": "string"
        },
        "interface": {
            "type": "string"
        },
        "login": {
            "type": "string"
        },
        "meta": {
            "type": "string"
        },
        "method": {
            "type": "string"
        },
        "passive_ftp": {
            "type": "boolean"
        },
        "post_upload_command": {
            "blank": true,
            "type": "string"
        },
        "pre_upload_command": {
            "blank": true,
            "type": "string"
        },
        "run_lintian": {
            "type": "boolean"
        }
    },
    "type": "object",
    "required": [ "incoming", "method" ]
}
