<?xml version="1.0" encoding="UTF-8" standalone="no"?>
<svg
   version="1.0"
   width="128"
   height="128"
   id="svg3331"
   sodipodi:docname="libreoffice-writer.svg"
   inkscape:version="1.1.2 (0a00cf5339, 2022-02-04)"
   xmlns:inkscape="http://www.inkscape.org/namespaces/inkscape"
   xmlns:sodipodi="http://sodipodi.sourceforge.net/DTD/sodipodi-0.dtd"
   xmlns:xlink="http://www.w3.org/1999/xlink"
   xmlns="http://www.w3.org/2000/svg"
   xmlns:svg="http://www.w3.org/2000/svg"
   xmlns:rdf="http://www.w3.org/1999/02/22-rdf-syntax-ns#"
   xmlns:cc="http://creativecommons.org/ns#"
   xmlns:dc="http://purl.org/dc/elements/1.1/">
  <sodipodi:namedview
     id="namedview53"
     pagecolor="#ffffff"
     bordercolor="#666666"
     borderopacity="1.0"
     inkscape:pageshadow="2"
     inkscape:pageopacity="0.0"
     inkscape:pagecheckerboard="0"
     showgrid="false"
     inkscape:zoom="2.6640625"
     inkscape:cx="61.747801"
     inkscape:cy="70.944282"
     inkscape:window-width="1317"
     inkscape:window-height="890"
     inkscape:window-x="674"
     inkscape:window-y="69"
     inkscape:window-maximized="0"
     inkscape:current-layer="svg3331" />
  <metadata
     id="metadata143580">
    <rdf:RDF>
      <cc:Work
         rdf:about="">
        <dc:format>image/svg+xml</dc:format>
        <dc:type
           rdf:resource="http://purl.org/dc/dcmitype/StillImage" />
      </cc:Work>
    </rdf:RDF>
  </metadata>
  <defs
     id="defs3333">
    <linearGradient
       id="linearGradient3702-501-757">
      <stop
         id="stop2895"
         style="stop-color:#181818;stop-opacity:0"
         offset="0" />
      <stop
         id="stop2897"
         style="stop-color:#181818;stop-opacity:1"
         offset="0.5" />
      <stop
         id="stop2899"
         style="stop-color:#181818;stop-opacity:0"
         offset="1" />
    </linearGradient>
    <linearGradient
       x1="25.058096"
       y1="47.027729"
       x2="25.058096"
       y2="39.999443"
       id="linearGradient2877-634-617"
       xlink:href="#linearGradient3702-501-757"
       gradientUnits="userSpaceOnUse" />
    <linearGradient
       id="linearGradient3688-464-309">
      <stop
         id="stop2889"
         style="stop-color:#181818;stop-opacity:1"
         offset="0" />
      <stop
         id="stop2891"
         style="stop-color:#181818;stop-opacity:0"
         offset="1" />
    </linearGradient>
    <radialGradient
       cx="4.9929786"
       cy="43.5"
       r="2.5"
       fx="4.9929786"
       fy="43.5"
       id="radialGradient2875-742-326"
       xlink:href="#linearGradient3688-464-309"
       gradientUnits="userSpaceOnUse"
       gradientTransform="matrix(2.003784,0,0,1.4,-20.01187,-104.4)" />
    <linearGradient
       id="linearGradient3688-166-749">
      <stop
         id="stop2883"
         style="stop-color:#181818;stop-opacity:1"
         offset="0" />
      <stop
         id="stop2885"
         style="stop-color:#181818;stop-opacity:0"
         offset="1" />
    </linearGradient>
    <radialGradient
       cx="4.9929786"
       cy="43.5"
       r="2.5"
       fx="4.9929786"
       fy="43.5"
       id="radialGradient2873-966-168"
       xlink:href="#linearGradient3688-166-749"
       gradientUnits="userSpaceOnUse"
       gradientTransform="matrix(2.003784,0,0,1.4,27.98813,-17.4)" />
    <linearGradient
       id="linearGradient3308-4-6-931-761">
      <stop
         id="stop2919"
         style="stop-color:#ffffff;stop-opacity:1"
         offset="0" />
      <stop
         id="stop2921"
         style="stop-color:#ffffff;stop-opacity:0"
         offset="1" />
    </linearGradient>
    <linearGradient
       xlink:href="#linearGradient3308-4-6-931-761"
       id="linearGradient3039"
       gradientUnits="userSpaceOnUse"
       gradientTransform="matrix(2.729731,0,0,2.7297285,-1.513514,1.4865182)"
       x1="23.99999"
       y1="4.999989"
       x2="23.99999"
       y2="43" />
    <linearGradient
       inkscape:collect="always"
       id="linearGradient36984">
      <stop
         style="stop-color:#3689e6;stop-opacity:1"
         offset="0"
         id="stop36980" />
      <stop
         style="stop-color:#64baff;stop-opacity:1"
         offset="1"
         id="stop36982" />
    </linearGradient>
    <linearGradient
       inkscape:collect="always"
       xlink:href="#linearGradient36984"
       id="linearGradient1136"
       x1="16.476357"
       y1="63.728039"
       x2="16.476357"
       y2="6.6716003"
       gradientUnits="userSpaceOnUse"
       gradientTransform="matrix(1.8727273,0,0,1.8727273,4.0727275,7.0727249)" />
    <linearGradient
       inkscape:collect="always"
       id="linearGradient22029">
      <stop
         style="stop-color:#dedede;stop-opacity:1"
         offset="0"
         id="stop22025" />
      <stop
         style="stop-color:#fafafa;stop-opacity:1"
         offset="1"
         id="stop22027" />
    </linearGradient>
    <linearGradient
       inkscape:collect="always"
       xlink:href="#linearGradient22029"
       id="linearGradient1850"
       x1="19.924658"
       y1="60.550831"
       x2="19.924658"
       y2="11.291978"
       gradientUnits="userSpaceOnUse"
       gradientTransform="matrix(1.9999964,0,0,2.008692,7.0000024e-6,2.4608829)" />
    <radialGradient
       xlink:href="#linearGradient3688-464-309"
       id="radialGradient4093"
       gradientUnits="userSpaceOnUse"
       gradientTransform="matrix(2.003784,0,0,1.4,27.98813,-17.4)"
       cx="4.9929786"
       cy="43.5"
       fx="4.9929786"
       fy="43.5"
       r="2.5" />
    <radialGradient
       xlink:href="#linearGradient3688-464-309"
       id="radialGradient4095"
       gradientUnits="userSpaceOnUse"
       gradientTransform="matrix(2.003784,0,0,1.4,-20.01187,-104.4)"
       cx="4.9929786"
       cy="43.5"
       fx="4.9929786"
       fy="43.5"
       r="2.5" />
    <linearGradient
       xlink:href="#linearGradient3702-501-757"
       id="linearGradient4097"
       gradientUnits="userSpaceOnUse"
       x1="25.058096"
       y1="47.027729"
       x2="25.058096"
       y2="39.999443" />
  </defs>
  <g
     transform="matrix(2.6999989,0,0,0.55555607,-0.800001,94.88888)"
     id="g2036"
     style="display:inline">
    <g
       transform="matrix(1.052632,0,0,1.285713,-1.263158,-13.42854)"
       id="g3712"
       style="opacity:0.4">
      <rect
         width="5"
         height="7"
         x="38"
         y="40"
         id="rect2801"
         style="fill:url(#radialGradient4093);fill-opacity:1;stroke:none" />
      <rect
         width="5"
         height="7"
         x="-10"
         y="-47"
         transform="scale(-1)"
         id="rect3696"
         style="fill:url(#radialGradient4095);fill-opacity:1;stroke:none" />
      <rect
         width="28"
         height="7.0000005"
         x="10"
         y="40"
         id="rect3700"
         style="fill:url(#linearGradient4097);fill-opacity:1;stroke:none" />
    </g>
  </g>
  <rect
     style="color:#000000;display:inline;overflow:visible;visibility:visible;fill:url(#linearGradient1136);fill-opacity:1;fill-rule:nonzero;stroke:#002e99;stroke-width:0.999995;stroke-linecap:round;stroke-linejoin:round;stroke-miterlimit:4;stroke-dasharray:none;stroke-dashoffset:0;stroke-opacity:0.501961;marker:none;enable-background:accumulate"
     id="rect5505-21"
     y="15.499997"
     x="12.5"
     ry="5.2820516"
     rx="5.2820516"
     height="103"
     width="103" />
  <rect
     style="opacity:0.4;fill:none;stroke:url(#linearGradient3039);stroke-width:0.999993;stroke-linecap:round;stroke-linejoin:round;stroke-miterlimit:4;stroke-dasharray:none;stroke-dashoffset:0;stroke-opacity:1"
     id="rect6741"
     y="16.499998"
     x="13.5"
     ry="3.8113203"
     rx="3.8113208"
     height="101"
     width="101" />
  <path
     d="M 18.5,21.499997 H 83.999856 L 109.5,46.652106 V 112.5 h -91 z"
     style="opacity:1;fill:url(#linearGradient1850);fill-opacity:1;stroke:#002e99;stroke-width:0.999999px;stroke-linecap:butt;stroke-linejoin:miter;stroke-opacity:0.501961;paint-order:normal"
     id="path3872"
     sodipodi:nodetypes="cccccc" />
  <path
     id="path3978"
     d="m 32.000001,76 h 64 v -1 h -64 z"
     style="fill:#3689e6;fill-opacity:1;stroke:none;stroke-width:0.999997"
     sodipodi:nodetypes="ccccc" />
  <path
     id="path3982"
     d="M 32,58 H 57 V 57 H 32 Z"
     style="fill:#3689e6;fill-opacity:1;stroke:none;stroke-width:0.999997"
     sodipodi:nodetypes="ccccc" />
  <g
     id="path2720"
     transform="matrix(2.4999954,0,0,2.1521699,11.065251,-12.708515)"
     style="fill:#3098fa;fill-opacity:1;stroke-width:0.431114">
    <path
       style="color:#000000;fill:#3689e6;fill-opacity:1;stroke-width:0.431114px;-inkscape-stroke:none"
       d="m 24.24061,33.186414 2.166671,3.6508 3.666673,-6.305928 3.500007,6.96971 H 21.573939 Z"
       id="path10475"
       sodipodi:nodetypes="cccccc" />
  </g>
  <rect
     style="fill:none;fill-opacity:1;stroke:#3689e6;stroke-width:1;stroke-linejoin:round;stroke-miterlimit:4;stroke-dasharray:none;stroke-opacity:1"
     id="rect1235"
     width="30.999998"
     height="21"
     x="64.5"
     y="47.5"
     rx="0.95068359"
     ry="0.97260439" />
  <path
     style="fill:#3689e6;fill-opacity:1;stroke:none;stroke-width:0.999997"
     d="M 32,49 H 57 V 48 H 32 Z"
     id="path6746"
     sodipodi:nodetypes="ccccc" />
  <path
     id="path6802"
     d="M 32,67 H 57 V 66 H 32 Z"
     style="fill:#3689e6;fill-opacity:1;stroke:none;stroke-width:0.999997"
     sodipodi:nodetypes="ccccc" />
  <path
     id="path7918"
     d="m 32.000001,85 h 64 v -1 h -64 z"
     style="fill:#3689e6;fill-opacity:1;stroke:none;stroke-width:0.999997"
     sodipodi:nodetypes="ccccc" />
  <path
     id="path9869"
     d="m 32.000001,94 h 64 v -1 h -64 z"
     style="fill:#3689e6;fill-opacity:1;stroke:none;stroke-width:0.999997"
     sodipodi:nodetypes="ccccc" />
  <g
     id="g10492"
     style="fill:#ffffff;fill-opacity:1">
    <path
       id="path10473"
       d="m 32.000001,77 h 64 v -1 h -64 z"
       style="fill:#ffffff;fill-opacity:1;stroke:none;stroke-width:0.999997"
       sodipodi:nodetypes="ccccc" />
    <path
       id="path10476"
       d="M 32,59 H 57 V 58 H 32 Z"
       style="fill:#ffffff;fill-opacity:1;stroke:none;stroke-width:0.999997"
       sodipodi:nodetypes="ccccc" />
    <path
       style="fill:#ffffff;fill-opacity:1;stroke:none;stroke-width:0.999997"
       d="M 32,50 H 57 V 49 H 32 Z"
       id="path10478"
       sodipodi:nodetypes="ccccc" />
    <path
       id="path10480"
       d="M 32,68 H 57 V 67 H 32 Z"
       style="fill:#ffffff;fill-opacity:1;stroke:none;stroke-width:0.999997"
       sodipodi:nodetypes="ccccc" />
    <path
       id="path10482"
       d="m 32.000001,86 h 64 v -1 h -64 z"
       style="fill:#ffffff;fill-opacity:1;stroke:none;stroke-width:0.999997"
       sodipodi:nodetypes="ccccc" />
    <path
       id="path10484"
       d="m 32.000001,95 h 64 v -1 h -64 z"
       style="fill:#ffffff;fill-opacity:1;stroke:none;stroke-width:0.999997"
       sodipodi:nodetypes="ccccc" />
  </g>
  <path
     style="fill:#ffffff;fill-opacity:1;stroke:none;stroke-width:0.999997"
     d="M 65,70 H 95 V 69 H 65 Z"
     id="path10656"
     sodipodi:nodetypes="ccccc" />
</svg>
