<?xml version="1.0" encoding="UTF-8" standalone="no"?>
<!-- Created with Inkscape (http://www.inkscape.org/) -->
<svg
   xmlns:dc="http://purl.org/dc/elements/1.1/"
   xmlns:cc="http://creativecommons.org/ns#"
   xmlns:rdf="http://www.w3.org/1999/02/22-rdf-syntax-ns#"
   xmlns:svg="http://www.w3.org/2000/svg"
   xmlns="http://www.w3.org/2000/svg"
   xmlns:xlink="http://www.w3.org/1999/xlink"
   xmlns:sodipodi="http://inkscape.sourceforge.net/DTD/sodipodi-0.dtd"
   xmlns:inkscape="http://www.inkscape.org/namespaces/inkscape"
   sodipodi:docname="plugin_clip.svg"
   sodipodi:docbase="/home/maker/Projects/e2work/icons-new/icon-work"
   inkscape:version="0.43"
   sodipodi:version="0.32"
   id="svg2"
   height="48.000000px"
   width="48.000000px"
   inkscape:export-filename="/home/maker/Projects/e2work/icons-new/plugin_clip_48.png"
   inkscape:export-xdpi="90.000000"
   inkscape:export-ydpi="90.000000">
  <defs
     id="defs3">
    <linearGradient
       id="linearGradient1535">
      <stop
         style="stop-color:#8a8a8a;stop-opacity:1.0000000;"
         offset="0.0000000"
         id="stop1536" />
      <stop
         style="stop-color:#cecece;stop-opacity:1.0000000;"
         offset="1.0000000"
         id="stop1537" />
    </linearGradient>
    <linearGradient
       y2="94.261762"
       x2="241.72007"
       y1="311.08374"
       x1="337.71333"
       spreadMethod="reflect"
       gradientTransform="matrix(4.077426e-2,0.000000,0.000000,3.124218e-2,22.90202,9.795452e-2)"
       gradientUnits="userSpaceOnUse"
       id="linearGradient1323"
       xlink:href="#linearGradient1535"
       inkscape:collect="always" />
    <linearGradient
       gradientUnits="userSpaceOnUse"
       gradientTransform="matrix(1.797260,0.000000,0.000000,0.176533,21.18159,7.766546)"
       y2="36.981618"
       x2="18.433590"
       y1="31.658856"
       x1="14.937930"
       id="linearGradient612"
       xlink:href="#linearGradient584" />
    <linearGradient
       id="linearGradient584">
      <stop
         id="stop585"
         offset="0.00000000"
         style="stop-color:#ffffff;stop-opacity:1;" />
      <stop
         id="stop586"
         offset="1.00000000"
         style="stop-color:#ffffff;stop-opacity:0;" />
    </linearGradient>
    <linearGradient
       gradientUnits="userSpaceOnUse"
       gradientTransform="matrix(0.612621,0.000000,0.000000,0.517900,21.18159,7.766546)"
       y2="20.939441"
       x2="42.547944"
       y1="5.0095384"
       x1="26.906364"
       id="linearGradient583"
       xlink:href="#linearGradient584" />
    <linearGradient
       id="linearGradient578">
      <stop
         id="stop579"
         offset="0.0000000"
         style="stop-color:#484cbf;stop-opacity:1.0000000;" />
      <stop
         id="stop580"
         offset="1.0000000"
         style="stop-color:#68667f;stop-opacity:1.0000000;" />
    </linearGradient>
    <linearGradient
       gradientUnits="userSpaceOnUse"
       gradientTransform="matrix(0.632871,0.000000,0.000000,0.501329,21.18159,7.766516)"
       y2="35.985016"
       x2="57.566818"
       y1="3.2594952"
       x1="24.088284"
       id="linearGradient581"
       xlink:href="#linearGradient578" />
    <linearGradient
       gradientUnits="userSpaceOnUse"
       gradientTransform="matrix(0.571216,0.000000,0.000000,0.555441,24.77656,16.01462)"
       y2="42.924896"
       x2="24.273980"
       y1="23.152065"
       x1="4.8590281"
       id="linearGradient2617"
       xlink:href="#linearGradient584"
       inkscape:collect="always" />
    <linearGradient
       gradientUnits="userSpaceOnUse"
       gradientTransform="matrix(0.632864,0.000000,0.000000,0.501335,24.77656,16.01459)"
       y2="56.905662"
       x2="36.495159"
       y1="23.134740"
       x1="1.9471697"
       id="linearGradient2619"
       xlink:href="#linearGradient578"
       inkscape:collect="always" />
  </defs>
  <sodipodi:namedview
     inkscape:window-y="175"
     inkscape:window-x="109"
     inkscape:window-height="684"
     inkscape:window-width="953"
     showgrid="true"
     inkscape:current-layer="layer1"
     inkscape:document-units="px"
     inkscape:cy="27.356903"
     inkscape:cx="20.257927"
     inkscape:zoom="1"
     inkscape:pageshadow="2"
     inkscape:pageopacity="0.0"
     borderopacity="1.0"
     bordercolor="#666666"
     pagecolor="#ffffff"
     id="base"
     showborder="true" />
  <metadata
     id="metadata4">
    <rdf:RDF>
      <cc:Work
         rdf:about="">
        <dc:format>image/svg+xml</dc:format>
        <dc:type
           rdf:resource="http://purl.org/dc/dcmitype/StillImage" />
        <dc:subject>
          <rdf:Bag>
            <rdf:li>plugin</rdf:li>
          </rdf:Bag>
        </dc:subject>
        <cc:license
           rdf:resource="http://creativecommons.org/licenses/by-sa/3.0/" />
      </cc:Work>
      <cc:License
         rdf:about="http://creativecommons.org/licenses/by-sa/3.0/">
        <cc:permits
           rdf:resource="http://creativecommons.org/ns#Reproduction" />
        <cc:permits
           rdf:resource="http://creativecommons.org/ns#Distribution" />
        <cc:requires
           rdf:resource="http://creativecommons.org/ns#Notice" />
        <cc:permits
           rdf:resource="http://creativecommons.org/ns#DerivativeWorks" />
        <cc:requires
           rdf:resource="http://creativecommons.org/ns#ShareAlike" />
        <cc:requires
           rdf:resource="http://creativecommons.org/ns#SourceCode" />
      </cc:License>
    </rdf:RDF>
  </metadata>
  <g
     id="layer1"
     inkscape:groupmode="layer"
     inkscape:label="Layer 1">
    <g
       id="g2531"
       transform="translate(-23.99999,9.000009)">
      <path
         style="fill:none;fill-opacity:1;fill-rule:evenodd;stroke:#2d2d4b;stroke-width:3.99999905;stroke-linecap:square;stroke-linejoin:round;stroke-miterlimit:4;stroke-dasharray:none;stroke-opacity:1"
         d="M 28.195262,32.24316 L 40.082957,25.70926 L 26.999993,16.999996 L 26.999993,35.999991 L 40.99999,35.999991"
         id="path1461"
         sodipodi:nodetypes="ccccc" />
      <path
         sodipodi:nodetypes="ccccc"
         id="path2205"
         d="M 28.187697,32.207792 L 39.911451,25.701814 L 26.999989,16.999995 L 26.999989,35.99999 L 40.999985,35.99999"
         style="fill:none;fill-opacity:1;fill-rule:evenodd;stroke:#26198c;stroke-width:1.9999994;stroke-linecap:square;stroke-linejoin:round;stroke-miterlimit:4;stroke-dasharray:none;stroke-opacity:1" />
    </g>
  </g>
  <g
     inkscape:label="overlay"
     id="layer2"
     inkscape:groupmode="layer">
    <rect
       style="fill:#7f3600;fill-opacity:1.0000000;fill-rule:evenodd;stroke:#e36d16;stroke-width:0.64871711;stroke-linecap:round;stroke-linejoin:round;stroke-miterlimit:4.0000000;stroke-opacity:1.0000000"
       id="rect909"
       width="24.386705"
       height="33.588348"
       x="22.306660"
       y="5.8614736"
       rx="2.0487747"
       ry="2.0349922" />
    <rect
       style="fill:#fafcff;fill-opacity:0.97712415;fill-rule:evenodd;stroke:#858585;stroke-width:0.026501995;stroke-linecap:butt;stroke-linejoin:miter;stroke-miterlimit:4.0000000;stroke-opacity:1.0000000"
       id="rect1532"
       width="21.497969"
       height="30.517981"
       x="23.762566"
       y="7.4069610"
       transform="matrix(1.000000,-2.966216e-4,-6.443464e-4,1.000000,0.000000,0.000000)" />
    <path
       sodipodi:nodetypes="ccccccccccccccc"
       id="path1534"
       d="M 34.466410,1.3206745 C 33.912562,1.3014373 32.263864,1.7330547 32.260525,3.4309542 C 32.275094,4.5646122 32.552618,4.8473587 32.269430,5.7237110 C 31.294602,6.4043506 30.703232,7.8319280 30.660432,8.9771272 L 38.458502,8.9208531 C 38.495338,7.7659450 37.709318,6.1406987 36.672296,5.5693713 C 36.400894,4.5382156 36.769198,4.5250304 36.776102,3.4872284 C 36.794965,1.7692488 35.080855,1.3092254 34.466410,1.3206745 z M 34.518313,2.8400759 C 34.724976,2.8146590 34.941589,2.8661228 35.115200,3.0370354 C 35.455436,3.3719816 35.511410,3.9663327 35.244958,4.3876144 L 35.219006,4.4157515 C 34.935967,4.8350919 34.424359,4.8982621 34.077137,4.5564368 C 33.729915,4.2146115 33.690291,3.5970603 33.973330,3.1777207 C 34.114850,2.9680507 34.311652,2.8654927 34.518313,2.8400759 z "
       style="fill:url(#linearGradient1323);fill-opacity:1.0000000;fill-rule:nonzero;stroke:#000000;stroke-width:0.64013338;stroke-linecap:butt;stroke-linejoin:miter;stroke-miterlimit:4.0000000;stroke-opacity:1.0000000" />
  </g>
</svg>
