<?xml version="1.0" encoding="UTF-8" standalone="no"?>
<!-- Created with Inkscape (http://www.inkscape.org/) -->
<svg
   xmlns:dc="http://purl.org/dc/elements/1.1/"
   xmlns:cc="http://creativecommons.org/ns#"
   xmlns:rdf="http://www.w3.org/1999/02/22-rdf-syntax-ns#"
   xmlns:svg="http://www.w3.org/2000/svg"
   xmlns="http://www.w3.org/2000/svg"
   xmlns:xlink="http://www.w3.org/1999/xlink"
   xmlns:sodipodi="http://inkscape.sourceforge.net/DTD/sodipodi-0.dtd"
   xmlns:inkscape="http://www.inkscape.org/namespaces/inkscape"
   sodipodi:docname="plugin_move.svg"
   sodipodi:docbase="/home/maker/Projects/e2work/icons-new/icon-work"
   inkscape:version="0.43"
   sodipodi:version="0.32"
   id="svg2"
   height="48.000000px"
   width="48.000000px"
   inkscape:export-filename="/home/maker/Projects/e2work/icons-new/plugin_move_48.png"
   inkscape:export-xdpi="90.000000"
   inkscape:export-ydpi="90.000000">
  <defs
     id="defs3">
    <linearGradient
       inkscape:collect="always"
       xlink:href="#linearGradient4555"
       id="linearGradient9781"
       gradientUnits="userSpaceOnUse"
       gradientTransform="matrix(-3.549543e-2,-1.704248,0.586753,-7.721828e-4,-1.005879e-13,1.161849e-13)"
       x1="-16.008282"
       y1="105.67589"
       x2="-29.984316"
       y2="161.52831" />
    <linearGradient
       id="linearGradient4555">
      <stop
         style="stop-color:#36e22f;stop-opacity:1.0000000;"
         offset="0.0000000"
         id="stop4556" />
      <stop
         style="stop-color:#2bae23;stop-opacity:0.98823529;"
         offset="0.14285715"
         id="stop4557" />
      <stop
         style="stop-color:#25941d;stop-opacity:0.98431373;"
         offset="0.85000002"
         id="stop9756" />
      <stop
         style="stop-color:#315f2e;stop-opacity:0.98039216;"
         offset="1.0000000"
         id="stop4558" />
    </linearGradient>
    <linearGradient
       inkscape:collect="always"
       xlink:href="#linearGradient4555"
       id="linearGradient9780"
       gradientUnits="userSpaceOnUse"
       gradientTransform="matrix(1.703583,-3.462947e-2,1.192433e-2,0.586756,2.59931e-14,-2.34326e-14)"
       x1="-16.008274"
       y1="105.67583"
       x2="-29.984303"
       y2="161.52823" />
    <linearGradient
       id="linearGradient6987">
      <stop
         id="stop6989"
         offset="0.0000000"
         style="stop-color:#e4eaef;stop-opacity:1.0000000;" />
      <stop
         id="stop6991"
         offset="1.0000000"
         style="stop-color:#68667f;stop-opacity:1.0000000;" />
    </linearGradient>
    <linearGradient
       y2="63.192982"
       x2="34.843498"
       y1="54.827583"
       x1="35.076275"
       gradientTransform="matrix(1.04493,-0.28411,0.240629,0.917278,-17.6146,-18.50173)"
       gradientUnits="userSpaceOnUse"
       id="linearGradient6985"
       xlink:href="#linearGradient6977"
       inkscape:collect="always" />
    <linearGradient
       id="linearGradient6977">
      <stop
         style="stop-color:#eaeaf6;stop-opacity:1.0000000;"
         offset="0.0000000"
         id="stop6979" />
      <stop
         style="stop-color:#8480aa;stop-opacity:0.83505154;"
         offset="1.0000000"
         id="stop6981" />
    </linearGradient>
    <linearGradient
       y2="63.192982"
       x2="34.843498"
       y1="54.827583"
       x1="35.076275"
       gradientTransform="matrix(1.125109,-0.278054,0.259093,0.897729,-15.09071,-20.64595)"
       gradientUnits="userSpaceOnUse"
       id="linearGradient5276"
       xlink:href="#linearGradient6977"
       inkscape:collect="always" />
    <linearGradient
       gradientUnits="userSpaceOnUse"
       gradientTransform="matrix(1.797260,0.000000,0.000000,0.176533,21.18159,7.766546)"
       y2="36.981618"
       x2="18.433590"
       y1="31.658856"
       x1="14.937930"
       id="linearGradient612"
       xlink:href="#linearGradient584" />
    <linearGradient
       id="linearGradient584">
      <stop
         id="stop585"
         offset="0.00000000"
         style="stop-color:#ffffff;stop-opacity:1;" />
      <stop
         id="stop586"
         offset="1.00000000"
         style="stop-color:#ffffff;stop-opacity:0;" />
    </linearGradient>
    <linearGradient
       gradientUnits="userSpaceOnUse"
       gradientTransform="matrix(0.612621,0.000000,0.000000,0.517900,21.18159,7.766546)"
       y2="20.939441"
       x2="42.547944"
       y1="5.0095384"
       x1="26.906364"
       id="linearGradient583"
       xlink:href="#linearGradient584" />
    <linearGradient
       id="linearGradient578">
      <stop
         id="stop579"
         offset="0.0000000"
         style="stop-color:#484cbf;stop-opacity:1.0000000;" />
      <stop
         id="stop580"
         offset="1.0000000"
         style="stop-color:#68667f;stop-opacity:1.0000000;" />
    </linearGradient>
    <linearGradient
       gradientUnits="userSpaceOnUse"
       gradientTransform="matrix(0.632871,0.000000,0.000000,0.501329,21.18159,7.766516)"
       y2="35.985016"
       x2="57.566818"
       y1="3.2594952"
       x1="24.088284"
       id="linearGradient581"
       xlink:href="#linearGradient578" />
    <linearGradient
       gradientUnits="userSpaceOnUse"
       gradientTransform="matrix(0.571216,0.000000,0.000000,0.555441,24.77656,16.01462)"
       y2="42.924896"
       x2="24.273980"
       y1="23.152065"
       x1="4.8590281"
       id="linearGradient2617"
       xlink:href="#linearGradient584"
       inkscape:collect="always" />
    <linearGradient
       gradientUnits="userSpaceOnUse"
       gradientTransform="matrix(0.632864,0.000000,0.000000,0.501335,24.77656,16.01459)"
       y2="56.905662"
       x2="36.495159"
       y1="23.134740"
       x1="1.9471697"
       id="linearGradient2619"
       xlink:href="#linearGradient578"
       inkscape:collect="always" />
  </defs>
  <sodipodi:namedview
     inkscape:window-y="146"
     inkscape:window-x="345"
     inkscape:window-height="684"
     inkscape:window-width="953"
     showgrid="true"
     inkscape:current-layer="layer2"
     inkscape:document-units="px"
     inkscape:cy="20.285835"
     inkscape:cx="30.058594"
     inkscape:zoom="1"
     inkscape:pageshadow="2"
     inkscape:pageopacity="0.0"
     borderopacity="1.0"
     bordercolor="#666666"
     pagecolor="#ffffff"
     id="base" />
  <metadata
     id="metadata4">
    <rdf:RDF>
      <cc:Work
         rdf:about="">
        <dc:format>image/svg+xml</dc:format>
        <dc:type
           rdf:resource="http://purl.org/dc/dcmitype/StillImage" />
        <dc:subject>
          <rdf:Bag>
            <rdf:li>plugin</rdf:li>
          </rdf:Bag>
        </dc:subject>
        <cc:license
           rdf:resource="http://creativecommons.org/licenses/by-sa/3.0/" />
      </cc:Work>
      <cc:License
         rdf:about="http://creativecommons.org/licenses/by-sa/3.0/">
        <cc:permits
           rdf:resource="http://creativecommons.org/ns#Reproduction" />
        <cc:permits
           rdf:resource="http://creativecommons.org/ns#Distribution" />
        <cc:requires
           rdf:resource="http://creativecommons.org/ns#Notice" />
        <cc:permits
           rdf:resource="http://creativecommons.org/ns#DerivativeWorks" />
        <cc:requires
           rdf:resource="http://creativecommons.org/ns#ShareAlike" />
        <cc:requires
           rdf:resource="http://creativecommons.org/ns#SourceCode" />
      </cc:License>
    </rdf:RDF>
  </metadata>
  <g
     id="layer1"
     inkscape:groupmode="layer"
     inkscape:label="Layer 1">
    <g
       id="g2531"
       transform="translate(-23.99999,9.000009)">
      <path
         style="fill:none;fill-opacity:1;fill-rule:evenodd;stroke:#2d2d4b;stroke-width:3.99999905;stroke-linecap:square;stroke-linejoin:round;stroke-miterlimit:4;stroke-dasharray:none;stroke-opacity:1"
         d="M 28.195262,32.24316 L 40.082957,25.70926 L 26.999993,16.999996 L 26.999993,35.999991 L 40.99999,35.999991"
         id="path1461"
         sodipodi:nodetypes="ccccc" />
      <path
         sodipodi:nodetypes="ccccc"
         id="path2205"
         d="M 28.187697,32.207792 L 39.911451,25.701814 L 26.999989,16.999995 L 26.999989,35.99999 L 40.999985,35.99999"
         style="fill:none;fill-opacity:1;fill-rule:evenodd;stroke:#26198c;stroke-width:1.9999994;stroke-linecap:square;stroke-linejoin:round;stroke-miterlimit:4;stroke-dasharray:none;stroke-opacity:1" />
    </g>
  </g>
  <g
     inkscape:label="overlay"
     id="layer2"
     inkscape:groupmode="layer">
    <path
       sodipodi:nodetypes="ccccc"
       id="path6983"
       style="font-size:12px;fill:url(#linearGradient6985);fill-opacity:1;fill-rule:evenodd;stroke:#261933;stroke-width:0.99999982;stroke-miterlimit:4;stroke-dasharray:none"
       d="M 18.848755,28.241241 C 21.770533,28.664335 34.429803,28.504753 37.286934,28.216549 C 37.551007,23.171568 37.621959,7.2720307 37.193627,3.8531706 C 33.123518,3.2401009 22.030326,3.5555158 18.847818,3.8272486 C 18.394034,7.1751364 18.373853,23.142876 18.848755,28.241241 z " />
    <g
       id="g9785"
       transform="matrix(0.49744,0,0,0.594182,16.55626,5.949574)">
      <g
         id="g9782">
        <rect
           style="fill:#ffffff;fill-opacity:1;fill-rule:nonzero;stroke:#000000;stroke-width:3.3059299;stroke-linecap:square;stroke-linejoin:round;stroke-miterlimit:2.79999995;stroke-opacity:1"
           id="rect5231"
           width="33.200089"
           height="11.254853"
           x="61.754158"
           y="22.61688"
           rx="5.2131462"
           ry="5.8217025"
           transform="matrix(0.742806,0.669506,-0.753305,0.657672,6.249996,-41.57996)" />
        <rect
           style="fill:#ffffff;fill-opacity:1;fill-rule:nonzero;stroke:#000000;stroke-width:3.30239224;stroke-linecap:square;stroke-linejoin:round;stroke-miterlimit:2.79999995;stroke-opacity:1"
           id="rect5230"
           width="33.256229"
           height="11.211861"
           x="-54.699757"
           y="84.175735"
           rx="5.2275009"
           ry="5.7856007"
           transform="matrix(0.752974,-0.658051,0.729991,0.683457,6.249996,-41.57996)" />
      </g>
      <g
         id="g9757"
         transform="translate(-3.096916e-5,0.329996)">
        <rect
           style="fill:url(#linearGradient9780);fill-opacity:1;fill-rule:nonzero;stroke:#000000;stroke-width:0;stroke-linecap:square;stroke-linejoin:round;stroke-miterlimit:2.79999995;stroke-opacity:1"
           id="rect4548"
           width="34.866825"
           height="11.799339"
           x="-57.488243"
           y="84.86377"
           rx="5.4806676"
           ry="6.0887551"
           transform="matrix(0.718191,-0.627653,0.693645,0.649428,8.624076,-39.37865)" />
        <rect
           style="fill:url(#linearGradient9781);fill-opacity:1;fill-rule:nonzero;stroke:#000000;stroke-width:0;stroke-linecap:square;stroke-linejoin:round;stroke-miterlimit:2.79999995;stroke-opacity:1"
           id="rect4545"
           width="34.86684"
           height="11.799305"
           x="61.680431"
           y="23.617525"
           rx="5.4748578"
           ry="6.1033201"
           transform="matrix(0.707298,0.637501,-0.718547,0.627326,8.624076,-39.37865)" />
      </g>
    </g>
  </g>
</svg>
