<?xml version="1.0" encoding="UTF-8" standalone="no"?>
<!-- Created with Inkscape (http://www.inkscape.org/) -->
<svg
   xmlns:dc="http://purl.org/dc/elements/1.1/"
   xmlns:cc="http://creativecommons.org/ns#"
   xmlns:rdf="http://www.w3.org/1999/02/22-rdf-syntax-ns#"
   xmlns:svg="http://www.w3.org/2000/svg"
   xmlns="http://www.w3.org/2000/svg"
   xmlns:xlink="http://www.w3.org/1999/xlink"
   xmlns:sodipodi="http://inkscape.sourceforge.net/DTD/sodipodi-0.dtd"
   xmlns:inkscape="http://www.inkscape.org/namespaces/inkscape"
   width="48.000000"
   height="48.000000"
   id="svg2"
   sodipodi:version="0.32"
   inkscape:version="0.42"
   sodipodi:docname="user_commands.svg"
   version="1.0"
   x="0.0000000"
   y="0.0000000"
   sodipodi:docbase="/home/maker/Projects/e2work/icons-new/icon-work"
   inkscape:export-filename="/home/maker/Projects/e2work/icons-new/user_commands_48.png"
   inkscape:export-xdpi="90.000000"
   inkscape:export-ydpi="90.000000">
  <defs
     id="defs4">
    <linearGradient
       inkscape:collect="always"
       xlink:href="#linearGradient584"
       id="linearGradient2172"
       gradientUnits="userSpaceOnUse"
       gradientTransform="matrix(0.492681,7.118427e-2,-7.410882e-2,0.565014,19.41906,13.87583)"
       x1="31.590583"
       y1="26.307754"
       x2="46.986677"
       y2="41.691510" />
    <linearGradient
       inkscape:collect="always"
       xlink:href="#linearGradient584"
       id="linearGradient2175"
       gradientUnits="userSpaceOnUse"
       gradientTransform="matrix(0.520256,7.516846e-2,-7.018077e-2,0.535066,19.41906,13.87583)"
       x1="11.884738"
       y1="41.069433"
       x2="16.236351"
       y2="45.421591" />
    <linearGradient
       inkscape:collect="always"
       xlink:href="#linearGradient584"
       id="linearGradient2178"
       gradientUnits="userSpaceOnUse"
       gradientTransform="matrix(0.632726,9.141868e-2,-5.770583e-2,0.439955,19.41906,13.87583)"
       x1="33.975878"
       y1="15.856298"
       x2="38.278820"
       y2="20.125623" />
    <linearGradient
       inkscape:collect="always"
       xlink:href="#linearGradient584"
       id="linearGradient2181"
       gradientUnits="userSpaceOnUse"
       gradientTransform="matrix(0.482814,6.975872e-2,-7.562321e-2,0.576561,19.41906,13.87583)"
       x1="29.236458"
       y1="5.8047441"
       x2="35.311419"
       y2="11.849259" />
    <linearGradient
       inkscape:collect="always"
       xlink:href="#linearGradient584"
       id="linearGradient2184"
       gradientUnits="userSpaceOnUse"
       gradientTransform="matrix(0.808843,0.116864,-4.514105e-2,0.344160,19.41906,13.87583)"
       x1="7.7281242"
       y1="19.308470"
       x2="11.734460"
       y2="23.236339" />
    <linearGradient
       id="linearGradient584">
      <stop
         style="stop-color:#ffffff;stop-opacity:1;"
         offset="0.00000000"
         id="stop585" />
      <stop
         style="stop-color:#ffffff;stop-opacity:0;"
         offset="1.00000000"
         id="stop586" />
    </linearGradient>
    <linearGradient
       inkscape:collect="always"
       xlink:href="#linearGradient584"
       id="linearGradient2187"
       gradientUnits="userSpaceOnUse"
       gradientTransform="matrix(0.606891,8.768617e-2,-6.016241e-2,0.458685,19.41906,13.87583)"
       x1="4.6603223"
       y1="32.070274"
       x2="10.735510"
       y2="37.985169" />
    <linearGradient
       id="linearGradient578">
      <stop
         style="stop-color:#cc363d;stop-opacity:1.0000000;"
         offset="0.0000000"
         id="stop579" />
      <stop
         style="stop-color:#e3443c;stop-opacity:1.0000000;"
         offset="1.0000000"
         id="stop580" />
    </linearGradient>
    <linearGradient
       inkscape:collect="always"
       xlink:href="#linearGradient578"
       id="linearGradient2190"
       gradientUnits="userSpaceOnUse"
       gradientTransform="matrix(0.772401,0.111599,-9.980188e-2,0.760900,33.88244,-11.14344)"
       x1="23.105503"
       y1="69.479378"
       x2="-4.5550399"
       y2="39.899075" />
    <linearGradient
       inkscape:collect="always"
       xlink:href="#linearGradient11604"
       id="linearGradient2217"
       gradientUnits="userSpaceOnUse"
       gradientTransform="matrix(0.833814,-8.017692e-2,9.196676e-2,0.942939,-38.74569,10.93684)"
       x1="19.912571"
       y1="30.840954"
       x2="12.969634"
       y2="20.881042" />
    <linearGradient
       id="linearGradient8670">
      <stop
         style="stop-color:#cdd1fb;stop-opacity:1.0000000;"
         offset="0.0000000"
         id="stop8671" />
      <stop
         style="stop-color:#7974ec;stop-opacity:1.0000000;"
         offset="1.0000000"
         id="stop8672" />
    </linearGradient>
    <radialGradient
       inkscape:collect="always"
       xlink:href="#linearGradient8670"
       id="radialGradient3633"
       gradientUnits="userSpaceOnUse"
       gradientTransform="matrix(1.000000,0.000000,0.000000,1.120085,5.429685e-15,-1.681704)"
       cx="35.495205"
       cy="14.004312"
       fx="35.495205"
       fy="14.004312"
       r="12.495204" />
    <radialGradient
       inkscape:collect="always"
       xlink:href="#linearGradient8670"
       id="radialGradient3635"
       gradientUnits="userSpaceOnUse"
       gradientTransform="matrix(-1.000000,-5.406367e-9,1.406047e-8,-2.600724,70.99041,22.82566)"
       cx="35.495205"
       cy="6.5865669"
       fx="35.495205"
       fy="6.5865669"
       r="12.495204" />
    <radialGradient
       inkscape:collect="always"
       xlink:href="#linearGradient8670"
       id="radialGradient3637"
       gradientUnits="userSpaceOnUse"
       gradientTransform="matrix(1.000000,0.000000,0.000000,1.120085,5.429685e-15,-1.681704)"
       cx="35.495205"
       cy="14.004312"
       fx="35.495205"
       fy="14.004312"
       r="12.495204" />
    <radialGradient
       inkscape:collect="always"
       xlink:href="#linearGradient8670"
       id="radialGradient3639"
       gradientUnits="userSpaceOnUse"
       gradientTransform="matrix(1.000000,0.000000,0.000000,1.120085,5.429685e-15,-1.681704)"
       cx="35.495205"
       cy="14.004312"
       fx="35.495205"
       fy="14.004312"
       r="12.495204" />
    <radialGradient
       inkscape:collect="always"
       xlink:href="#linearGradient8670"
       id="radialGradient3641"
       gradientUnits="userSpaceOnUse"
       gradientTransform="matrix(1.000000,0.000000,0.000000,1.120085,5.429685e-15,-1.681704)"
       cx="35.495205"
       cy="14.004312"
       fx="35.495205"
       fy="14.004312"
       r="12.495204" />
    <radialGradient
       inkscape:collect="always"
       xlink:href="#linearGradient8670"
       id="radialGradient3643"
       gradientUnits="userSpaceOnUse"
       gradientTransform="matrix(1.000000,0.000000,0.000000,1.120085,5.429685e-15,-1.681704)"
       cx="35.495205"
       cy="14.004312"
       fx="35.495205"
       fy="14.004312"
       r="12.495204" />
    <radialGradient
       inkscape:collect="always"
       xlink:href="#linearGradient8670"
       id="radialGradient3645"
       gradientUnits="userSpaceOnUse"
       gradientTransform="matrix(1.000000,0.000000,0.000000,1.120085,5.429685e-15,-1.681704)"
       cx="35.495205"
       cy="14.004312"
       fx="35.495205"
       fy="14.004312"
       r="12.495204" />
    <radialGradient
       inkscape:collect="always"
       xlink:href="#linearGradient8670"
       id="radialGradient3647"
       gradientUnits="userSpaceOnUse"
       gradientTransform="matrix(1.000000,0.000000,0.000000,1.120085,5.429685e-15,-1.681704)"
       cx="35.495205"
       cy="14.004312"
       fx="35.495205"
       fy="14.004312"
       r="12.495204" />
    <linearGradient
       inkscape:collect="always"
       xlink:href="#linearGradient584"
       id="linearGradient3884"
       gradientUnits="userSpaceOnUse"
       gradientTransform="matrix(0.499364,7.152724e-2,-7.511403e-2,0.567736,18.72161,13.88903)"
       x1="31.590583"
       y1="26.307754"
       x2="46.986677"
       y2="41.691510" />
    <linearGradient
       inkscape:collect="always"
       xlink:href="#linearGradient584"
       id="linearGradient3887"
       gradientUnits="userSpaceOnUse"
       gradientTransform="matrix(0.527313,7.553062e-2,-7.113270e-2,0.537644,18.45644,13.53548)"
       x1="11.884738"
       y1="41.069433"
       x2="16.236351"
       y2="45.421591" />
    <linearGradient
       inkscape:collect="always"
       xlink:href="#linearGradient584"
       id="linearGradient3890"
       gradientUnits="userSpaceOnUse"
       gradientTransform="matrix(0.619756,0.188722,-0.125316,0.427957,20.71067,10.46670)"
       x1="33.975878"
       y1="15.856298"
       x2="38.278820"
       y2="20.125623" />
    <linearGradient
       inkscape:collect="always"
       xlink:href="#linearGradient584"
       id="linearGradient3893"
       gradientUnits="userSpaceOnUse"
       gradientTransform="matrix(0.489363,7.009482e-2,-7.664896e-2,0.579339,18.67456,13.46657)"
       x1="29.236458"
       y1="5.8047441"
       x2="35.311419"
       y2="11.849259" />
    <linearGradient
       inkscape:collect="always"
       xlink:href="#linearGradient584"
       id="linearGradient3896"
       gradientUnits="userSpaceOnUse"
       gradientTransform="matrix(0.656944,-0.504291,0.215364,0.274411,14.16205,21.43280)"
       x1="7.7281242"
       y1="19.308470"
       x2="10.212779"
       y2="23.369123" />
    <linearGradient
       inkscape:collect="always"
       xlink:href="#linearGradient584"
       id="linearGradient3899"
       gradientUnits="userSpaceOnUse"
       gradientTransform="matrix(0.615123,8.810864e-2,-6.097845e-2,0.460895,18.45644,13.53548)"
       x1="4.6603223"
       y1="32.070274"
       x2="10.735510"
       y2="37.985169" />
    <linearGradient
       inkscape:collect="always"
       xlink:href="#linearGradient578"
       id="linearGradient3902"
       gradientUnits="userSpaceOnUse"
       gradientTransform="matrix(0.782878,0.112137,-0.101156,0.764566,33.38117,-11.25079)"
       x1="23.105503"
       y1="69.479378"
       x2="-4.5550399"
       y2="39.899075" />
  </defs>
  <sodipodi:namedview
     id="base"
     pagecolor="#ffffff"
     bordercolor="#666666"
     borderopacity="1.0"
     inkscape:pageopacity="0.0"
     inkscape:pageshadow="2"
     inkscape:zoom="1.0000000"
     inkscape:cx="26.954303"
     inkscape:cy="17.945894"
     inkscape:document-units="px"
     inkscape:current-layer="layer4"
     showgrid="true"
     inkscape:grid-bbox="false"
     inkscape:window-width="836"
     inkscape:window-height="676"
     inkscape:window-x="29"
     inkscape:window-y="103" />
  <metadata
     id="metadata7">
    <rdf:RDF>
      <cc:Work
         rdf:about="">
        <dc:format>image/svg+xml</dc:format>
        <dc:type
           rdf:resource="http://purl.org/dc/dcmitype/StillImage" />
        <cc:license
           rdf:resource="http://creativecommons.org/licenses/by-sa/3.0/" />
      </cc:Work>
      <cc:License
         rdf:about="http://creativecommons.org/licenses/by-sa/3.0/">
        <cc:permits
           rdf:resource="http://creativecommons.org/ns#Reproduction" />
        <cc:permits
           rdf:resource="http://creativecommons.org/ns#Distribution" />
        <cc:requires
           rdf:resource="http://creativecommons.org/ns#Notice" />
        <cc:permits
           rdf:resource="http://creativecommons.org/ns#DerivativeWorks" />
        <cc:requires
           rdf:resource="http://creativecommons.org/ns#ShareAlike" />
        <cc:requires
           rdf:resource="http://creativecommons.org/ns#SourceCode" />
      </cc:License>
    </rdf:RDF>
  </metadata>
  <g
     inkscape:label="person"
     inkscape:groupmode="layer"
     id="layer1">
    <g
       id="g2482"
       transform="matrix(1.291393,0.000000,0.000000,1.370834,-29.83827,-0.197592)"
       style="fill:url(#radialGradient3633);fill-opacity:1.0000000">
      <path
         style="fill:url(#radialGradient3635);fill-opacity:1.0000000;fill-rule:evenodd;stroke:#20205d;stroke-width:0.75158525;stroke-linecap:butt;stroke-linejoin:round;stroke-miterlimit:4.0000000;stroke-dasharray:none;stroke-opacity:0.97647059"
         d="M 35.523123,0.56380529 C 34.696106,0.55340522 33.955799,0.33663847 32.619048,0.84049796 C 29.332257,1.7489813 27.155918,2.0975924 26.219343,8.3137028 C 25.227147,7.8130911 24.530313,7.3839260 23.598170,9.1898033 C 23.318112,11.950101 23.656834,13.630824 24.365218,15.327701 C 24.769323,16.261329 25.326902,16.484295 25.983980,16.506568 C 26.280463,18.911904 26.716224,20.965280 26.937896,21.867602 C 27.383495,23.681516 29.705823,26.298705 31.042618,27.004090 C 32.379333,27.709473 33.071297,27.686455 36.101253,26.779544 C 39.131285,25.872635 40.831918,23.122944 42.865370,19.566006 C 43.145348,18.721760 43.423284,17.598496 43.703659,16.506568 C 44.475925,16.702510 45.158525,16.636350 45.813833,15.664519 C 46.822128,14.126398 47.258255,13.012077 47.490409,10.247349 C 46.911835,8.1632820 46.337736,6.6773601 44.484133,8.0491203 C 43.243738,3.2002182 41.199383,2.1569731 38.384865,1.0409654 C 37.156076,0.78780338 36.350140,0.57420537 35.523123,0.56380529 z "
         id="path8662"
         sodipodi:nodetypes="cccccccccccccccc" />
      <path
         style="fill:url(#radialGradient3637);fill-opacity:1.0000000;fill-rule:evenodd;stroke:#000000;stroke-width:1.0556022;stroke-miterlimit:4.0000000;stroke-opacity:0.58823532"
         d="M 33.442892,10.987239 C 33.456966,11.831536 32.616481,12.530911 31.566812,12.548345 C 30.517140,12.565779 29.653811,11.894702 29.639737,11.050404 C 29.625663,10.206110 30.466146,9.5067326 31.515816,9.4892989 C 32.565486,9.4718663 33.428817,10.142944 33.442892,10.987239 z "
         id="path8663" />
      <path
         style="fill:url(#radialGradient3639);fill-opacity:1.0000000;fill-rule:evenodd;stroke:#000000;stroke-width:1.0238731;stroke-linejoin:round;stroke-miterlimit:4.0000000;stroke-opacity:0.39215687"
         d="M 30.239096,11.922144 C 30.114669,10.731298 33.148085,10.772679 32.854321,11.970471 C 32.134722,12.716523 30.455839,12.377357 30.239096,11.922144 z "
         id="path8664"
         sodipodi:nodetypes="ccc" />
      <path
         style="fill:url(#radialGradient3641);fill-opacity:1.0000000;fill-rule:evenodd;stroke:#000000;stroke-width:1.0556022;stroke-miterlimit:4.0000000;stroke-opacity:0.58823532"
         d="M 39.654855,11.091064 C 39.668930,11.935359 38.828445,12.634737 37.778776,12.652170 C 36.729105,12.669603 35.865774,11.998525 35.851700,11.154230 C 35.837625,10.309934 36.678109,9.6105568 37.727781,9.5931241 C 38.777450,9.5756904 39.640781,10.246768 39.654855,11.091064 z "
         id="path8665" />
      <path
         style="fill:url(#radialGradient3643);fill-opacity:1.0000000;fill-rule:evenodd;stroke:#000000;stroke-width:1.0238731;stroke-linejoin:round;stroke-miterlimit:4.0000000;stroke-opacity:0.39215687"
         d="M 36.451059,12.025969 C 36.326631,10.835122 39.360048,10.876504 39.066283,12.074296 C 38.346683,12.820348 36.667803,12.481182 36.451059,12.025969 z "
         id="path8666"
         sodipodi:nodetypes="ccc" />
      <path
         style="fill:url(#radialGradient3645);fill-opacity:1.0000000;fill-rule:evenodd;stroke:#000000;stroke-width:1.0556022;stroke-linecap:round;stroke-linejoin:miter;stroke-miterlimit:4.0000000;stroke-opacity:0.58823532"
         d="M 30.499912,21.228543 C 32.599672,21.962864 34.844015,21.925512 37.016064,21.326943"
         id="path8667"
         sodipodi:nodetypes="cc" />
      <path
         style="fill:url(#radialGradient3647);fill-opacity:1.0000000;fill-rule:evenodd;stroke:#000000;stroke-width:1.0556022;stroke-linecap:round;stroke-linejoin:miter;stroke-miterlimit:4.0000000;stroke-opacity:0.58823532"
         d="M 34.401997,14.239886 L 33.019386,18.396898"
         id="path8668" />
    </g>
  </g>
  <g
     inkscape:groupmode="layer"
     id="layer4"
     inkscape:label="gear">
    <path
       sodipodi:nodetypes="cccccccccccccccccccccc"
       id="path843"
       style="font-size:12.000000px;opacity:0.30267498;fill:#000000;fill-opacity:1.0000000;fill-rule:evenodd;stroke:none;stroke-width:2.1217699"
       d="M 47.993296,35.882571 C 47.556267,39.756378 44.526045,36.641123 42.448613,39.262445 C 40.418413,41.885526 45.158559,43.769023 42.172829,46.059264 C 39.094420,48.486654 39.205107,43.623024 36.218257,43.759136 C 32.893175,43.974979 35.427755,48.499294 31.624217,47.954486 C 28.274094,47.399608 31.412674,44.882707 28.483157,42.876627 C 25.487718,40.785026 24.302623,45.099444 22.077149,42.279733 C 19.625015,39.166966 25.099684,39.576915 23.819679,36.669307 C 22.551509,33.726319 18.734882,36.003380 19.107834,32.045471 C 19.535206,28.245396 23.103257,31.820870 24.751763,29.055195 C 26.355354,26.308989 22.201816,24.309495 24.978699,22.626855 C 28.119226,20.801002 28.276636,25.662006 30.933378,24.926902 C 33.520027,24.251093 31.525390,19.407551 35.348530,19.804935 C 39.457697,20.318405 35.898330,23.868532 38.308430,25.682917 C 40.686154,27.427854 43.078095,23.481408 45.004599,25.795567 C 46.995731,28.194679 42.831580,28.494976 43.217197,31.174512 C 43.613156,34.067393 48.198771,32.050807 47.993296,35.882571 z M 39.636096,35.422986 C 39.099544,39.478412 37.314896,40.910368 33.243942,40.327256 C 29.173363,39.744200 27.163598,37.670712 27.700149,33.615283 C 28.094921,29.973196 30.860548,28.052036 34.503762,28.573878 C 38.574719,29.156989 40.172672,31.367368 39.636096,35.422986 z " />
    <path
       id="path1580"
       style="font-size:12.000000px;opacity:0.69993597;fill-rule:evenodd;stroke:#ffffff;stroke-width:0.11948518pt"
       d="M 29.619580,38.690302 C 32.271526,39.681278 35.345437,40.289683 37.901091,37.942089 C 39.582067,36.448033 39.963066,31.481263 38.877405,29.022112 C 40.065212,30.610051 41.455546,36.952656 38.511147,38.916064 C 34.950747,41.344166 31.300691,40.173838 29.619580,38.690302 z " />
    <path
       sodipodi:nodetypes="cccccccccccccccccccccc"
       id="path1579"
       style="font-size:12.000000px;fill:url(#linearGradient3902);fill-opacity:1.0;fill-rule:evenodd;stroke:#4f181a;stroke-width:0.99999934;stroke-miterlimit:4.0000000;stroke-dasharray:none;stroke-opacity:1.0000000"
       d="M 46.732512,34.221548 C 46.305843,38.003538 43.347443,34.962121 41.319252,37.521312 C 39.337171,40.082220 43.964965,41.921074 41.050002,44.157031 C 38.044560,46.526885 38.152624,41.778535 35.236569,41.911421 C 31.990300,42.122149 34.464804,46.539225 30.751420,46.007332 C 27.480703,45.465604 30.544891,43.008360 27.684809,41.049829 C 24.760369,39.007805 23.603363,43.219962 21.430639,40.467084 C 19.036626,37.428096 24.381533,37.828327 23.131866,34.989638 C 21.893755,32.116406 18.167591,34.339494 18.531704,30.475399 C 18.948945,26.765395 22.432425,30.256121 24.041858,27.555998 C 25.607439,24.874885 21.552350,22.922783 24.263415,21.280025 C 27.329504,19.497450 27.483184,24.243236 30.076956,23.525556 C 32.602293,22.865765 30.654935,18.137026 34.387456,18.524991 C 38.399226,19.026291 34.924225,22.492272 37.277202,24.263652 C 39.598567,25.967231 41.933813,22.114324 43.814653,24.373632 C 45.758592,26.715879 41.693141,27.009058 42.069617,29.625083 C 42.456191,32.449396 46.933117,30.480608 46.732512,34.221548 z M 38.573397,33.772858 C 38.105895,37.306388 35.816912,38.886409 32.332752,38.560886 C 28.700546,38.040620 26.356120,35.614446 26.920361,32.008001 C 27.387887,28.474286 29.588617,26.516853 33.562712,27.086089 C 37.206554,27.521253 38.955450,30.226899 38.573397,33.772858 z " />
    <path
       id="path1581"
       style="font-size:12.000000px;opacity:0.99000001;fill:url(#linearGradient3899);fill-rule:evenodd;stroke:none;stroke-width:1.0515400pt"
       d="M 19.214673,31.546270 C 19.135628,31.394768 18.946131,29.792061 19.411494,29.517242 C 20.267394,29.011795 23.109752,29.073594 23.178461,29.205473 C 23.243070,29.329147 20.756906,29.725656 19.811648,30.283836 C 19.435643,30.505922 19.269040,31.650333 19.214673,31.546270 z " />
    <path
       id="path1582"
       style="font-size:12.000000px;opacity:0.99000001;fill:url(#linearGradient3896);fill-rule:evenodd;stroke:none;stroke-width:1.1253500pt"
       d="M 23.952549,22.689633 C 23.863884,22.576659 24.140537,22.122855 24.554503,21.773400 C 24.998774,21.398458 25.815979,21.531806 25.902058,21.641486 C 25.976643,21.736521 24.024550,22.781375 23.952549,22.689633 z "
       sodipodi:nodetypes="cssc" />
    <path
       id="path1583"
       style="font-size:12.000000px;opacity:0.99000001;fill:url(#linearGradient3893);fill-rule:evenodd;stroke:none;stroke-width:1.0736800pt"
       d="M 32.154836,21.712744 C 32.110995,21.537702 32.370922,19.866367 33.006583,19.312262 C 33.522124,18.862893 35.506324,19.293867 35.545958,19.452229 C 35.583819,19.603289 33.816836,19.736700 33.239086,20.240434 C 32.665621,20.740266 32.188502,21.847031 32.154836,21.712744 z "
       sodipodi:nodetypes="csssc" />
    <path
       id="path1584"
       style="font-size:12.000000px;opacity:0.99000001;fill:url(#linearGradient3890);fill-rule:evenodd;stroke:none;stroke-width:1.1833400pt"
       d="M 39.293377,25.376351 C 39.777256,25.073157 42.207979,24.403731 42.431914,24.471921 C 42.588277,24.519535 41.114223,25.527949 40.434352,25.723790 C 40.067992,25.829375 39.111409,25.490417 39.293377,25.376351 z " />
    <path
       id="path1585"
       style="font-size:12.000000px;opacity:0.99000001;fill:url(#linearGradient3887);fill-rule:evenodd;stroke:none;stroke-width:1.1111300pt"
       d="M 21.496458,38.840823 C 21.647053,38.552790 23.648699,36.983104 24.064120,36.843287 C 24.264823,36.775667 23.729436,37.919249 23.344629,38.218578 C 22.873551,38.585092 21.407289,39.011200 21.496458,38.840823 z " />
    <path
       sodipodi:nodetypes="cssss"
       id="path844"
       d="M 31.386810,39.698125 C 31.232606,39.433700 35.666934,40.324291 37.719164,37.915329 C 40.157313,35.099476 39.640114,31.881293 39.789899,32.138140 C 39.971390,32.449355 39.955532,37.469909 38.472494,38.804149 C 37.154502,39.989903 31.563882,40.001763 31.386810,39.698125 z "
       style="fill:url(#linearGradient3884);fill-opacity:1.0000000;fill-rule:evenodd;stroke:none;stroke-width:1.0000000pt;stroke-linecap:butt;stroke-linejoin:miter;stroke-opacity:1.0000000" />
  </g>
</svg>
