/* XPM */
static char *pixmap[] = {
/* width height ncols cpp */
"16 16 8 2",
  /* Colors */
  "00 c #000000",
  "01 c #660000",
  "02 c #CC3300",
  "03 c #FF3300",
  "04 c #FF6600",
  "05 c #FF9900",
  "06 c #CC9966",
  ".. s None c None",
  "..........................000602",
  "........................00060206",
  "........000000........0006020600",
  "......0002020200....000604060001",
  "....0002020202020000060206000100",
  "....00020202020200060206000100..",
  "..00020202020202060206000100....",
  "00030303030302060206000000......",
  "04040404040306030602020200......",
  "0404040404060406020202020200....",
  "040505050604060303020202020000..",
  "050000060506040403020202020000..",
  "000106010605040403020202000100..",
  "0006010600050404030200000100....",
  "06010601000504040300010100......",
  "050600000504040400010000........",
};
