-1.1633965964109541 0.9788732394366197 
-1.1135847134919850 0.7394366197183099 
-1.0606595878905805 0.4812206572769953 
-1.0015079769243047 0.2417840375586854 
-0.9485828513229001 0.0727699530516432 
-0.8676385415795754 -0.1760563380281690 
-0.7742412611065085 -0.4107981220657277 
-0.6870704659983127 -0.5892018779342723 
-0.5781069721130679 -0.7676056338028169 
-0.4317845660385963 -0.9366197183098591 
-0.2854621599641248 -1.0446009389671362 
-0.1453662392545243 -1.0962441314553990 
0.0134091375496896 -1.0774647887323943 
0.1877507277660812 -0.9788732394366197 
0.3278466484756815 -0.8474178403755869 
0.4492631130906686 -0.6690140845070423 
0.5208676947866866 -0.5281690140845070 
0.6329444313543671 -0.2887323943661972 
0.7107754984152560 -0.0680751173708920 
0.7792668374288385 0.1525821596244132 
0.8415316910775498 0.3873239436619718 
0.8944568166789545 0.6126760563380281 
0.9442686995979236 0.8474178403755869 
0.9878540971520215 1.0774647887323943 
