module github.com/DCSO/fever

go 1.14

require (
	github.com/DCSO/bloom v0.2.3
	github.com/DCSO/fluxline v0.0.0-20200907065040-78686e5e68f6
	github.com/NeowayLabs/wabbit v0.0.0-20201021105516-ded4a9ef19d2
	github.com/Showmax/go-fqdn v1.0.0 // indirect
	github.com/buger/jsonparser v1.1.1
	github.com/containerd/containerd v1.4.12
	github.com/fsnotify/fsnotify v1.4.9 // indirect
	github.com/fsouza/go-dockerclient v1.7.1 // indirect
	github.com/garyburd/redigo v1.6.2
	github.com/golang/protobuf v1.5.0
	github.com/gomodule/redigo v1.8.3 // indirect
	github.com/jinzhu/inflection v1.0.0 // indirect
	github.com/magefile/mage v1.10.0 // indirect
	github.com/mitchellh/go-homedir v1.1.0
	github.com/onsi/ginkgo v1.12.1 // indirect
	github.com/onsi/gomega v1.10.0 // indirect
	github.com/opencontainers/image-spec v1.0.2
	github.com/opencontainers/runc v1.0.3
	github.com/patrickmn/go-cache v2.1.0+incompatible
	github.com/pborman/uuid v1.2.1 // indirect
	github.com/sirupsen/logrus v1.8.1
	github.com/spf13/cobra v1.1.3
	github.com/spf13/viper v1.7.1
	github.com/streadway/amqp v1.0.0
	github.com/stvp/tempredis v0.0.0-20181119212430-b82af8480203
	github.com/tiago4orion/conjure v0.0.0-20150908101743-93cb30b9d218 // indirect
	github.com/yl2chen/cidranger v1.0.2
	golang.org/x/sync v0.0.0-20201020160332-67f06af15bc9
	google.golang.org/grpc v1.27.0
	google.golang.org/protobuf v1.26.0
	gopkg.in/mgo.v2 v2.0.0-20190816093944-a6b53ec6cb22
	gopkg.in/pg.v5 v5.3.3
)
